{"text_format":"1","workbook":"xlsx","n_sheets":8,"sheets":["Points","Accueil","Inscrits","1","2","Final","Classement","Liste des Joueurs"],"not_rendered":{"charts":0,"images":2,"macros":0,"external_links":0,"defined_names":66,"comments":3,"pivot_tables":0},"unopened":[],"bounds":{"document_bytes":16777216,"sheet_cells":100000,"rows_first":2000,"rows_last":500,"rows_between":2000,"halvings":0,"cell_chars":16384,"cell_head_chars":4096},"cells_cut":0,"cells_raw":0,"read":"whole","date_system":"1900"}

{"sheet":"Points","index":0,"n_rows":37,"n_cols":4,"rows_kept":37,"cut":false,"hidden":false,"merged":[]}
["Place","R1","R2","R3"]
[1,200,142,93]
[2,180,125,79]
[3,161,109,66]
[4,161,109,66]
[5,143,94,54]
{"$rows_left_out":32}
{"sheet":"Accueil","index":1,"n_rows":310,"n_cols":7,"rows_kept":310,"cut":false,"hidden":false,"merged":[[206,3,206,6],[1,2,1,6],[15,2,15,6],[205,3,205,6]]}
["F"]
["A",null,"INFOS UTILES POUR CE TOURNOI"]
[0]
[1,null,"LIGUE","Auvergne-Rhône-Alpes",null,"SAISON","2018/2019"]
[2]
[3,null,"DATE","2019-03-17",null,"TOURNOI","N°3"]
{"$rows_left_out":305}
{"sheet":"Inscrits","index":2,"n_rows":42,"n_cols":12,"rows_kept":42,"cut":false,"hidden":false,"merged":[[0,11,1,11],[8,11,9,11],[16,11,18,11],[25,11,26,11]]}
["N° Tirage","Nom du Joueur","Classement","Club","N° Licence","Forfait\nNon Excusé","Forfait\nExcusé","Abandon",1,"X",null,1]
[1,{"$f":"IFERROR(VLOOKUP(E2,'Liste des Joueurs'!A:C,2,FALSE),\"En Cours\")","v":"MOREIRA ALBERTO"},1,{"$f":"IFERROR(VLOOKUP(E2,'Liste des Joueurs'!A:C,3,FALSE),\"En Cours\")","v":"VEYRE-MONTON BILLARD CLUB"},"159263M",null,null,null,2,"-"]
[2,{"$f":"IFERROR(VLOOKUP(E3,'Liste des Joueurs'!A:C,2,FALSE),\"En Cours\")","v":"JACOBERGER FABIEN"},2,{"$f":"IFERROR(VLOOKUP(E3,'Liste des Joueurs'!A:C,3,FALSE),\"En Cours\")","v":"BILLARD CLUB VICHY"},"119290C",null,null,null,3]
[3,{"$f":"IFERROR(VLOOKUP(E4,'Liste des Joueurs'!A:C,2,FALSE),\"En Cours\")","v":"VIRGA JOEL"},3,{"$f":"IFERROR(VLOOKUP(E4,'Liste des Joueurs'!A:C,3,FALSE),\"En Cours\")","v":"VEYRE-MONTON BILLARD CLUB"},"123367X",null,null,null,4]
[4,{"$f":"IFERROR(VLOOKUP(E5,'Liste des Joueurs'!A:C,2,FALSE),\"En Cours\")","v":"PRAL LAURENT"},4,{"$f":"IFERROR(VLOOKUP(E5,'Liste des Joueurs'!A:C,3,FALSE),\"En Cours\")","v":"VEYRE-MONTON BILLARD CLUB"},"101033X",null,null,null,5]
[5,{"$f":"IFERROR(VLOOKUP(E6,'Liste des Joueurs'!A:C,2,FALSE),\"En Cours\")","v":"CUBIZOLLES ALAIN"},5,{"$f":"IFERROR(VLOOKUP(E6,'Liste des Joueurs'!A:C,3,FALSE),\"En Cours\")","v":"VEYRE-MONTON BILLARD CLUB"},"122400S",null,null,null,6]
{"$rows_left_out":37}
{"sheet":"1","index":3,"n_rows":21,"n_cols":45,"rows_kept":21,"cut":false,"hidden":false,"merged":[[20,9,20,17],[12,1,12,2],[0,9,0,17],[1,42,1,45],[11,42,11,45],[10,20,10,21]]}
[null,null,null,null,null,null,null,null,null,{"$f":"\"(MATCHS EN \"&Accueil!D18&\" GAGNANTES COTE GAGNANTS) \"","v":"(MATCHS EN 3 GAGNANTES COTE GAGNANTS) "}]
[null,null,null,null,null,null,null,null,null,null,null,null,null,null,null,null,null,null,null,null,null,null,null,null,null,null,null,null,null,null,null,null,null,null,null,null,null,null,null,null,null,null,"QUALIFIES"]
[null,null,null,null,null,null,null,null,null,null,"P1",1,{"$f":"IF(IF(ISNA(VLOOKUP(L3,Inscrits!$A$2:$C$33,2,FALSE)),\"\",VLOOKUP(L3,Inscrits!$A$2:$C$33,2,FALSE))=0,\"\",IF(ISNA(VLOOKUP(L3,Inscrits!$A$2:$C$33,2,FALSE)),\"\",VLOOKUP(L3,Inscrits!$A$2:$C$33,2,FALSE)))","v":"MOREIRA ALBERTO"},{"$f":"IF(IF(ISNA(VLOOKUP(L3,Inscrits!$A$2:$C$33,3,FALSE)),\"\",\"(\"&(VLOOKUP(L3,Inscrits!$A$2:$C$33,3,FALSE))&\")\")=\"()\",\"\",IF(ISNA(VLOOKUP(L3,Inscrits!$A$2:$C$33,3,FALSE)),\"\",\"(\"&(VLOOKUP(L3,Inscrits!$A$2:$C$33,3,FALSE))&\")\"))","v":"(1)"},null,null,"G1",null,null,null,null,null,null,null,null,null,null,null,"G","P","G","P","G","P","G","P","G","P","G","P","Ga",null,null,"NOM","Ga"]
[null,null,null,null,null,null,null,null,"F",{"$f":"IF(OR(AND(O3=\"F\",O5=\"F\"),AND(O3=\"A\",O5=\"A\")),M5,IF(OR(O3=\"F\",O3=\"A\"),M3,IF(OR(O5=\"F\",O5=\"A\"),M5,IF(O3=O5,\"\",(IF(O3<O5,M3,M5))))))","v":"En Cours"},{"$f":"IF(OR(AND(O3=\"F\",O5=\"F\"),AND(O3=\"A\",O5=\"A\")),N5,IF(OR(O3=\"F\",O3=\"A\"),N3,IF(OR(O5=\"F\",O5=\"A\"),N5,IF(O3=O5,\"\",(IF(O3<O5,N3,N5))))))","v":""},null,"Match 1 - Billard",null,null,null,{"$f":"IF(OR(AND(O3=\"F\",O5=\"F\"),AND(O3=\"A\",O5=\"A\")),M3,IF(OR(O3=\"F\",O3=\"A\"),M5,IF(OR(O5=\"F\",O5=\"A\"),M3,IF(O3=O5,\"\",(IF(O3>O5,M3,M5))))))","v":"MOREIRA ALBERTO"},{"$f":"IF(OR(AND(O3=\"F\",O5=\"F\"),AND(O3=\"A\",O5=\"A\")),N3,IF(OR(O3=\"F\",O3=\"A\"),N5,IF(OR(O5=\"F\",O5=\"A\"),N3,IF(O3=O5,\"\",(IF(O3>O5,N3,N5))))))","v":"(1)"},null,null,null,null,null,null,1,{"$f":"IF(U6=\"\",\"\",IF(U6=Q4,Q4,Q8))","v":""},null,{"$f":"M3","v":"MOREIRA ALBERTO"},{"$f":"IF(AB4=M3,IF(O5=\"F\",\"\",O3),0)","v":""},{"$f":"IF(AB4=M3,IF(O3=\"F\",\"\",O5),0)","v":"F"},{"$f":"IF(AB4=Q4,IF(S8=\"F\",\"\",S4),0)","v":0},{"$f":"IF(AB4=Q4,IF(S4=\"F\",\"\",S8),0)","v":0},{"$f":"IF(AB4=J4,IF(I8=\"F\",\"\",I4),0)","v":0},{"$f":"IF(AB4=J4,IF(I4=\"F\",\"\",I8),0)","v":0},{"$f":"IF(AB4=F6,IF(E10=\"F\",\"\",E6),0)","v":0},{"$f":"IF(AB4=F6,IF(E6=\"F\",\"\",E10),0)","v":0},{"$f":"IF(AB4=F20,IF(E16=\"F\",\"\",E20),0)","v":0},{"$f":"IF(AB4=F20,IF(E20=\"F\",\"\",E16),0)","v":0},{"$f":"SUM(AC4,AE4,AG4,AI4,AK4)","v":0},0,{"$f":"AM4-AN4","v":0},null,null,{"$f":"Z4","v":""},{"$f":"IF(AR4=\"\",\"\",(VLOOKUP(AR4,AB4:AO17,14,FALSE)))","v":""}]
[null,null,null,null,null,null,"G7",null,null,null,null,16,{"$f":"IF(IF(ISNA(VLOOKUP(L5,Inscrits!$A$2:$C$33,2,FALSE)),\"\",VLOOKUP(L5,Inscrits!$A$2:$C$33,2,FALSE))=0,\"\",IF(ISNA(VLOOKUP(L5,Inscrits!$A$2:$C$33,2,FALSE)),\"\",VLOOKUP(L5,Inscrits!$A$2:$C$33,2,FALSE)))","v":"En Cours"},{"$f":"IF(IF(ISNA(VLOOKUP(L5,Inscrits!$A$2:$C$33,3,FALSE)),\"\",\"(\"&(VLOOKUP(L5,Inscrits!$A$2:$C$33,3,FALSE))&\")\")=\"()\",\"\",IF(ISNA(VLOOKUP(L5,Inscrits!$A$2:$C$33,3,FALSE)),\"\",\"(\"&(VLOOKUP(L5,Inscrits!$A$2:$C$33,3,FALSE))&\")\"))","v":""},"F",null,null,null,null,null,"G5",null,null,null,3,{"$f":"IF(B8=\"\",\"\",IF(B8=F6,F6,F10))","v":""},null,{"$f":"M5","v":"En Cours"},{"$f":"IF(AB5=M5,IF(O3=\"F\",\"\",O5),0)","v":"F"},{"$f":"IF(AB5=M5,IF(O5=\"F\",\"\",O3),0)","v":""},{"$f":"IF(AB5=Q4,IF(S8=\"F\",\"\",S4),0)","v":0},{"$f":"IF(AB5=Q4,IF(S4=\"F\",\"\",S8),0)","v":0},{"$f":"IF(AB5=J4,IF(I8=\"F\",\"\",I4),0)","v":"F"},{"$f":"IF(AB5=J4,IF(I4=\"F\",\"\",I8),0)","v":""},{"$f":"IF(AB5=F6,IF(E10=\"F\",\"\",E6),0)","v":0},{"$f":"IF(AB5=F6,IF(E6=\"F\",\"\",E10),0)","v":0},{"$f":"IF(AB5=F20,IF(E16=\"F\",\"\",E20),0)","v":0},{"$f":"IF(AB5=F20,IF(E20=\"F\",\"\",E16),0)","v":0},0,0,{"$f":"AM5-AN5","v":0},null,null,{"$f":"Z14","v":""},{"$f":"IF(AR5=\"\",\"\",(VLOOKUP(AR5,AB4:AO17,14,FALSE)))","v":""}]
[null,null,null,null,null,{"$f":"IF(OR(I4=\"F\",I4=\"A\"),J8,IF(OR(I8=\"F\",I8=\"A\"),J4,IF(I4=I8,\"\",(IF(I4>I8,J4,J8)))))","v":""},{"$f":"IF(OR(I4=\"F\",I4=\"A\"),K8,IF(OR(I8=\"F\",I8=\"A\"),K4,IF(I4=I8,\"\",(IF(I4>I8,K4,K8)))))","v":""},null,null,"Match 7 - Billard",null,null,null,null,null,null,"Match 5 - Billard",null,null,null,{"$f":"IF(OR(S4=\"F\",S4=\"A\"),Q8,IF(OR(S8=\"F\",S8=\"A\"),Q4,IF(S4=S8,\"\",(IF(S4>S8,Q4,Q8)))))","v":""},{"$f":"IF(OR(S4=\"F\",S4=\"A\"),R8,IF(OR(S8=\"F\",S8=\"A\"),R4,IF(S4=S8,\"\",(IF(S4>S8,R4,R8)))))","v":""},"A",null,5,{"$f":"IF(B8=\"\",\"\",IF(B8=F6,F10,F6))","v":""},null,{"$f":"M7","v":"DEPUYDT EDDY"},{"$f":"IF(AB6=M7,IF(O9=\"F\",\"\",O7),0)","v":0},{"$f":"IF(AB6=M7,IF(O7=\"F\",\"\",O9),0)","v":0},{"$f":"IF(AB6=Q8,IF(S4=\"F\",\"\",S8),0)","v":0},{"$f":"IF(AB6=Q8,IF(S8=\"F\",\"\",S4),0)","v":0},{"$f":"IF(AB6=J8,IF(I4=\"F\",\"\",I8),0)","v":0},{"$f":"IF(AB6=J8,IF(I8=\"F\",\"\",I4),0)","v":0},{"$f":"IF(AB6=F6,IF(E10=\"F\",\"\",E6),0)","v":0},{"$f":"IF(AB6=F6,IF(E6=\"F\",\"\",E10),0)","v":0},{"$f":"IF(AB6=F20,IF(E16=\"F\",\"\",E20),0)","v":0},{"$f":"IF(AB6=F20,IF(E20=\"F\",\"\",E16),0)","v":0},0,0,{"$f":"AM6-AN6","v":0},null,null,{"$f":"Z5","v":""},{"$f":"IF(AR6=\"\",\"\",(VLOOKUP(AR6,AB4:AO17,14,FALSE)))","v":""}]
{"$rows_left_out":16}
{"sheet":"2","index":4,"n_rows":21,"n_cols":45,"rows_kept":21,"cut":false,"hidden":false,"merged":[[20,9,20,17],[0,9,0,17],[12,1,12,2],[10,20,10,21],[1,42,1,45],[11,42,11,45]]}
[null,null,null,null,null,null,null,null,null,{"$f":"\"(MATCHS EN \"&Accueil!D18&\" GAGNANTES COTE GAGNANTS) \"","v":"(MATCHS EN 3 GAGNANTES COTE GAGNANTS) "}]
[null,null,null,null,null,null,null,null,null,null,null,null,null,null,null,null,null,null,null,null,null,null,null,null,null,null,null,null,null,null,null,null,null,null,null,null,null,null,null,null,null,null,"QUALIFIES"]
[null,null,null,null,null,null,null,null,null,null,"P1",3,{"$f":"IF(IF(ISNA(VLOOKUP(L3,Inscrits!$A$2:$C$33,2,FALSE)),\"\",VLOOKUP(L3,Inscrits!$A$2:$C$33,2,FALSE))=0,\"\",IF(ISNA(VLOOKUP(L3,Inscrits!$A$2:$C$33,2,FALSE)),\"\",VLOOKUP(L3,Inscrits!$A$2:$C$33,2,FALSE)))","v":"VIRGA JOEL"},{"$f":"IF(IF(ISNA(VLOOKUP(L3,Inscrits!$A$2:$C$33,3,FALSE)),\"\",\"(\"&(VLOOKUP(L3,Inscrits!$A$2:$C$33,3,FALSE))&\")\")=\"()\",\"\",IF(ISNA(VLOOKUP(L3,Inscrits!$A$2:$C$33,3,FALSE)),\"\",\"(\"&(VLOOKUP(L3,Inscrits!$A$2:$C$33,3,FALSE))&\")\"))","v":"(3)"},null,null,"G1",null,null,null,null,null,null,null,null,null,null,null,"G","P","G","P","G","P","G","P","G","P","G","P","Ga",null,null,"NOM","Ga"]
[null,null,null,null,null,null,null,null,null,{"$f":"IF(OR(AND(O3=\"F\",O5=\"F\"),AND(O3=\"A\",O5=\"A\")),M5,IF(OR(O3=\"F\",O3=\"A\"),M3,IF(OR(O5=\"F\",O5=\"A\"),M5,IF(O3=O5,\"\",(IF(O3<O5,M3,M5))))))","v":""},{"$f":"IF(OR(AND(O3=\"F\",O5=\"F\"),AND(O3=\"A\",O5=\"A\")),N5,IF(OR(O3=\"F\",O3=\"A\"),N3,IF(OR(O5=\"F\",O5=\"A\"),N5,IF(O3=O5,\"\",(IF(O3<O5,N3,N5))))))","v":""},null,"Match 1 - Billard",null,null,null,{"$f":"IF(OR(AND(O3=\"F\",O5=\"F\"),AND(O3=\"A\",O5=\"A\")),M3,IF(OR(O3=\"F\",O3=\"A\"),M5,IF(OR(O5=\"F\",O5=\"A\"),M3,IF(O3=O5,\"\",(IF(O3>O5,M3,M5))))))","v":""},{"$f":"IF(OR(AND(O3=\"F\",O5=\"F\"),AND(O3=\"A\",O5=\"A\")),N3,IF(OR(O3=\"F\",O3=\"A\"),N5,IF(OR(O5=\"F\",O5=\"A\"),N3,IF(O3=O5,\"\",(IF(O3>O5,N3,N5))))))","v":""},null,null,null,null,null,null,1,{"$f":"IF(U6=\"\",\"\",IF(U6=Q4,Q4,Q8))","v":""},null,{"$f":"M3","v":"VIRGA JOEL"},{"$f":"IF(AB4=M3,IF(O5=\"F\",\"\",O3),0)","v":0},{"$f":"IF(AB4=M3,IF(O3=\"F\",\"\",O5),0)","v":0},{"$f":"IF(AB4=Q4,IF(S8=\"F\",\"\",S4),0)","v":0},{"$f":"IF(AB4=Q4,IF(S4=\"F\",\"\",S8),0)","v":0},{"$f":"IF(AB4=J4,IF(I8=\"F\",\"\",I4),0)","v":0},{"$f":"IF(AB4=J4,IF(I4=\"F\",\"\",I8),0)","v":0},{"$f":"IF(AB4=F6,IF(E10=\"F\",\"\",E6),0)","v":0},{"$f":"IF(AB4=F6,IF(E6=\"F\",\"\",E10),0)","v":0},{"$f":"IF(AB4=F20,IF(E16=\"F\",\"\",E20),0)","v":0},{"$f":"IF(AB4=F20,IF(E20=\"F\",\"\",E16),0)","v":0},{"$f":"SUM(AC4,AE4,AG4,AI4,AK4)","v":0},0,{"$f":"AM4-AN4","v":0},null,null,{"$f":"Z4","v":""},{"$f":"IF(AR4=\"\",\"\",(VLOOKUP(AR4,AB4:AO17,14,FALSE)))","v":""}]
[null,null,null,null,null,null,"G7",null,null,null,null,14,{"$f":"IF(IF(ISNA(VLOOKUP(L5,Inscrits!$A$2:$C$33,2,FALSE)),\"\",VLOOKUP(L5,Inscrits!$A$2:$C$33,2,FALSE))=0,\"\",IF(ISNA(VLOOKUP(L5,Inscrits!$A$2:$C$33,2,FALSE)),\"\",VLOOKUP(L5,Inscrits!$A$2:$C$33,2,FALSE)))","v":"LEBRE PHILIPPE"},{"$f":"IF(IF(ISNA(VLOOKUP(L5,Inscrits!$A$2:$C$33,3,FALSE)),\"\",\"(\"&(VLOOKUP(L5,Inscrits!$A$2:$C$33,3,FALSE))&\")\")=\"()\",\"\",IF(ISNA(VLOOKUP(L5,Inscrits!$A$2:$C$33,3,FALSE)),\"\",\"(\"&(VLOOKUP(L5,Inscrits!$A$2:$C$33,3,FALSE))&\")\"))","v":"(17)"},null,null,null,null,null,null,"G5",null,null,null,3,{"$f":"IF(B8=\"\",\"\",IF(B8=F6,F6,F10))","v":""},null,{"$f":"M5","v":"LEBRE PHILIPPE"},{"$f":"IF(AB5=M5,IF(O3=\"F\",\"\",O5),0)","v":0},{"$f":"IF(AB5=M5,IF(O5=\"F\",\"\",O3),0)","v":0},{"$f":"IF(AB5=Q4,IF(S8=\"F\",\"\",S4),0)","v":0},{"$f":"IF(AB5=Q4,IF(S4=\"F\",\"\",S8),0)","v":0},{"$f":"IF(AB5=J4,IF(I8=\"F\",\"\",I4),0)","v":0},{"$f":"IF(AB5=J4,IF(I4=\"F\",\"\",I8),0)","v":0},{"$f":"IF(AB5=F6,IF(E10=\"F\",\"\",E6),0)","v":0},{"$f":"IF(AB5=F6,IF(E6=\"F\",\"\",E10),0)","v":0},{"$f":"IF(AB5=F20,IF(E16=\"F\",\"\",E20),0)","v":0},{"$f":"IF(AB5=F20,IF(E20=\"F\",\"\",E16),0)","v":0},0,0,{"$f":"AM5-AN5","v":0},null,null,{"$f":"Z14","v":""},{"$f":"IF(AR5=\"\",\"\",(VLOOKUP(AR5,AB4:AO17,14,FALSE)))","v":""}]
[null,null,null,null,null,{"$f":"IF(OR(I4=\"F\",I4=\"A\"),J8,IF(OR(I8=\"F\",I8=\"A\"),J4,IF(I4=I8,\"\",(IF(I4>I8,J4,J8)))))","v":""},{"$f":"IF(OR(I4=\"F\",I4=\"A\"),K8,IF(OR(I8=\"F\",I8=\"A\"),K4,IF(I4=I8,\"\",(IF(I4>I8,K4,K8)))))","v":""},null,null,"Match 7 - Billard",null,null,null,null,null,null,"Match 5 - Billard",null,null,null,{"$f":"IF(OR(S4=\"F\",S4=\"A\"),Q8,IF(OR(S8=\"F\",S8=\"A\"),Q4,IF(S4=S8,\"\",(IF(S4>S8,Q4,Q8)))))","v":""},{"$f":"IF(OR(S4=\"F\",S4=\"A\"),R8,IF(OR(S8=\"F\",S8=\"A\"),R4,IF(S4=S8,\"\",(IF(S4>S8,R4,R8)))))","v":""},"C",null,5,{"$f":"IF(B8=\"\",\"\",IF(B8=F6,F10,F6))","v":""},null,{"$f":"M7","v":"VIGUIER FRANCK"},{"$f":"IF(AB6=M7,IF(O9=\"F\",\"\",O7),0)","v":0},{"$f":"IF(AB6=M7,IF(O7=\"F\",\"\",O9),0)","v":0},{"$f":"IF(AB6=Q8,IF(S4=\"F\",\"\",S8),0)","v":0},{"$f":"IF(AB6=Q8,IF(S8=\"F\",\"\",S4),0)","v":0},{"$f":"IF(AB6=J8,IF(I4=\"F\",\"\",I8),0)","v":0},{"$f":"IF(AB6=J8,IF(I8=\"F\",\"\",I4),0)","v":0},{"$f":"IF(AB6=F6,IF(E10=\"F\",\"\",E6),0)","v":0},{"$f":"IF(AB6=F6,IF(E6=\"F\",\"\",E10),0)","v":0},{"$f":"IF(AB6=F20,IF(E16=\"F\",\"\",E20),0)","v":0},{"$f":"IF(AB6=F20,IF(E20=\"F\",\"\",E16),0)","v":0},0,0,{"$f":"AM6-AN6","v":0},null,null,{"$f":"Z5","v":""},{"$f":"IF(AR6=\"\",\"\",(VLOOKUP(AR6,AB4:AO17,14,FALSE)))","v":""}]
{"$rows_left_out":16}
{"sheet":"Final","index":5,"n_rows":27,"n_cols":31,"rows_kept":27,"cut":false,"hidden":false,"merged":[[1,1,1,3],[1,5,1,7],[1,9,1,11],[0,9,0,11],[0,5,0,7],[0,1,0,3]]}
[null,"1/4 de finale",null,null,null,"1/2 finale",null,null,null,"Finale"]
[null,{"$f":"\"(\"&Accueil!G20&\" manches gagnantes)\"","v":"(4 manches gagnantes)"},null,null,null,{"$f":"\"(\"&Accueil!D22&\" manches gagnantes)\"","v":"(4 manches gagnantes)"},null,null,null,{"$f":"\"(\"&Accueil!G22&\" manches gagnantes)\"","v":"(5 manches gagnantes)"}]
[null,null,null,null,null,null,null,null,null,null,null,null,null,null,null,null,null,"JOUEURS","1/8","1/4","1/2","Finale","GA Final",null,"JOUEURS","GA Poules",null,"JOUEURS","GA Poules","GA Final","GA TOTAL"]
[null,null,null,null,null,null,null,null,null,null,null,null,null,null,null,null,null,{"$f":"B5","v":""},null,{"$f":"IF(AND(D5=\"A\",D7=\"A\"),0,IF(D5=\"A\",-D7,IF(D7=\"A\",D5,D5-D7)))","v":0},{"$f":"IF(F6=R4,IF(AND(H6=\"A\",H12=\"A\"),0,IF(OR(T4>0,D7=\"A\"),IF(H6=\"A\",-H12,IF(H12=\"A\",H6,H6-H12)),0)),0)","v":0},{"$f":"IF(J9=R4,IF(AND(L9=\"A\",L21=\"A\"),0,IF(OR(U4>0,H12=\"A\"),IF(L9=\"A\",-L21,IF(L21=\"A\",L9,L9-L21)),0)),0)","v":0},{"$f":"SUM(S4:V4)","v":0},null,{"$f":"'1'!AR4","v":""},{"$f":"'1'!AS4","v":""},null,{"$f":"IF(Inscrits!B2=0,\"\",Inscrits!B2)","v":"MOREIRA ALBERTO"},{"$f":"VLOOKUP(AB4,$Y$4:$Z$35,2,FALSE)","v":{"$error":"#N/A"}},{"$f":"VLOOKUP(AB4,$R$4:$W$35,6,FALSE)","v":{"$error":"#N/A"}},{"$f":"AC4+AD4","v":{"$error":"#N/A"}}]
["A",{"$f":"IF('1'!U6=0,\"\",'1'!U6)","v":""},{"$f":"IF('1'!V6=0,\"\",'1'!V6)","v":""},null,null,null,null,null,null,null,null,null,null,null,null,null,null,null,null,null,null,null,null,null,{"$f":"'1'!AR5","v":""},{"$f":"'1'!AS5","v":""},null,{"$f":"IF(Inscrits!B3=0,\"\",Inscrits!B3)","v":"JACOBERGER FABIEN"},{"$f":"VLOOKUP(AB5,$Y$4:$Z$35,2,FALSE)","v":{"$error":"#N/A"}},{"$f":"VLOOKUP(AB5,$R$4:$W$35,6,FALSE)","v":{"$error":"#N/A"}},{"$error":"#N/A"}]
[null,"Match 1 - Billard",null,null,null,{"$f":"IF(AND(D5=\"A\",D7=\"A\"),B5,IF(D5=\"A\",B7,IF(D7=\"A\",B5,IF(D5=D7,\"\",(IF(D5>D7,B5,B7))))))","v":""},{"$f":"IF(AND(D5=\"A\",D7=\"A\"),C5,IF(D5=\"A\",C7,IF(D7=\"A\",C5,IF(D5=D7,\"\",(IF(D5>D7,C5,C7))))))","v":""},null,null,null,null,null,null,null,null,null,null,{"$f":"B7","v":""},null,{"$f":"IF(AND(D5=\"A\",D7=\"A\"),0,IF(D7=\"A\",-D5,IF(D5=\"A\",D7,D7-D5)))","v":0},{"$f":"IF(F6=R6,IF(AND(H6=\"A\",H12=\"A\"),0,IF(OR(T6>0,D5=\"A\"),IF(H6=\"A\",-H12,IF(H12=\"A\",H6,H6-H12)),0)),0)","v":0},{"$f":"IF(J9=R6,IF(AND(L9=\"A\",L21=\"A\"),0,IF(OR(U6>0,H12=\"A\"),IF(L9=\"A\",-L21,IF(L21=\"A\",L9,L9-L21)),0)),0)","v":0},{"$f":"SUM(S6:V6)","v":0},null,{"$f":"'1'!AR6","v":""},{"$f":"'1'!AS6","v":""},null,{"$f":"IF(Inscrits!B4=0,\"\",Inscrits!B4)","v":"VIRGA JOEL"},{"$error":"#N/A"},{"$error":"#N/A"},{"$error":"#N/A"}]
{"$rows_left_out":22}
{"sheet":"Classement","index":6,"n_rows":17,"n_cols":13,"rows_kept":17,"cut":false,"hidden":false,"merged":[]}
[null,null,"Formules Initiales","Nom & Prénom","Place","Points","GA","CF","RF","Club","Ville","Licence","Division"]
[null,null,1,{"$f":"Final!N15","v":""},null,{"$f":"IF(ISNA(IF(LEFT(Division,2)=\"R1\",VLOOKUP(E2,Points!$A$2:$D$20,2,FALSE),IF(LEFT(Division,2)=\"R2\",VLOOKUP(E2,Points!$A$2:$D$20,3,FALSE),IF(LEFT(Division,2)=\"R3\",VLOOKUP(E2,Points!$A$2:$D$20,4,FALSE),\"DIV ???\")))),0,IF(LEFT(Division,2)=\"R1\",VLOOKUP(E2,Points!$A$2:$D$20,2,FALSE),IF(LEFT(Division,2)=\"R2\",VLOOKUP(E2,Points!$A$2:$D$20,3,FALSE),IF(LEFT(Division,2)=\"R3\",VLOOKUP(E2,Points!$A$2:$D$20,4,FALSE),\"DIV ???\"))))","v":0},{"$f":"IF(ISERROR(VLOOKUP(D2,Final!$AB$4:$AE$35,4,FALSE)),\"\",VLOOKUP(D2,Final!$AB$4:$AE$35,4,FALSE))","v":""},null,null,{"$f":"IF(ISNA(VLOOKUP(D2,Inscrits!B:F,3,FALSE)),\"\",VLOOKUP(D2,Inscrits!B:F,3,FALSE))","v":""},{"$f":"IF(ISNA(VLOOKUP(D2,Inscrits!B:F,4,FALSE)),\"\",VLOOKUP(D2,Inscrits!B:F,4,FALSE))","v":""},{"$f":"IF(ISNA(VLOOKUP(D2,Inscrits!B:F,5,FALSE)),\"\",VLOOKUP(D2,Inscrits!B:F,5,FALSE))","v":""},{"$f":"IF(NB_JOUEURS_UP>0,IF(LEN(Division)=2,\"R\"&RIGHT(Division,1)-1&\"\",IF(LEN(Division)=3,IF(RIGHT(LEFT(Division,2),1)=\"2\",\"R1\",IF(Nb_R2=1,\"R2\",\"R\"&RIGHT(LEFT(Division,2),1)-1&\"\"&RIGHT(Division,1)&\"\")),IF(LEN(Division)=4,IF(RIGHT(LEFT(Division,2),1)=\"2\",\"R1\",\"R\"&RIGHT(LEFT(Division,2),1)-1&\"\"&RIGHT(LEFT(Division,3),1)&\"\"),\"?\"))),Division)","v":"R1"}]
[null,null,2,{"$f":"IF(Final!L21=\"A\",Final!J21,IF(Final!L9=\"A\",Final!J9,IF(Final!L9<Final!L21,Final!J9,Final!J21)))","v":""},null,{"$f":"IF(ISNA(IF(LEFT(Division,2)=\"R1\",VLOOKUP(E3,Points!$A$2:$D$20,2,FALSE),IF(LEFT(Division,2)=\"R2\",VLOOKUP(E3,Points!$A$2:$D$20,3,FALSE),IF(LEFT(Division,2)=\"R3\",VLOOKUP(E3,Points!$A$2:$D$20,4,FALSE),\"DIV ???\")))),0,IF(LEFT(Division,2)=\"R1\",VLOOKUP(E3,Points!$A$2:$D$20,2,FALSE),IF(LEFT(Division,2)=\"R2\",VLOOKUP(E3,Points!$A$2:$D$20,3,FALSE),IF(LEFT(Division,2)=\"R3\",VLOOKUP(E3,Points!$A$2:$D$20,4,FALSE),\"DIV ???\"))))","v":0},{"$f":"IF(ISERROR(VLOOKUP(D3,Final!$AB$4:$AE$35,4,FALSE)),\"\",VLOOKUP(D3,Final!$AB$4:$AE$35,4,FALSE))","v":""},null,null,{"$f":"IF(ISNA(VLOOKUP(D3,Inscrits!B:F,3,FALSE)),\"\",VLOOKUP(D3,Inscrits!B:F,3,FALSE))","v":""},{"$f":"IF(ISNA(VLOOKUP(D3,Inscrits!B:F,4,FALSE)),\"\",VLOOKUP(D3,Inscrits!B:F,4,FALSE))","v":""},{"$f":"IF(ISNA(VLOOKUP(D3,Inscrits!B:F,5,FALSE)),\"\",VLOOKUP(D3,Inscrits!B:F,5,FALSE))","v":""},{"$f":"IF(NB_JOUEURS_UP>1,IF(LEN(Division)=2,\"R\"&RIGHT(Division,1)-1&\"\",IF(LEN(Division)=3,IF(RIGHT(LEFT(Division,2),1)=\"2\",\"R1\",IF(Nb_R2=1,\"R2\",\"R\"&RIGHT(LEFT(Division,2),1)-1&\"\"&RIGHT(Division,1)&\"\")),IF(LEN(Division)=4,IF(RIGHT(LEFT(Division,2),1)=\"2\",\"R1\",\"R\"&RIGHT(LEFT(Division,2),1)-1&\"\"&RIGHT(LEFT(Division,3),1)&\"\"),\"?\"))),Division)","v":"R1"}]
[null,null,4,{"$f":"IF(Final!H24=\"A\",Final!F24,IF(Final!H18=\"A\",Final!F18,IF(Final!H18<Final!H24,Final!F18,Final!F24)))","v":""},null,{"$f":"IF(ISNA(IF(LEFT(Division,2)=\"R1\",VLOOKUP(E4,Points!$A$2:$D$20,2,FALSE),IF(LEFT(Division,2)=\"R2\",VLOOKUP(E4,Points!$A$2:$D$20,3,FALSE),IF(LEFT(Division,2)=\"R3\",VLOOKUP(E4,Points!$A$2:$D$20,4,FALSE),\"DIV ???\")))),0,IF(LEFT(Division,2)=\"R1\",VLOOKUP(E4,Points!$A$2:$D$20,2,FALSE),IF(LEFT(Division,2)=\"R2\",VLOOKUP(E4,Points!$A$2:$D$20,3,FALSE),IF(LEFT(Division,2)=\"R3\",VLOOKUP(E4,Points!$A$2:$D$20,4,FALSE),\"DIV ???\"))))","v":0},{"$f":"IF(ISERROR(VLOOKUP(D4,Final!$AB$4:$AE$35,4,FALSE)),\"\",VLOOKUP(D4,Final!$AB$4:$AE$35,4,FALSE))","v":""},null,null,{"$f":"IF(ISNA(VLOOKUP(D4,Inscrits!B:F,3,FALSE)),\"\",VLOOKUP(D4,Inscrits!B:F,3,FALSE))","v":""},{"$f":"IF(ISNA(VLOOKUP(D4,Inscrits!B:F,4,FALSE)),\"\",VLOOKUP(D4,Inscrits!B:F,4,FALSE))","v":""},{"$f":"IF(ISNA(VLOOKUP(D4,Inscrits!B:F,5,FALSE)),\"\",VLOOKUP(D4,Inscrits!B:F,5,FALSE))","v":""},{"$f":"IF(NB_JOUEURS_UP>2,IF(LEN(Division)=2,\"R\"&RIGHT(Division,1)-1&\"\",IF(LEN(Division)=3,IF(RIGHT(LEFT(Division,2),1)=\"2\",\"R1\",IF(Nb_R2=1,\"R2\",\"R\"&RIGHT(LEFT(Division,2),1)-1&\"\"&RIGHT(Division,1)&\"\")),IF(LEN(Division)=4,IF(RIGHT(LEFT(Division,2),1)=\"2\",\"R1\",\"R\"&RIGHT(LEFT(Division,2),1)-1&\"\"&RIGHT(LEFT(Division,3),1)&\"\"),\"?\"))),Division)","v":"R1"}]
[null,null,3,{"$f":"IF(Final!H12=\"A\",Final!F12,IF(Final!H6=\"A\",Final!F6,IF(Final!H6<Final!H12,Final!F6,Final!F12)))","v":""},null,{"$f":"IF(ISNA(IF(LEFT(Division,2)=\"R1\",VLOOKUP(E5,Points!$A$2:$D$20,2,FALSE),IF(LEFT(Division,2)=\"R2\",VLOOKUP(E5,Points!$A$2:$D$20,3,FALSE),IF(LEFT(Division,2)=\"R3\",VLOOKUP(E5,Points!$A$2:$D$20,4,FALSE),\"DIV ???\")))),0,IF(LEFT(Division,2)=\"R1\",VLOOKUP(E5,Points!$A$2:$D$20,2,FALSE),IF(LEFT(Division,2)=\"R2\",VLOOKUP(E5,Points!$A$2:$D$20,3,FALSE),IF(LEFT(Division,2)=\"R3\",VLOOKUP(E5,Points!$A$2:$D$20,4,FALSE),\"DIV ???\"))))","v":0},{"$f":"IF(ISERROR(VLOOKUP(D5,Final!$AB$4:$AE$35,4,FALSE)),\"\",VLOOKUP(D5,Final!$AB$4:$AE$35,4,FALSE))","v":""},null,null,{"$f":"IF(ISNA(VLOOKUP(D5,Inscrits!B:F,3,FALSE)),\"\",VLOOKUP(D5,Inscrits!B:F,3,FALSE))","v":""},{"$f":"IF(ISNA(VLOOKUP(D5,Inscrits!B:F,4,FALSE)),\"\",VLOOKUP(D5,Inscrits!B:F,4,FALSE))","v":""},{"$f":"IF(ISNA(VLOOKUP(D5,Inscrits!B:F,5,FALSE)),\"\",VLOOKUP(D5,Inscrits!B:F,5,FALSE))","v":""},{"$f":"IF(NB_JOUEURS_UP>3,IF(LEN(Division)=2,\"R\"&RIGHT(Division,1)-1&\"\",IF(LEN(Division)=3,IF(RIGHT(LEFT(Division,2),1)=\"2\",\"R1\",IF(Nb_R2=1,\"R2\",\"R\"&RIGHT(LEFT(Division,2),1)-1&\"\"&RIGHT(Division,1)&\"\")),IF(LEN(Division)=4,IF(RIGHT(LEFT(Division,2),1)=\"2\",\"R1\",\"R\"&RIGHT(LEFT(Division,2),1)-1&\"\"&RIGHT(LEFT(Division,3),1)&\"\"),\"?\"))),Division)","v":"R1"}]
[null,null,5,{"$f":"IF(Final!D7=\"A\",Final!B7,IF(Final!D5=\"A\",Final!B5,IF(Final!D5<Final!D7,Final!B5,Final!B7)))","v":""},null,{"$f":"IF(ISNA(IF(LEFT(Division,2)=\"R1\",VLOOKUP(E6,Points!$A$2:$D$20,2,FALSE),IF(LEFT(Division,2)=\"R2\",VLOOKUP(E6,Points!$A$2:$D$20,3,FALSE),IF(LEFT(Division,2)=\"R3\",VLOOKUP(E6,Points!$A$2:$D$20,4,FALSE),\"DIV ???\")))),0,IF(LEFT(Division,2)=\"R1\",VLOOKUP(E6,Points!$A$2:$D$20,2,FALSE),IF(LEFT(Division,2)=\"R2\",VLOOKUP(E6,Points!$A$2:$D$20,3,FALSE),IF(LEFT(Division,2)=\"R3\",VLOOKUP(E6,Points!$A$2:$D$20,4,FALSE),\"DIV ???\"))))","v":0},{"$f":"IF(ISERROR(VLOOKUP(D6,Final!$AB$4:$AE$35,4,FALSE)),\"\",VLOOKUP(D6,Final!$AB$4:$AE$35,4,FALSE))","v":""},null,null,{"$f":"IF(ISNA(VLOOKUP(D6,Inscrits!B:F,3,FALSE)),\"\",VLOOKUP(D6,Inscrits!B:F,3,FALSE))","v":""},{"$f":"IF(ISNA(VLOOKUP(D6,Inscrits!B:F,4,FALSE)),\"\",VLOOKUP(D6,Inscrits!B:F,4,FALSE))","v":""},{"$f":"IF(ISNA(VLOOKUP(D6,Inscrits!B:F,5,FALSE)),\"\",VLOOKUP(D6,Inscrits!B:F,5,FALSE))","v":""},{"$f":"IF(NB_JOUEURS_UP>4,IF(LEN(Division)=2,\"R\"&RIGHT(Division,1)-1&\"\",IF(LEN(Division)=3,IF(RIGHT(LEFT(Division,2),1)=\"2\",\"R1\",IF(Nb_R2=1,\"R2\",\"R\"&RIGHT(LEFT(Division,2),1)-1&\"\"&RIGHT(Division,1)&\"\")),IF(LEN(Division)=4,IF(RIGHT(LEFT(Division,2),1)=\"2\",\"R1\",\"R\"&RIGHT(LEFT(Division,2),1)-1&\"\"&RIGHT(LEFT(Division,3),1)&\"\"),\"?\"))),Division)","v":"R1"}]
{"$rows_left_out":12}
{"sheet":"Liste des Joueurs","index":7,"n_rows":1236,"n_cols":3,"rows_kept":1236,"cut":false,"hidden":true,"merged":[]}
["Licence","Nom Prenom","Nom Club"]
["163282F","AARAB LAHOUSINE","CLUB CHAMBERIEN DE BILLARD"]
["164727B","ABBO SEBASTIAN","CLUB CHAMBERIEN DE BILLARD"]
["113202Y","ABDOULZABAR CARIME","GROUPE SPORTIF LUGDUNUM"]
["151373L","ABLONDI LAURENT","CERCLE DES CHEFS D ATELIER"]
["015873N","ABOUAF DANIEL","ACADEMIE BILLARD OUEST LYONNAIS"]
{"$rows_left_out":1230}