{"text_format":"1","workbook":"xlsx","n_sheets":7,"sheets":["Points","Accueil","Inscrits","1","Final","Classement","Feuil1"],"not_rendered":{"charts":0,"images":1,"macros":1,"external_links":0,"defined_names":66,"comments":2,"pivot_tables":0},"unopened":[],"bounds":{"document_bytes":16777216,"sheet_cells":100000,"rows_first":2000,"rows_last":500,"rows_between":2000,"halvings":0,"cell_chars":16384,"cell_head_chars":4096},"cells_cut":0,"cells_raw":0,"read":"whole","date_system":"1900"}

{"sheet":"Points","index":0,"n_rows":12,"n_cols":4,"rows_kept":12,"cut":false,"hidden":false,"merged":[]}
["Place","R1","R2","R3"]
[1,200,142,93]
[2,180,125,79]
[3,161,109,66]
[4,161,109,66]
[5,143,94,54]
[6,143,94,54]
[7,126,80,43]
[8,126,80,43]
["FNE",-50,-35,-20]
{"$rows_left_out":3}
{"sheet":"Accueil","index":1,"n_rows":128,"n_cols":7,"rows_kept":128,"cut":false,"hidden":false,"merged":[[1,2,1,6],[24,3,24,6],[25,3,25,6],[15,2,15,6]]}
["A"]
["F",null,"INFOS UTILES POUR CE TOURNOI"]
[0]
[1,null,"LIGUE","Auvrgne-Rhône-Alpes",null,"SAISON","2018/2019"]
[2]
[3,null,"DATE","2018-10-20",null,"TOURNOI","N1"]
[4]
[5,null,"CLUB","Billard Club Lyonnais 8 Pool",null,"DIVISION","R1"]
[6]
[7,null,"VILLE DU CLUB","LYON",null,"NB JOUEURS",6]
{"$rows_left_out":119}
{"sheet":"Inscrits","index":2,"n_rows":32,"n_cols":12,"rows_kept":32,"cut":false,"hidden":false,"merged":[[0,11,1,11],[8,11,9,11],[16,11,18,11],[25,11,26,11]]}
["N° Tirage","Nom du Joueur","Classement","Club","N° Licence","Forfait\nNon Excusé","Forfait\nExcusé","Abandon",1,"X",null,1]
[1,{"$f":"IFERROR(VLOOKUP(E2,Feuil1!A:C,2,FALSE),\"En Cours\")","v":"BERGNES LENNY"},1,{"$f":"IFERROR(VLOOKUP(E2,Feuil1!$A$1:$C$973,3,FALSE),\"En Cours\")","v":"BILLARD CLUB PONTOIS"},"155901H",null,"-",null,2,"-"]
[5,{"$f":"IFERROR(VLOOKUP(E3,Feuil1!A:C,2,FALSE),\"En Cours\")","v":"GELIBERT MARGAUX"},2,{"$f":"IFERROR(VLOOKUP(E3,Feuil1!$A$1:$C$973,3,FALSE),\"En Cours\")","v":"ACADEMIE DE BILLARD DE LA VALSERINE"},"159123K",null,"-",null,3]
[2,{"$f":"IFERROR(VLOOKUP(E4,Feuil1!A:C,2,FALSE),\"En Cours\")","v":"KUSAR TONY"},1,{"$f":"IFERROR(VLOOKUP(E4,Feuil1!$A$1:$C$973,3,FALSE),\"En Cours\")","v":"BILLARD CLUB DE CLARAFOND ARCINE"},"155700P",null,"-",null,4]
[6,{"$f":"IFERROR(VLOOKUP(E5,Feuil1!A:C,2,FALSE),\"En Cours\")","v":"TORNIER JORDAN"},"NC",{"$f":"IFERROR(VLOOKUP(E5,Feuil1!$A$1:$C$973,3,FALSE),\"En Cours\")","v":"BILLARD CLUB DE CLARAFOND ARCINE"},"166264X",null,"-",null,5]
[3,{"$f":"IFERROR(VLOOKUP(E6,Feuil1!A:C,2,FALSE),\"En Cours\")","v":"VALLOT ROMAIN"},1,{"$f":"IFERROR(VLOOKUP(E6,Feuil1!$A$1:$C$973,3,FALSE),\"En Cours\")","v":"BILLARD CLUB DE BOURG EN BRESSE"},"156334D",null,"-",null,6]
[4,{"$f":"IFERROR(VLOOKUP(E7,Feuil1!A:C,2,FALSE),\"En Cours\")","v":"DUPRE RAMBAUD NATAEL"},1,{"$f":"IFERROR(VLOOKUP(E7,Feuil1!$A$1:$C$973,3,FALSE),\"En Cours\")","v":"LES SQUALES"},"149436F",null,"-"]
[]
[null,null,null,null,null,null,null,null,null,null,null,2]
[]
{"$rows_left_out":23}
{"sheet":"1","index":3,"n_rows":21,"n_cols":45,"rows_kept":21,"cut":false,"hidden":false,"merged":[[20,9,20,17],[12,1,12,2],[0,9,0,17],[1,42,1,45],[11,42,11,45],[10,20,10,21]]}
[null,null,null,null,null,null,null,null,null,{"$f":"\"Match en \"&Accueil!D18&\" manches gagnantes coté gagnant\"","v":"Match en 3 manches gagnantes coté gagnant"}]
[null,null,null,null,null,null,null,null,null,null,null,null,null,null,null,null,null,null,null,null,null,null,null,null,null,null,null,null,null,null,null,null,null,null,null,null,null,null,null,null,null,null,"QUALIFIES"]
[null,null,null,null,null,null,null,null,null,null,"P1",1,{"$f":"IF(IF(ISNA(VLOOKUP(L3,Inscrits!$A$2:$C$23,2,FALSE)),\"\",VLOOKUP(L3,Inscrits!$A$2:$C$23,2,FALSE))=0,\"\",IF(ISNA(VLOOKUP(L3,Inscrits!$A$2:$C$23,2,FALSE)),\"\",VLOOKUP(L3,Inscrits!$A$2:$C$23,2,FALSE)))","v":"BERGNES LENNY"},{"$f":"IF(IF(ISNA(VLOOKUP(L3,Inscrits!$A$2:$C$23,3,FALSE)),\"\",\"(\"&(VLOOKUP(L3,Inscrits!$A$2:$C$23,3,FALSE))&\")\")=\"()\",\"\",IF(ISNA(VLOOKUP(L3,Inscrits!$A$2:$C$23,3,FALSE)),\"\",\"(\"&(VLOOKUP(L3,Inscrits!$A$2:$C$23,3,FALSE))&\")\"))","v":"(1)"},null,null,"G1",null,null,null,null,null,null,null,null,null,null,null,"G","P","G","P","G","P","G","P","G","P","G","P","Ga",null,null,"NOM","Ga"]
[null,null,null,null,null,null,null,null,null,null,null,null,"Match 1 - Billard",null,null,null,{"$f":"M3","v":"BERGNES LENNY"},{"$f":"N3","v":"(1)"},null,null,null,null,null,null,1,{"$f":"IF(U6=\"\",\"\",IF(U6=Q4,Q4,Q8))","v":""},null,{"$f":"M3","v":"BERGNES LENNY"},{"$f":"IF(AB4=M3,IF(O5=\"F\",\"\",O3),0)","v":0},{"$f":"IF(AB4=M3,IF(O3=\"F\",\"\",O5),0)","v":0},{"$f":"IF(AB4=Q4,IF(S8=\"F\",\"\",S4),0)","v":0},{"$f":"IF(AB4=Q4,IF(S4=\"F\",\"\",S8),0)","v":0},{"$f":"IF(AB4=J4,IF(I8=\"F\",\"\",I4),0)","v":0},{"$f":"IF(AB4=J4,IF(I4=\"F\",\"\",I8),0)","v":0},{"$f":"IF(AB4=F6,IF(E10=\"F\",\"\",E6),0)","v":0},{"$f":"IF(AB4=F6,IF(E6=\"F\",\"\",E10),0)","v":0},{"$f":"IF(AB4=F20,IF(E16=\"F\",\"\",E20),0)","v":0},{"$f":"IF(AB4=F20,IF(E20=\"F\",\"\",E16),0)","v":0},{"$f":"SUM(AC4,AE4,AG4,AI4,AK4)","v":0},0,{"$f":"AM4-AN4","v":0},null,null,{"$f":"Z4","v":""},{"$f":"IF(AR4=\"\",\"\",(VLOOKUP(AR4,AB4:AO17,14,FALSE)))","v":""}]
[null,null,null,null,null,null,"G7",null,null,null,null,null,null,null,null,null,null,null,null,null,"G5",null,null,null,3,{"$f":"IF(B8=\"\",\"\",IF(B8=F6,F6,F10))","v":""},null,{"$f":"M5","v":0},{"$f":"IF(AB5=M5,IF(O3=\"F\",\"\",O5),0)","v":0},{"$f":"IF(AB5=M5,IF(O5=\"F\",\"\",O3),0)","v":0},{"$f":"IF(AB5=Q4,IF(S8=\"F\",\"\",S4),0)","v":0},{"$f":"IF(AB5=Q4,IF(S4=\"F\",\"\",S8),0)","v":0},{"$f":"IF(AB5=J4,IF(I8=\"F\",\"\",I4),0)","v":0},{"$f":"IF(AB5=J4,IF(I4=\"F\",\"\",I8),0)","v":0},{"$f":"IF(AB5=F6,IF(E10=\"F\",\"\",E6),0)","v":0},{"$f":"IF(AB5=F6,IF(E6=\"F\",\"\",E10),0)","v":0},{"$f":"IF(AB5=F20,IF(E16=\"F\",\"\",E20),0)","v":0},{"$f":"IF(AB5=F20,IF(E20=\"F\",\"\",E16),0)","v":0},0,0,{"$f":"AM5-AN5","v":0},null,null,{"$f":"Z14","v":""},{"$f":"IF(AR5=\"\",\"\",(VLOOKUP(AR5,AB4:AO17,14,FALSE)))","v":""}]
[null,null,null,null,null,{"$f":"J8","v":""},{"$f":"K8","v":""},null,null,"Match 7 - Billard",null,null,null,null,null,null,"Match 5 - Billard",null,null,null,{"$f":"IF(OR(S4=\"F\",S4=\"A\"),Q8,IF(OR(S8=\"F\",S8=\"A\"),Q4,IF(S4=S8,\"\",(IF(S4>S8,Q4,Q8)))))","v":""},{"$f":"IF(OR(S4=\"F\",S4=\"A\"),R8,IF(OR(S8=\"F\",S8=\"A\"),R4,IF(S4=S8,\"\",(IF(S4>S8,R4,R8)))))","v":""},"A",null,5,{"$f":"IF(B8=\"\",\"\",IF(B8=F6,F10,F6))","v":""},null,{"$f":"M7","v":"GELIBERT MARGAUX"},{"$f":"IF(AB6=M7,IF(O9=\"F\",\"\",O7),0)","v":0},{"$f":"IF(AB6=M7,IF(O7=\"F\",\"\",O9),0)","v":0},{"$f":"IF(AB6=Q8,IF(S4=\"F\",\"\",S8),0)","v":0},{"$f":"IF(AB6=Q8,IF(S8=\"F\",\"\",S4),0)","v":0},{"$f":"IF(AB6=J8,IF(I4=\"F\",\"\",I8),0)","v":0},{"$f":"IF(AB6=J8,IF(I8=\"F\",\"\",I4),0)","v":0},{"$f":"IF(AB6=F6,IF(E10=\"F\",\"\",E6),0)","v":0},{"$f":"IF(AB6=F6,IF(E6=\"F\",\"\",E10),0)","v":0},{"$f":"IF(AB6=F20,IF(E16=\"F\",\"\",E20),0)","v":0},{"$f":"IF(AB6=F20,IF(E20=\"F\",\"\",E16),0)","v":0},0,0,{"$f":"AM6-AN6","v":0},null,null,{"$f":"Z5","v":""},{"$f":"IF(AR6=\"\",\"\",(VLOOKUP(AR6,AB4:AO17,14,FALSE)))","v":""}]
[null,null,"G9",null,null,null,null,null,null,null,null,5,{"$f":"IF(IF(ISNA(VLOOKUP(L7,Inscrits!$A$2:$C$23,2,FALSE)),\"\",VLOOKUP(L7,Inscrits!$A$2:$C$23,2,FALSE))=0,\"\",IF(ISNA(VLOOKUP(L7,Inscrits!$A$2:$C$23,2,FALSE)),\"\",VLOOKUP(L7,Inscrits!$A$2:$C$23,2,FALSE)))","v":"GELIBERT MARGAUX"},{"$f":"IF(IF(ISNA(VLOOKUP(L7,Inscrits!$A$2:$C$23,3,FALSE)),\"\",\"(\"&(VLOOKUP(L7,Inscrits!$A$2:$C$23,3,FALSE))&\")\")=\"()\",\"\",IF(ISNA(VLOOKUP(L7,Inscrits!$A$2:$C$23,3,FALSE)),\"\",\"(\"&(VLOOKUP(L7,Inscrits!$A$2:$C$23,3,FALSE))&\")\"))","v":"(2)"},null,null,null,null,null,null,null,null,null,null,7,{"$f":"IF(F6=\"\",\"\",IF(F6=J4,J8,J4))","v":""},null,{"$f":"M9","v":"DUPRE RAMBAUD NATAEL"},{"$f":"IF(AB7=M9,IF(O7=\"F\",\"\",O9),0)","v":0},{"$f":"IF(AB7=M9,IF(O9=\"F\",\"\",O7),0)","v":0},{"$f":"IF(AB7=Q8,IF(S4=\"F\",\"\",S8),0)","v":0},{"$f":"IF(AB7=Q8,IF(S8=\"F\",\"\",S4),0)","v":0},{"$f":"IF(AB7=J8,IF(I4=\"F\",\"\",I8),0)","v":0},{"$f":"IF(AB7=J8,IF(I8=\"F\",\"\",I4),0)","v":0},{"$f":"IF(AB7=F6,IF(E10=\"F\",\"\",E6),0)","v":0},{"$f":"IF(AB7=F6,IF(E6=\"F\",\"\",E10),0)","v":0},{"$f":"IF(AB7=F20,IF(E16=\"F\",\"\",E20),0)","v":0},{"$f":"IF(AB7=F20,IF(E20=\"F\",\"\",E16),0)","v":0},0,0,{"$f":"AM7-AN7","v":0},null,null,{"$f":"Z15","v":""},{"$f":"IF(AR7=\"\",\"\",(VLOOKUP(AR7,AB4:AO17,14,FALSE)))","v":""}]
["S",{"$f":"IF(OR(E6=\"F\",E6=\"A\"),F10,IF(OR(E10=\"F\",E10=\"A\"),F6,IF(E6=E10,\"\",(IF(E6>E10,F6,F10)))))","v":""},{"$f":"IF(OR(E6=\"F\",E6=\"A\"),G10,IF(OR(E10=\"F\",E10=\"A\"),G6,IF(E6=E10,\"\",(IF(E6>E10,G6,G10)))))","v":""},null,null,"Match 9 - Billard",null,null,null,{"$f":"IF(OR(AND(O7=\"F\",O9=\"F\"),AND(O7=\"A\",O9=\"A\")),M9,IF(OR(O7=\"F\",O7=\"A\"),M7,IF(OR(O9=\"F\",O9=\"A\"),M9,IF(O7=O9,\"\",(IF(O7<O9,M7,M9))))))","v":""},{"$f":"IF(OR(AND(O7=\"F\",O9=\"F\"),AND(O7=\"A\",O9=\"A\")),N9,IF(OR(O7=\"F\",O7=\"A\"),N7,IF(OR(O9=\"F\",O9=\"A\"),N9,IF(O7=O9,\"\",(IF(O7<O9,N7,N9))))))","v":""},null,"Match 2 - Billard",null,null,null,{"$f":"IF(OR(AND(O7=\"F\",O9=\"F\"),AND(O7=\"A\",O9=\"A\")),M7,IF(OR(O7=\"F\",O7=\"A\"),M9,IF(OR(O9=\"F\",O9=\"A\"),M7,IF(O7=O9,\"\",(IF(O7>O9,M7,M9))))))","v":""},{"$f":"IF(OR(AND(O7=\"F\",O9=\"F\"),AND(O7=\"A\",O9=\"A\")),N7,IF(OR(O7=\"F\",O7=\"A\"),N9,IF(OR(O9=\"F\",O9=\"A\"),N7,IF(O7=O9,\"\",(IF(O7>O9,N7,N9))))))","v":""}]
[null,null,null,null,null,null,null,null,null,null,"P2",4,{"$f":"IF(IF(ISNA(VLOOKUP(L9,Inscrits!$A$2:$C$23,2,FALSE)),\"\",VLOOKUP(L9,Inscrits!$A$2:$C$23,2,FALSE))=0,\"\",IF(ISNA(VLOOKUP(L9,Inscrits!$A$2:$C$23,2,FALSE)),\"\",VLOOKUP(L9,Inscrits!$A$2:$C$23,2,FALSE)))","v":"DUPRE RAMBAUD NATAEL"},{"$f":"IF(IF(ISNA(VLOOKUP(L9,Inscrits!$A$2:$C$23,3,FALSE)),\"\",\"(\"&(VLOOKUP(L9,Inscrits!$A$2:$C$23,3,FALSE))&\")\")=\"()\",\"\",IF(ISNA(VLOOKUP(L9,Inscrits!$A$2:$C$23,3,FALSE)),\"\",\"(\"&(VLOOKUP(L9,Inscrits!$A$2:$C$23,3,FALSE))&\")\"))","v":"(1)"},null,null,"G2"]
[null,null,null,null,null,{"$f":"IF(OR(S14=\"F\",S14=\"A\"),Q14,IF(OR(S18=\"F\",S18=\"A\"),Q18,IF(S14=S18,\"\",(IF(S14<S18,Q14,Q18)))))","v":""},{"$f":"IF(OR(S14=\"F\",S14=\"A\"),R14,IF(OR(S18=\"F\",S18=\"A\"),R18,IF(S14=S18,\"\",(IF(S14<S18,R14,R18)))))","v":""}]
{"$rows_left_out":12}
{"sheet":"Final","index":4,"n_rows":24,"n_cols":35,"rows_kept":24,"cut":false,"hidden":false,"merged":[[1,5,1,7],[0,1,0,3],[1,1,1,3],[0,13,0,15],[0,9,0,11],[0,5,0,7],[1,8,1,11],[1,13,1,16]]}
[null,"1/8 de finale",null,null,null,"1/4 de finale",null,null,null,"1/2 finale",null,null,null,"Finale"]
[null,{"$f":"\"(\"&Accueil!D20&\" manches)\"","v":"( manches)"},null,null,null,{"$f":"\"(\"&Accueil!G20&\" manches)\"","v":"( manches)"},null,null,{"$f":"\"Match en \"&Accueil!D22&\" manches gagnantes\"","v":"Match en 4 manches gagnantes"},null,null,null,null,{"$f":"\"Match en \"&Accueil!G22&\" manches gagnantes\"","v":"Match en 5 manches gagnantes"}]
[null,null,null,null,null,null,null,null,null,null,null,null,null,null,null,null,null,null,null,null,null,"JOUEURS","1/8","1/4","1/2","Finale","GA Final",null,"JOUEURS","GA Poules",null,"JOUEURS","GA Poules","GA Final","GA TOTAL"]
[null,null,null,null,null,null,null,null,null,null,null,null,null,null,null,null,null,null,null,null,null,{"$f":"J6","v":""},null,null,{"$f":"IF(AND(L6=\"A\",L12=\"A\"),0,IF(L6=\"A\",-L12,IF(L12=\"A\",L6,L6-L12)))","v":0},{"$f":"IF(N9=V4,IF(AND(P9=\"A\",P21=\"A\"),0,IF(OR(Y4>0,L12=\"A\"),IF(P9=\"A\",-P21,IF(P21=\"A\",P9,P9-P21)),0)),0)","v":0},{"$f":"SUM(W4:Z4)","v":0},null,{"$f":"'1'!AR4","v":""},{"$f":"'1'!AS4","v":""},null,{"$f":"IF(Inscrits!B2=0,\"\",Inscrits!B2)","v":"BERGNES LENNY"},{"$f":"VLOOKUP(AF4,$AC$4:$AD$11,2,FALSE)","v":{"$error":"#N/A"}},{"$f":"VLOOKUP(AF4,$V$4:$AA$23,6,FALSE)","v":{"$error":"#N/A"}},{"$f":"AG4+AH4","v":{"$error":"#N/A"}}]
[null,null,null,null,null,null,null,null,null,null,null,null,null,null,null,null,null,null,null,null,null,null,null,null,null,null,null,null,{"$f":"'1'!AR5","v":""},{"$f":"'1'!AS5","v":""},null,{"$f":"IF(Inscrits!B3=0,\"\",Inscrits!B3)","v":"GELIBERT MARGAUX"},{"$error":"#N/A"},{"$error":"#N/A"},{"$error":"#N/A"}]
[null,null,null,null,null,null,null,null,null,{"$f":"IF('1'!U6=0,\"\",'1'!U6)","v":""},{"$f":"IF('1'!V6=0,\"\",'1'!V6)","v":""},null,null,null,null,null,null,null,null,null,null,null,null,null,null,null,null,null,{"$f":"'1'!AR6","v":""},{"$f":"'1'!AS6","v":""},null,{"$f":"IF(Inscrits!B4=0,\"\",Inscrits!B4)","v":"KUSAR TONY"},{"$error":"#N/A"},{"$error":"#N/A"},{"$error":"#N/A"}]
[null,null,null,null,null,null,null,null,null,null,null,null,null,null,null,null,null,null,null,null,null,null,null,null,null,null,null,null,{"$f":"'1'!AR7","v":""},{"$f":"'1'!AS7","v":""},null,{"$f":"IF(Inscrits!B5=0,\"\",Inscrits!B5)","v":"TORNIER JORDAN"},{"$error":"#N/A"},{"$error":"#N/A"},{"$error":"#N/A"}]
[null,null,null,null,null,null,null,null,null,null,null,null,null,null,null,null,null,null,null,null,null,null,null,null,null,null,null,null,{"$f":"'1'!AR14","v":""},{"$f":"'1'!AS14","v":""},null,{"$f":"IF(Inscrits!B6=0,\"\",Inscrits!B6)","v":"VALLOT ROMAIN"},{"$error":"#N/A"},{"$error":"#N/A"},{"$error":"#N/A"}]
[null,null,null,null,null,null,null,null,null,"Match 1 - Billard",null,null,null,{"$f":"IF(AND(L6=\"A\",L12=\"A\"),J6,IF(L6=\"A\",J12,IF(L12=\"A\",J6,IF(L6=L12,\"\",(IF(L6>L12,J6,J12))))))","v":""},{"$f":"IF(AND(L6=\"A\",L12=\"A\"),K6,IF(L6=\"A\",K12,IF(L12=\"A\",K6,IF(L6=L12,\"\",(IF(L6>L12,K6,K12))))))","v":""},null,null,null,null,null,null,null,null,null,null,null,null,null,{"$f":"'1'!AR15","v":""},{"$f":"'1'!AS15","v":""},null,{"$f":"IF(Inscrits!B7=0,\"\",Inscrits!B7)","v":"DUPRE RAMBAUD NATAEL"},{"$error":"#N/A"},{"$error":"#N/A"},{"$error":"#N/A"}]
[null,null,null,null,null,null,null,null,null,null,null,null,null,null,null,null,null,null,null,null,null,{"$f":"J12","v":""},null,null,{"$f":"IF(AND(L6=\"A\",L12=\"A\"),0,IF(L6=\"A\",L12,IF(L12=\"A\",-L6,L12-L6)))","v":0},{"$f":"IF(N9=V10,IF(AND(P9=\"A\",P21=\"A\"),0,IF(OR(Y10>0,L6=\"A\"),IF(P9=\"A\",-P21,IF(P21=\"A\",P9,P9-P21)),0)),0)","v":0},{"$f":"SUM(W10:Z10)","v":0},null,{"$f":"'1'!AR16","v":0},{"$f":"'1'!AS16","v":0},null,{"$f":"IF(Inscrits!#REF!=0,\"\",Inscrits!#REF!)","v":{"$error":"#REF!"}},{"$error":"#REF!"},{"$error":"#REF!"},{"$error":"#REF!"}]
{"$rows_left_out":15}
{"sheet":"Classement","index":5,"n_rows":7,"n_cols":11,"rows_kept":7,"cut":false,"hidden":false,"merged":[]}
[null,null,"Formules Initiales","Nom & Prénom","Place","Points","GA","Club","Ville","Licence","Division"]
[null,null,1,{"$f":"Final!R15","v":""},null,{"$f":"IF(ISNA(IF(LEFT(Division,2)=\"R1\",VLOOKUP(E2,Points!$A$2:$D$9,2,FALSE),IF(LEFT(Division,2)=\"R2\",VLOOKUP(E2,Points!$A$2:$D$9,3,FALSE),IF(LEFT(Division,2)=\"R3\",VLOOKUP(E2,Points!$A$2:$D$9,4,FALSE),\"DIV ???\")))),0,IF(LEFT(Division,2)=\"R1\",VLOOKUP(E2,Points!$A$2:$D$9,2,FALSE),IF(LEFT(Division,2)=\"R2\",VLOOKUP(E2,Points!$A$2:$D$9,3,FALSE),IF(LEFT(Division,2)=\"R3\",VLOOKUP(E2,Points!$A$2:$D$9,4,FALSE),\"DIV ???\"))))","v":0},{"$f":"IF(ISERROR(VLOOKUP(D2,Final!$AF$4:$AI$11,4,FALSE)),\"\",VLOOKUP(D2,Final!$AF$4:$AI$11,4,FALSE))","v":""},{"$f":"IF(ISNA(VLOOKUP(D2,Inscrits!B:E,3,FALSE)),\"\",VLOOKUP(D2,Inscrits!B:E,3,FALSE))","v":""},{"$f":"IF(ISNA(VLOOKUP(D2,Inscrits!B:E,4,FALSE)),\"\",VLOOKUP(D2,Inscrits!B:E,4,FALSE))","v":""},{"$f":"IF(ISNA(VLOOKUP(D2,Inscrits!B:E,5,FALSE)),\"\",VLOOKUP(D2,Inscrits!B:E,5,FALSE))","v":""},{"$f":"IF(NB_JOUEURS_UP>0,IF(LEN(Division)=2,\"R\"&RIGHT(Division,1)-1&\"\",IF(LEN(Division)=3,IF(RIGHT(LEFT(Division,2),1)=\"2\",\"R1\",IF(Nb_R2=1,\"R2\",\"R\"&RIGHT(LEFT(Division,2),1)-1&\"\"&RIGHT(Division,1)&\"\")),IF(LEN(Division)=4,IF(RIGHT(LEFT(Division,2),1)=\"2\",\"R1\",\"R\"&RIGHT(LEFT(Division,2),1)-1&\"\"&RIGHT(LEFT(Division,3),1)&\"\"),\"?\"))),Division)","v":"R1"}]
[null,null,2,{"$f":"IF(Final!P21=\"A\",Final!N21,IF(Final!P9=\"A\",Final!N9,IF(Final!P9<Final!P21,Final!N9,Final!N21)))","v":""},null,{"$f":"IF(ISNA(IF(LEFT(Division,2)=\"R1\",VLOOKUP(E3,Points!$A$2:$D$9,2,FALSE),IF(LEFT(Division,2)=\"R2\",VLOOKUP(E3,Points!$A$2:$D$9,3,FALSE),IF(LEFT(Division,2)=\"R3\",VLOOKUP(E3,Points!$A$2:$D$9,4,FALSE),\"DIV ???\")))),0,IF(LEFT(Division,2)=\"R1\",VLOOKUP(E3,Points!$A$2:$D$9,2,FALSE),IF(LEFT(Division,2)=\"R2\",VLOOKUP(E3,Points!$A$2:$D$9,3,FALSE),IF(LEFT(Division,2)=\"R3\",VLOOKUP(E3,Points!$A$2:$D$9,4,FALSE),\"DIV ???\"))))","v":0},{"$f":"IF(ISERROR(VLOOKUP(D3,Final!$AF$4:$AI$11,4,FALSE)),\"\",VLOOKUP(D3,Final!$AF$4:$AI$11,4,FALSE))","v":""},{"$f":"IF(ISNA(VLOOKUP(D3,Inscrits!B:E,3,FALSE)),\"\",VLOOKUP(D3,Inscrits!B:E,3,FALSE))","v":""},{"$f":"IF(ISNA(VLOOKUP(D3,Inscrits!B:E,4,FALSE)),\"\",VLOOKUP(D3,Inscrits!B:E,4,FALSE))","v":""},{"$f":"IF(ISNA(VLOOKUP(D3,Inscrits!B:E,5,FALSE)),\"\",VLOOKUP(D3,Inscrits!B:E,5,FALSE))","v":""},{"$f":"IF(NB_JOUEURS_UP>1,IF(LEN(Division)=2,\"R\"&RIGHT(Division,1)-1&\"\",IF(LEN(Division)=3,IF(RIGHT(LEFT(Division,2),1)=\"2\",\"R1\",IF(Nb_R2=1,\"R2\",\"R\"&RIGHT(LEFT(Division,2),1)-1&\"\"&RIGHT(Division,1)&\"\")),IF(LEN(Division)=4,IF(RIGHT(LEFT(Division,2),1)=\"2\",\"R1\",\"R\"&RIGHT(LEFT(Division,2),1)-1&\"\"&RIGHT(LEFT(Division,3),1)&\"\"),\"?\"))),Division)","v":"R1"}]
[null,null,3,{"$f":"IF(Final!L12=\"A\",Final!J12,IF(Final!L6=\"A\",Final!J6,IF(Final!L6<Final!L12,Final!J6,Final!J12)))","v":""},null,{"$f":"IF(ISNA(IF(LEFT(Division,2)=\"R1\",VLOOKUP(E4,Points!$A$2:$D$9,2,FALSE),IF(LEFT(Division,2)=\"R2\",VLOOKUP(E4,Points!$A$2:$D$9,3,FALSE),IF(LEFT(Division,2)=\"R3\",VLOOKUP(E4,Points!$A$2:$D$9,4,FALSE),\"DIV ???\")))),0,IF(LEFT(Division,2)=\"R1\",VLOOKUP(E4,Points!$A$2:$D$9,2,FALSE),IF(LEFT(Division,2)=\"R2\",VLOOKUP(E4,Points!$A$2:$D$9,3,FALSE),IF(LEFT(Division,2)=\"R3\",VLOOKUP(E4,Points!$A$2:$D$9,4,FALSE),\"DIV ???\"))))","v":0},{"$f":"IF(ISERROR(VLOOKUP(D4,Final!$AF$4:$AI$11,4,FALSE)),\"\",VLOOKUP(D4,Final!$AF$4:$AI$11,4,FALSE))","v":""},{"$f":"IF(ISNA(VLOOKUP(D4,Inscrits!B:E,3,FALSE)),\"\",VLOOKUP(D4,Inscrits!B:E,3,FALSE))","v":""},{"$f":"IF(ISNA(VLOOKUP(D4,Inscrits!B:E,4,FALSE)),\"\",VLOOKUP(D4,Inscrits!B:E,4,FALSE))","v":""},{"$f":"IF(ISNA(VLOOKUP(D4,Inscrits!B:E,5,FALSE)),\"\",VLOOKUP(D4,Inscrits!B:E,5,FALSE))","v":""},{"$f":"IF(NB_JOUEURS_UP>2,IF(LEN(Division)=2,\"R\"&RIGHT(Division,1)-1&\"\",IF(LEN(Division)=3,IF(RIGHT(LEFT(Division,2),1)=\"2\",\"R1\",IF(Nb_R2=1,\"R2\",\"R\"&RIGHT(LEFT(Division,2),1)-1&\"\"&RIGHT(Division,1)&\"\")),IF(LEN(Division)=4,IF(RIGHT(LEFT(Division,2),1)=\"2\",\"R1\",\"R\"&RIGHT(LEFT(Division,2),1)-1&\"\"&RIGHT(LEFT(Division,3),1)&\"\"),\"?\"))),Division)","v":"R1"}]
[null,null,4,{"$f":"IF(Final!L24=\"A\",Final!J24,IF(Final!L18=\"A\",Final!J18,IF(Final!L18<Final!L24,Final!J18,Final!J24)))","v":""},null,{"$f":"IF(ISNA(IF(LEFT(Division,2)=\"R1\",VLOOKUP(E5,Points!$A$2:$D$9,2,FALSE),IF(LEFT(Division,2)=\"R2\",VLOOKUP(E5,Points!$A$2:$D$9,3,FALSE),IF(LEFT(Division,2)=\"R3\",VLOOKUP(E5,Points!$A$2:$D$9,4,FALSE),\"DIV ???\")))),0,IF(LEFT(Division,2)=\"R1\",VLOOKUP(E5,Points!$A$2:$D$9,2,FALSE),IF(LEFT(Division,2)=\"R2\",VLOOKUP(E5,Points!$A$2:$D$9,3,FALSE),IF(LEFT(Division,2)=\"R3\",VLOOKUP(E5,Points!$A$2:$D$9,4,FALSE),\"DIV ???\"))))","v":0},{"$f":"IF(ISERROR(VLOOKUP(D5,Final!$AF$4:$AI$11,4,FALSE)),\"\",VLOOKUP(D5,Final!$AF$4:$AI$11,4,FALSE))","v":""},{"$f":"IF(ISNA(VLOOKUP(D5,Inscrits!B:E,3,FALSE)),\"\",VLOOKUP(D5,Inscrits!B:E,3,FALSE))","v":""},{"$f":"IF(ISNA(VLOOKUP(D5,Inscrits!B:E,4,FALSE)),\"\",VLOOKUP(D5,Inscrits!B:E,4,FALSE))","v":""},{"$f":"IF(ISNA(VLOOKUP(D5,Inscrits!B:E,5,FALSE)),\"\",VLOOKUP(D5,Inscrits!B:E,5,FALSE))","v":""},{"$f":"IF(NB_JOUEURS_UP>3,IF(LEN(Division)=2,\"R\"&RIGHT(Division,1)-1&\"\",IF(LEN(Division)=3,IF(RIGHT(LEFT(Division,2),1)=\"2\",\"R1\",IF(Nb_R2=1,\"R2\",\"R\"&RIGHT(LEFT(Division,2),1)-1&\"\"&RIGHT(Division,1)&\"\")),IF(LEN(Division)=4,IF(RIGHT(LEFT(Division,2),1)=\"2\",\"R1\",\"R\"&RIGHT(LEFT(Division,2),1)-1&\"\"&RIGHT(LEFT(Division,3),1)&\"\"),\"?\"))),Division)","v":"R1"}]
[null,null,5,{"$f":"'1'!AR14","v":""},null,{"$f":"IF(ISNA(IF(LEFT(Division,2)=\"R1\",VLOOKUP(E6,Points!$A$2:$D$9,2,FALSE),IF(LEFT(Division,2)=\"R2\",VLOOKUP(E6,Points!$A$2:$D$9,3,FALSE),IF(LEFT(Division,2)=\"R3\",VLOOKUP(E6,Points!$A$2:$D$9,4,FALSE),\"DIV ???\")))),0,IF(LEFT(Division,2)=\"R1\",VLOOKUP(E6,Points!$A$2:$D$9,2,FALSE),IF(LEFT(Division,2)=\"R2\",VLOOKUP(E6,Points!$A$2:$D$9,3,FALSE),IF(LEFT(Division,2)=\"R3\",VLOOKUP(E6,Points!$A$2:$D$9,4,FALSE),\"DIV ???\"))))","v":0},{"$f":"IF(ISERROR(VLOOKUP(D6,Final!$AF$4:$AI$11,4,FALSE)),\"\",VLOOKUP(D6,Final!$AF$4:$AI$11,4,FALSE))","v":""},{"$f":"IF(ISNA(VLOOKUP(D6,Inscrits!B:E,3,FALSE)),\"\",VLOOKUP(D6,Inscrits!B:E,3,FALSE))","v":""},{"$f":"IF(ISNA(VLOOKUP(D6,Inscrits!B:E,4,FALSE)),\"\",VLOOKUP(D6,Inscrits!B:E,4,FALSE))","v":""},{"$f":"IF(ISNA(VLOOKUP(D6,Inscrits!B:E,5,FALSE)),\"\",VLOOKUP(D6,Inscrits!B:E,5,FALSE))","v":""},{"$f":"IF(NB_JOUEURS_UP>4,IF(LEN(Division)=2,\"R\"&RIGHT(Division,1)-1&\"\",IF(LEN(Division)=3,IF(RIGHT(LEFT(Division,2),1)=\"2\",\"R1\",IF(Nb_R2=1,\"R2\",\"R\"&RIGHT(LEFT(Division,2),1)-1&\"\"&RIGHT(Division,1)&\"\")),IF(LEN(Division)=4,IF(RIGHT(LEFT(Division,2),1)=\"2\",\"R1\",\"R\"&RIGHT(LEFT(Division,2),1)-1&\"\"&RIGHT(LEFT(Division,3),1)&\"\"),\"?\"))),Division)","v":"R1"}]
[null,null,6,{"$f":"'1'!AR15","v":""},null,{"$f":"IF(ISNA(IF(LEFT(Division,2)=\"R1\",VLOOKUP(E7,Points!$A$2:$D$9,2,FALSE),IF(LEFT(Division,2)=\"R2\",VLOOKUP(E7,Points!$A$2:$D$9,3,FALSE),IF(LEFT(Division,2)=\"R3\",VLOOKUP(E7,Points!$A$2:$D$9,4,FALSE),\"DIV ???\")))),0,IF(LEFT(Division,2)=\"R1\",VLOOKUP(E7,Points!$A$2:$D$9,2,FALSE),IF(LEFT(Division,2)=\"R2\",VLOOKUP(E7,Points!$A$2:$D$9,3,FALSE),IF(LEFT(Division,2)=\"R3\",VLOOKUP(E7,Points!$A$2:$D$9,4,FALSE),\"DIV ???\"))))","v":0},{"$f":"IF(ISERROR(VLOOKUP(D7,Final!$AF$4:$AI$11,4,FALSE)),\"\",VLOOKUP(D7,Final!$AF$4:$AI$11,4,FALSE))","v":""},{"$f":"IF(ISNA(VLOOKUP(D7,Inscrits!B:E,3,FALSE)),\"\",VLOOKUP(D7,Inscrits!B:E,3,FALSE))","v":""},{"$f":"IF(ISNA(VLOOKUP(D7,Inscrits!B:E,4,FALSE)),\"\",VLOOKUP(D7,Inscrits!B:E,4,FALSE))","v":""},{"$f":"IF(ISNA(VLOOKUP(D7,Inscrits!B:E,5,FALSE)),\"\",VLOOKUP(D7,Inscrits!B:E,5,FALSE))","v":""},{"$f":"IF(NB_JOUEURS_UP>5,IF(LEN(Division)=2,\"R\"&RIGHT(Division,1)-1&\"\",IF(LEN(Division)=3,IF(RIGHT(LEFT(Division,2),1)=\"2\",\"R1\",IF(Nb_R2=1,\"R2\",\"R\"&RIGHT(LEFT(Division,2),1)-1&\"\"&RIGHT(Division,1)&\"\")),IF(LEN(Division)=4,IF(RIGHT(LEFT(Division,2),1)=\"2\",\"R1\",\"R\"&RIGHT(LEFT(Division,2),1)-1&\"\"&RIGHT(LEFT(Division,3),1)&\"\"),\"?\"))),Division)","v":"R1"}]

{"sheet":"Feuil1","index":6,"n_rows":977,"n_cols":3,"rows_kept":977,"cut":false,"hidden":false,"merged":[]}
["Licence","Nom Prenom","Nom Club"]
["010669J","GUIHEUX DENIS","BILLARD CLUB GRENOBLOIS"]
["010957L","CONTAMINE ALAIN","BILLARD CLUB MONTLUCONNAIS"]
["010959N","DESPREZ SERGE","BILLARD CLUB MONTLUCONNAIS"]
["010960O","MIDROUILLET PATRICK","BILLARD CLUB MONTLUCONNAIS"]
["010978G","VIGILI GINO","B.S.CLERMONTOIS"]
["010984M","LEFEBVRE SERGE","BILLARD CLUB MOULINS"]
["010991T","PICANDET RENE","BILLARD CLUB ST ELOY"]
["011005H","ROESCH PHILIPPE","B.S.CLERMONTOIS"]
["011016S","SANCHEZ CHRISTIAN","BILLARD CLUB VICHY"]
{"$rows_left_out":967}