{"text_format":"1","workbook":"xlsx","n_sheets":13,"sheets":["Listing joueurs","Liste Joueurs","Calcul","Poules","1","2","3","4","Final","Billards","Classement","Points","Parametres"],"not_rendered":{"charts":0,"images":5,"macros":1,"external_links":8,"defined_names":337,"comments":0,"pivot_tables":0},"unopened":[],"bounds":{"document_bytes":16777216,"sheet_cells":100000,"rows_first":2000,"rows_last":500,"rows_between":2000,"halvings":0,"cell_chars":16384,"cell_head_chars":4096},"cells_cut":0,"cells_raw":0,"read":"whole","date_system":"1900"}

{"sheet":"Listing joueurs","index":0,"n_rows":41,"n_cols":10,"rows_kept":41,"cut":false,"hidden":false,"merged":[]}
["Num","Concaténation","Groupe Sportif","Ville","Licence","Nom","Prénom"]
[1,{"$f":"F2&\" \"&G2","v":"BACCAM BOUNLIENG"},"NIGHT BILLARD CLUB","BEAUREGARD","137597F","BACCAM","BOUNLIENG"]
[2,"BACCAM HELENE","NIGHT BILLARD CLUB","BEAUREGARD","146104K","BACCAM","HELENE"]
[3,"BOBROSKY BERNARD","NIGHT BILLARD CLUB","BEAUREGARD","156618M","BOBROSKY","BERNARD"]
[4,"BONTEMPS MIKAEL","NIGHT BILLARD CLUB","BEAUREGARD","150507V","BONTEMPS","MIKAEL"]
[5,"BRENDEL CHRISTIAN","NIGHT BILLARD CLUB","BEAUREGARD","135920S","BRENDEL","CHRISTIAN"]
{"$rows_left_out":36}
{"sheet":"Liste Joueurs","index":1,"n_rows":141,"n_cols":7,"rows_kept":141,"cut":false,"hidden":false,"merged":[]}
[null,"Nom","Prénom",null,"Concatenation","Présent","Horaires "]
[null,"DUDIT FABIEN ",null,1,{"$f":"B2&\" \"&C2","v":"DUDIT FABIEN  "},null,"14H00"]
[null,"GARNIER NICOLAS ",null,2,{"$f":"B3&\" \"&C3","v":"GARNIER NICOLAS  "},null,"14H00"]
[null,"LACROIX DYLAN ",null,3,"LACROIX DYLAN  ",null,"14H00"]
[null,"ROBEZ FLORENT ",null,4,"ROBEZ FLORENT  ",null,"14H00"]
[null,"BACCAM BOUNLIENG ",null,5,"BACCAM BOUNLIENG  ",null,"14H00"]
{"$rows_left_out":136}
{"sheet":"Calcul","index":2,"n_rows":50,"n_cols":5,"rows_kept":50,"cut":false,"hidden":false,"merged":[[17,2,17,3],[0,3,0,4]]}
["Classement","Tête de \nSérie","Horaires","Joueurs"]
[1,"TSA","14H00",null,{"$f":"'Liste Joueurs'!E2","v":"DUDIT FABIEN  "}]
[2,"TSA","14H00",null,{"$f":"'Liste Joueurs'!E3","v":"GARNIER NICOLAS  "}]
[3,"TSA","14H00",null,{"$f":"'Liste Joueurs'!E4","v":"LACROIX DYLAN  "}]
[4,"TSA","14H00",null,{"$f":"'Liste Joueurs'!E5","v":"ROBEZ FLORENT  "}]
[5,"TSA","14H00",null,{"$f":"'Liste Joueurs'!E6","v":"BACCAM BOUNLIENG  "}]
{"$rows_left_out":45}
{"sheet":"Poules","index":3,"n_rows":28,"n_cols":7,"rows_kept":28,"cut":false,"hidden":false,"merged":[[0,1,0,4],[26,6,26,7],[27,6,27,7],[28,6,28,7],[24,6,24,7],[22,6,22,7],[23,6,23,7],[21,6,21,7],[20,1,20,7],[25,6,25,7],[11,3,11,4],[11,5,11,6]]}
[null,"Poule de 8 joueurs pour le 2 X KO"]
[null,"Poule A/1","Poule B/2","Poule C/3 ","Poule D/4"]
["Joueur 1",{"$f":"P_A1","v":"CHIEZE MIREILLE  "},{"$f":"P_B1","v":"BRENDEL CHRISTIAN  "},{"$f":"P_C1","v":"CABANET FLORENCE  "},{"$f":"P_D1","v":"LE GOFF THIERRY  "}]
["Joueur 2",{"$f":"P_A8","v":" "},{"$f":"P_B8","v":" "},{"$f":"P_C8","v":" "},{"$f":"P_D8","v":" "}]
["Joueur 3",{"$f":"P_A5","v":"NOCERA GIUSEPPE  "},{"$f":"P_B5","v":"LACROIX VALERIE  "},{"$f":"P_C5","v":" "},{"$f":"P_D5","v":" "}]
["Joueur 4",{"$f":"P_A4","v":"MOREL SYLVAIN  "},{"$f":"P_B4","v":"KAABECHE RIAD  "},{"$f":"P_C4","v":"HISIGER CHARLOTTE  "},{"$f":"P_D4","v":"BACCAM HELENE  "}]
{"$rows_left_out":23}
{"sheet":"1","index":4,"n_rows":28,"n_cols":43,"rows_kept":28,"cut":false,"hidden":false,"merged":[[21,5,21,9],[21,13,21,15],[10,9,10,12],[10,14,10,17],[28,13,28,17]]}
[]
[]
[null,null,null,null,null,null,null,null,null,null,null,"P1",null,{"$f":"P_A1","v":"CHIEZE MIREILLE  "},null,null,null,"G1",null,null,null,null,null,null,null,null,null,null,null,null,"G","P","G","P","G","P","G","P","G","P","G","P","Ga"]
[null,null,null,null,null,null,null,null,null,"F",{"$f":"IF(OR(AND(P3=\"F\",P5=\"F\"),AND(P3=\"A\",P5=\"A\")),N5,IF(OR(P3=\"F\",P3=\"A\"),N3,IF(OR(P5=\"F\",P5=\"A\"),N5,IF(P3=P5,\"\",(IF(P3<P5,N3,N5))))))","v":" "},{"$f":"IF(OR(AND(P3=\"F\",P5=\"F\"),AND(P3=\"A\",P5=\"A\")),O5,IF(OR(P3=\"F\",P3=\"A\"),O3,IF(OR(P5=\"F\",P5=\"A\"),O5,IF(P3=P5,\"\",(IF(P3<P5,P3-P5,P5-P3))))))","v":0},null,"Match 1 - Billard num  :",null,null,null,{"$f":"IF(OR(AND(P3=\"F\",P5=\"F\"),AND(P3=\"A\",P5=\"A\")),N3,IF(OR(P3=\"F\",P3=\"A\"),N5,IF(OR(P5=\"F\",P5=\"A\"),N3,IF(P3=P5,\"\",(IF(P3>P5,N3,N5))))))","v":"CHIEZE MIREILLE  "},{"$f":"IF(OR(AND(P3=\"F\",P5=\"F\"),AND(P3=\"A\",P5=\"A\")),O3,IF(OR(P3=\"F\",P3=\"A\"),O5,IF(OR(P5=\"F\",P5=\"A\"),O3,IF(P3=P5,\"\",(IF(P3>P5,P3-P5,P5-P3))))))","v":0},null,null,null,null,"Classement Poule 1",null,null,1,{"$f":"IF(N24=\"\",\"\",IF(N24=R4,R4,R8))","v":""},null,{"$f":"N3","v":"CHIEZE MIREILLE  "},{"$f":"IF(AD4=N3,IF(P5=\"F\",\"\",P3),0)","v":""},{"$f":"IF(AD4=N3,IF(P3=\"F\",\"\",P5),0)","v":"F"},{"$f":"IF(AD4=R4,IF(T8=\"F\",\"\",T4),0)","v":0},{"$f":"IF(AD4=R4,IF(T4=\"F\",\"\",T8),0)","v":0},{"$f":"IF(AD4=K4,IF(J8=\"F\",\"\",J4),0)","v":0},{"$f":"IF(AD4=K4,IF(J4=\"F\",\"\",J8),0)","v":0},{"$f":"IF(AD4=G6,IF(F10=\"F\",\"\",F6),0)","v":0},{"$f":"IF(AD4=G6,IF(F6=\"F\",\"\",F10),0)","v":0},{"$f":"IF(AD4=G20,IF(F16=\"F\",\"\",F20),0)","v":0},{"$f":"IF(AD4=G20,IF(F20=\"F\",\"\",F16),0)","v":0},{"$f":"SUM(AE4,AG4,AI4,AK4,AM4)","v":0},0,{"$f":"AO4-AP4","v":0}]
[null,null,null,null,null,null,null,"G7",null,null,null,null,null,{"$f":"P_A8","v":" "},null,"F",null,null,null,null,null,null,1,{"$f":"IF(OR(AND(P24=\"F\",P28=\"F\"),AND(P24=\"A\",P28=\"A\")),N24,IF(OR(P24=\"F\",P28=\"A\"),N28,IF(OR(P28=\"F\",P28=\"A\"),N24,IF(P24=P28,\"\",(IF(P24>P28,N24,N28))))))","v":""},{"$f":"QP1_AG","v":""},"A",3,{"$f":"IF(B8=\"\",\"\",IF(B8=G6,G6,G10))","v":""},null,{"$f":"N5","v":" "},{"$f":"IF(AD5=N5,IF(P3=\"F\",\"\",P5),0)","v":"F"},{"$f":"IF(AD5=N5,IF(P5=\"F\",\"\",P3),0)","v":""},{"$f":"IF(AD5=R4,IF(T8=\"F\",\"\",T4),0)","v":0},{"$f":"IF(AD5=R4,IF(T4=\"F\",\"\",T8),0)","v":0},{"$f":"IF(AD5=K4,IF(J8=\"F\",\"\",J4),0)","v":"F"},{"$f":"IF(AD5=K4,IF(J4=\"F\",\"\",J8),0)","v":""},{"$f":"IF(AD5=G6,IF(F10=\"F\",\"\",F6),0)","v":0},{"$f":"IF(AD5=G6,IF(F6=\"F\",\"\",F10),0)","v":0},{"$f":"IF(AD5=G20,IF(F16=\"F\",\"\",F20),0)","v":0},{"$f":"IF(AD5=G20,IF(F20=\"F\",\"\",F16),0)","v":0},0,0,{"$f":"AO5-AP5","v":0}]
[null,null,null,null,null,null,{"$f":"IF(OR(J4=\"F\",J4=\"A\"),K8,IF(OR(J8=\"F\",J8=\"A\"),K4,IF(J4=J8,\"\",(IF(J4>J8,K4,K8)))))","v":""},{"$f":"IF(OR(J4=\"F\",J4=\"A\"),L8,IF(OR(J8=\"F\",J8=\"A\"),L4,IF(J4=J8,\"\",(IF(J4>J8,J4-J8+L4,J8-J4+L8)))))","v":""},null,null,"Match 7 - Billard num :",null,null,null,null,null,null,"Match 5 - Billard num  :",null,null,null,null,2,{"$f":"IF(I24=I28,\"\",IF(I24>I28,G24,G28))","v":""},{"$f":"IF(OR(I24=\"F\",I28=\"A\"),H24,IF(OR(I24=\"A\",I28=\"F\"),H28,IF(I24=I28,\"\",(IF(I24>I28,I24-I28+H24,I28-I24+H28)))))","v":""},"E",5,{"$f":"IF(B8=\"\",\"\",IF(B8=G6,G10,G6))","v":""},null,{"$f":"N7","v":"NOCERA GIUSEPPE  "},{"$f":"IF(AD6=N7,IF(P9=\"F\",\"\",P7),0)","v":0},{"$f":"IF(AD6=N7,IF(P7=\"F\",\"\",P9),0)","v":0},{"$f":"IF(AD6=R8,IF(T4=\"F\",\"\",T8),0)","v":0},{"$f":"IF(AD6=R8,IF(T8=\"F\",\"\",T4),0)","v":0},{"$f":"IF(AD6=K8,IF(J4=\"F\",\"\",J8),0)","v":0},{"$f":"IF(AD6=K8,IF(J8=\"F\",\"\",J4),0)","v":0},{"$f":"IF(AD6=G6,IF(F10=\"F\",\"\",F6),0)","v":0},{"$f":"IF(AD6=G6,IF(F6=\"F\",\"\",F10),0)","v":0},{"$f":"IF(AD6=G20,IF(F16=\"F\",\"\",F20),0)","v":0},{"$f":"IF(AD6=G20,IF(F20=\"F\",\"\",F16),0)","v":0},0,0,{"$f":"AO6-AP6","v":0}]
{"$rows_left_out":23}
{"sheet":"2","index":5,"n_rows":28,"n_cols":43,"rows_kept":28,"cut":false,"hidden":false,"merged":[[0,10,0,18],[21,5,21,9],[21,13,21,15],[10,9,10,12],[10,14,10,17],[20,10,20,18]]}
[]
[]
[null,null,null,null,null,null,null,null,null,null,null,"P1",null,{"$f":"P_B1","v":"BRENDEL CHRISTIAN  "},null,null,null,"G1",null,null,null,null,null,null,null,null,null,null,null,null,"G","P","G","P","G","P","G","P","G","P","G","P","Ga"]
[null,null,null,null,null,null,null,null,null,"F",{"$f":"IF(OR(AND(P3=\"F\",P5=\"F\"),AND(P3=\"A\",P5=\"A\")),N5,IF(OR(P3=\"F\",P3=\"A\"),N3,IF(OR(P5=\"F\",P5=\"A\"),N5,IF(P3=P5,\"\",(IF(P3<P5,N3,N5))))))","v":" "},{"$f":"IF(OR(AND(P3=\"F\",P5=\"F\"),AND(P3=\"A\",P5=\"A\")),O5,IF(OR(P3=\"F\",P3=\"A\"),O3,IF(OR(P5=\"F\",P5=\"A\"),O5,IF(P3=P5,\"\",(IF(P3<P5,P3-P5,P5-P3))))))","v":0},null,"Match 1 - Billard num  :",null,null,null,{"$f":"IF(OR(AND(P3=\"F\",P5=\"F\"),AND(P3=\"A\",P5=\"A\")),N3,IF(OR(P3=\"F\",P3=\"A\"),N5,IF(OR(P5=\"F\",P5=\"A\"),N3,IF(P3=P5,\"\",(IF(P3>P5,N3,N5))))))","v":"BRENDEL CHRISTIAN  "},{"$f":"IF(OR(AND(P3=\"F\",P5=\"F\"),AND(P3=\"A\",P5=\"A\")),O3,IF(OR(P3=\"F\",P3=\"A\"),O5,IF(OR(P5=\"F\",P5=\"A\"),O3,IF(P3=P5,\"\",(IF(P3>P5,P3-P5,P5-P3))))))","v":0},null,null,null,null,"Classement Poule 2",null,null,1,{"$f":"IF(N24=\"\",\"\",IF(N24=R4,R4,R8))","v":""},null,{"$f":"N3","v":"BRENDEL CHRISTIAN  "},{"$f":"IF(AD4=N3,IF(P5=\"F\",\"\",P3),0)","v":""},{"$f":"IF(AD4=N3,IF(P3=\"F\",\"\",P5),0)","v":"F"},{"$f":"IF(AD4=R4,IF(T8=\"F\",\"\",T4),0)","v":0},{"$f":"IF(AD4=R4,IF(T4=\"F\",\"\",T8),0)","v":0},{"$f":"IF(AD4=K4,IF(J8=\"F\",\"\",J4),0)","v":0},{"$f":"IF(AD4=K4,IF(J4=\"F\",\"\",J8),0)","v":0},{"$f":"IF(AD4=G6,IF(F10=\"F\",\"\",F6),0)","v":0},{"$f":"IF(AD4=G6,IF(F6=\"F\",\"\",F10),0)","v":0},{"$f":"IF(AD4=G20,IF(F16=\"F\",\"\",F20),0)","v":0},{"$f":"IF(AD4=G20,IF(F20=\"F\",\"\",F16),0)","v":0},{"$f":"SUM(AE4,AG4,AI4,AK4,AM4)","v":0},0,{"$f":"AO4-AP4","v":0}]
[null,null,null,null,null,null,null,"G7",null,null,null,null,null,{"$f":"P_B8","v":" "},null,"F",null,null,null,null,null,null,1,{"$f":"IF(OR(AND(P24=\"F\",P28=\"F\"),AND(P24=\"A\",P28=\"A\")),N24,IF(OR(P24=\"F\",P28=\"A\"),N28,IF(OR(P28=\"F\",P28=\"A\"),N24,IF(P24=P28,\"\",(IF(P24>P28,N24,N28))))))","v":""},{"$f":"QP1_AG","v":""},"B",3,{"$f":"IF(B8=\"\",\"\",IF(B8=G6,G6,G10))","v":""},null,{"$f":"N5","v":" "},{"$f":"IF(AD5=N5,IF(P3=\"F\",\"\",P5),0)","v":"F"},{"$f":"IF(AD5=N5,IF(P5=\"F\",\"\",P3),0)","v":""},{"$f":"IF(AD5=R4,IF(T8=\"F\",\"\",T4),0)","v":0},{"$f":"IF(AD5=R4,IF(T4=\"F\",\"\",T8),0)","v":0},{"$f":"IF(AD5=K4,IF(J8=\"F\",\"\",J4),0)","v":"F"},{"$f":"IF(AD5=K4,IF(J4=\"F\",\"\",J8),0)","v":""},{"$f":"IF(AD5=G6,IF(F10=\"F\",\"\",F6),0)","v":0},{"$f":"IF(AD5=G6,IF(F6=\"F\",\"\",F10),0)","v":0},{"$f":"IF(AD5=G20,IF(F16=\"F\",\"\",F20),0)","v":0},{"$f":"IF(AD5=G20,IF(F20=\"F\",\"\",F16),0)","v":0},0,0,{"$f":"AO5-AP5","v":0}]
[null,null,null,null,null,null,{"$f":"IF(OR(J4=\"F\",J4=\"A\"),K8,IF(OR(J8=\"F\",J8=\"A\"),K4,IF(J4=J8,\"\",(IF(J4>J8,K4,K8)))))","v":""},{"$f":"IF(OR(J4=\"F\",J4=\"A\"),L8,IF(OR(J8=\"F\",J8=\"A\"),L4,IF(J4=J8,\"\",(IF(J4>J8,J4-J8+L4,J8-J4+L8)))))","v":""},null,null,"Match 7 - Billard num :",null,null,null,null,null,null,"Match 5 - Billard num  :",null,null,null,null,2,{"$f":"IF(I24=I28,\"\",IF(I24>I28,G24,G28))","v":""},{"$f":"IF(OR(I24=\"F\",I28=\"A\"),H24,IF(OR(I24=\"A\",I28=\"F\"),H28,IF(I24=I28,\"\",(IF(I24>I28,I24-I28+H24,I28-I24+H28)))))","v":""},"F",5,{"$f":"IF(B8=\"\",\"\",IF(B8=G6,G10,G6))","v":""},null,{"$f":"N7","v":"LACROIX VALERIE  "},{"$f":"IF(AD6=N7,IF(P9=\"F\",\"\",P7),0)","v":0},{"$f":"IF(AD6=N7,IF(P7=\"F\",\"\",P9),0)","v":0},{"$f":"IF(AD6=R8,IF(T4=\"F\",\"\",T8),0)","v":0},{"$f":"IF(AD6=R8,IF(T8=\"F\",\"\",T4),0)","v":0},{"$f":"IF(AD6=K8,IF(J4=\"F\",\"\",J8),0)","v":0},{"$f":"IF(AD6=K8,IF(J8=\"F\",\"\",J4),0)","v":0},{"$f":"IF(AD6=G6,IF(F10=\"F\",\"\",F6),0)","v":0},{"$f":"IF(AD6=G6,IF(F6=\"F\",\"\",F10),0)","v":0},{"$f":"IF(AD6=G20,IF(F16=\"F\",\"\",F20),0)","v":0},{"$f":"IF(AD6=G20,IF(F20=\"F\",\"\",F16),0)","v":0},0,0,{"$f":"AO6-AP6","v":0}]
{"$rows_left_out":23}
{"sheet":"3","index":6,"n_rows":28,"n_cols":43,"rows_kept":28,"cut":false,"hidden":false,"merged":[[0,10,0,18],[21,5,21,9],[21,13,21,15],[10,9,10,12],[10,14,10,17],[20,10,20,18]]}
[]
[]
[null,null,null,null,null,null,null,null,null,null,null,"P1",null,{"$f":"P_C1","v":"CABANET FLORENCE  "},null,null,null,"G1",null,null,null,null,null,null,null,null,null,null,null,null,"G","P","G","P","G","P","G","P","G","P","G","P","Ga"]
[null,null,null,null,null,null,null,null,null,"F",{"$f":"IF(OR(AND(P3=\"F\",P5=\"F\"),AND(P3=\"A\",P5=\"A\")),N5,IF(OR(P3=\"F\",P3=\"A\"),N3,IF(OR(P5=\"F\",P5=\"A\"),N5,IF(P3=P5,\"\",(IF(P3<P5,N3,N5))))))","v":" "},{"$f":"IF(OR(AND(P3=\"F\",P5=\"F\"),AND(P3=\"A\",P5=\"A\")),O5,IF(OR(P3=\"F\",P3=\"A\"),O3,IF(OR(P5=\"F\",P5=\"A\"),O5,IF(P3=P5,\"\",(IF(P3<P5,P3-P5,P5-P3))))))","v":0},null,"Match 1 - Billard num  :",null,null,null,{"$f":"IF(OR(AND(P3=\"F\",P5=\"F\"),AND(P3=\"A\",P5=\"A\")),N3,IF(OR(P3=\"F\",P3=\"A\"),N5,IF(OR(P5=\"F\",P5=\"A\"),N3,IF(P3=P5,\"\",(IF(P3>P5,N3,N5))))))","v":"CABANET FLORENCE  "},{"$f":"IF(OR(AND(P3=\"F\",P5=\"F\"),AND(P3=\"A\",P5=\"A\")),O3,IF(OR(P3=\"F\",P3=\"A\"),O5,IF(OR(P5=\"F\",P5=\"A\"),O3,IF(P3=P5,\"\",(IF(P3>P5,P3-P5,P5-P3))))))","v":0},null,null,null,null,"Classement Poule 3",null,null,1,{"$f":"IF(N24=\"\",\"\",IF(N24=R4,R4,R8))","v":""},null,{"$f":"N3","v":"CABANET FLORENCE  "},{"$f":"IF(AD4=N3,IF(P5=\"F\",\"\",P3),0)","v":""},{"$f":"IF(AD4=N3,IF(P3=\"F\",\"\",P5),0)","v":"F"},{"$f":"IF(AD4=R4,IF(T8=\"F\",\"\",T4),0)","v":0},{"$f":"IF(AD4=R4,IF(T4=\"F\",\"\",T8),0)","v":0},{"$f":"IF(AD4=K4,IF(J8=\"F\",\"\",J4),0)","v":0},{"$f":"IF(AD4=K4,IF(J4=\"F\",\"\",J8),0)","v":0},{"$f":"IF(AD4=G6,IF(F10=\"F\",\"\",F6),0)","v":0},{"$f":"IF(AD4=G6,IF(F6=\"F\",\"\",F10),0)","v":0},{"$f":"IF(AD4=G20,IF(F16=\"F\",\"\",F20),0)","v":0},{"$f":"IF(AD4=G20,IF(F20=\"F\",\"\",F16),0)","v":0},{"$f":"SUM(AE4,AG4,AI4,AK4,AM4)","v":0},0,{"$f":"AO4-AP4","v":0}]
[null,null,null,null,null,null,null,"G7",null,null,null,null,null,{"$f":"P_C8","v":" "},null,"F",null,null,null,null,null,null,1,{"$f":"IF(OR(AND(P24=\"F\",P28=\"F\"),AND(P24=\"A\",P28=\"A\")),N24,IF(OR(P24=\"F\",P28=\"A\"),N28,IF(OR(P28=\"F\",P28=\"A\"),N24,IF(P24=P28,\"\",(IF(P24>P28,N24,N28))))))","v":""},{"$f":"QP1_AG","v":""},"C",3,{"$f":"IF(B8=\"\",\"\",IF(B8=G6,G6,G10))","v":""},null,{"$f":"N5","v":" "},{"$f":"IF(AD5=N5,IF(P3=\"F\",\"\",P5),0)","v":"F"},{"$f":"IF(AD5=N5,IF(P5=\"F\",\"\",P3),0)","v":""},{"$f":"IF(AD5=R4,IF(T8=\"F\",\"\",T4),0)","v":0},{"$f":"IF(AD5=R4,IF(T4=\"F\",\"\",T8),0)","v":0},{"$f":"IF(AD5=K4,IF(J8=\"F\",\"\",J4),0)","v":""},{"$f":"IF(AD5=K4,IF(J4=\"F\",\"\",J8),0)","v":""},{"$f":"IF(AD5=G6,IF(F10=\"F\",\"\",F6),0)","v":"F"},{"$f":"IF(AD5=G6,IF(F6=\"F\",\"\",F10),0)","v":""},{"$f":"IF(AD5=G20,IF(F16=\"F\",\"\",F20),0)","v":0},{"$f":"IF(AD5=G20,IF(F20=\"F\",\"\",F16),0)","v":0},0,0,{"$f":"AO5-AP5","v":0}]
[null,null,null,null,null,"F",{"$f":"IF(OR(J4=\"F\",J4=\"A\"),K8,IF(OR(J8=\"F\",J8=\"A\"),K4,IF(J4=J8,\"\",(IF(J4>J8,K4,K8)))))","v":" "},{"$f":"IF(OR(J4=\"F\",J4=\"A\"),L8,IF(OR(J8=\"F\",J8=\"A\"),L4,IF(J4=J8,\"\",(IF(J4>J8,J4-J8+L4,J8-J4+L8)))))","v":0},null,null,"Match 7 - Billard num :",null,null,null,null,null,null,"Match 5 - Billard num  :",null,null,null,null,2,{"$f":"IF(I24=I28,\"\",IF(I24>I28,G24,G28))","v":""},{"$f":"IF(OR(I24=\"F\",I28=\"A\"),H24,IF(OR(I24=\"A\",I28=\"F\"),H28,IF(I24=I28,\"\",(IF(I24>I28,I24-I28+H24,I28-I24+H28)))))","v":""},"G",5,{"$f":"IF(B8=\"\",\"\",IF(B8=G6,G10,G6))","v":""},null,{"$f":"N7","v":" "},{"$f":"IF(AD6=N7,IF(P9=\"F\",\"\",P7),0)","v":"F"},{"$f":"IF(AD6=N7,IF(P7=\"F\",\"\",P9),0)","v":""},{"$f":"IF(AD6=R8,IF(T4=\"F\",\"\",T8),0)","v":0},{"$f":"IF(AD6=R8,IF(T8=\"F\",\"\",T4),0)","v":0},{"$f":"IF(AD6=K8,IF(J4=\"F\",\"\",J8),0)","v":""},{"$f":"IF(AD6=K8,IF(J8=\"F\",\"\",J4),0)","v":""},{"$f":"IF(AD6=G6,IF(F10=\"F\",\"\",F6),0)","v":"F"},{"$f":"IF(AD6=G6,IF(F6=\"F\",\"\",F10),0)","v":""},{"$f":"IF(AD6=G20,IF(F16=\"F\",\"\",F20),0)","v":0},{"$f":"IF(AD6=G20,IF(F20=\"F\",\"\",F16),0)","v":0},0,0,{"$f":"AO6-AP6","v":0}]
{"$rows_left_out":23}
{"sheet":"4","index":7,"n_rows":28,"n_cols":43,"rows_kept":28,"cut":false,"hidden":false,"merged":[[21,5,21,9],[21,13,21,15],[10,14,10,17],[10,9,10,12],[20,10,20,18]]}
[]
[]
[null,null,null,null,null,null,null,null,null,null,null,"P1",null,{"$f":"P_D1","v":"LE GOFF THIERRY  "},null,null,null,"G1",null,null,null,null,null,null,null,null,null,null,null,null,"G","P","G","P","G","P","G","P","G","P","G","P","Ga"]
[null,null,null,null,null,null,null,null,null,"F",{"$f":"IF(OR(AND(P3=\"F\",P5=\"F\"),AND(P3=\"A\",P5=\"A\")),N5,IF(OR(P3=\"F\",P3=\"A\"),N3,IF(OR(P5=\"F\",P5=\"A\"),N5,IF(P3=P5,\"\",(IF(P3<P5,N3,N5))))))","v":" "},{"$f":"IF(OR(AND(P3=\"F\",P5=\"F\"),AND(P3=\"A\",P5=\"A\")),O5,IF(OR(P3=\"F\",P3=\"A\"),O3,IF(OR(P5=\"F\",P5=\"A\"),O5,IF(P3=P5,\"\",(IF(P3<P5,P3-P5,P5-P3))))))","v":0},null,"Match 1 - Billard num  :",null,null,null,{"$f":"IF(OR(AND(P3=\"F\",P5=\"F\"),AND(P3=\"A\",P5=\"A\")),N3,IF(OR(P3=\"F\",P3=\"A\"),N5,IF(OR(P5=\"F\",P5=\"A\"),N3,IF(P3=P5,\"\",(IF(P3>P5,N3,N5))))))","v":"LE GOFF THIERRY  "},{"$f":"IF(OR(AND(P3=\"F\",P5=\"F\"),AND(P3=\"A\",P5=\"A\")),O3,IF(OR(P3=\"F\",P3=\"A\"),O5,IF(OR(P5=\"F\",P5=\"A\"),O3,IF(P3=P5,\"\",(IF(P3>P5,P3-P5,P5-P3))))))","v":0},null,null,null,null,"Classement Poule 4",null,null,1,{"$f":"IF(N24=\"\",\"\",IF(N24=R4,R4,R8))","v":""},null,{"$f":"N3","v":"LE GOFF THIERRY  "},{"$f":"IF(AD4=N3,IF(P5=\"F\",\"\",P3),0)","v":""},{"$f":"IF(AD4=N3,IF(P3=\"F\",\"\",P5),0)","v":"F"},{"$f":"IF(AD4=R4,IF(T8=\"F\",\"\",T4),0)","v":0},{"$f":"IF(AD4=R4,IF(T4=\"F\",\"\",T8),0)","v":0},{"$f":"IF(AD4=K4,IF(J8=\"F\",\"\",J4),0)","v":0},{"$f":"IF(AD4=K4,IF(J4=\"F\",\"\",J8),0)","v":0},{"$f":"IF(AD4=G6,IF(F10=\"F\",\"\",F6),0)","v":0},{"$f":"IF(AD4=G6,IF(F6=\"F\",\"\",F10),0)","v":0},{"$f":"IF(AD4=G20,IF(F16=\"F\",\"\",F20),0)","v":0},{"$f":"IF(AD4=G20,IF(F20=\"F\",\"\",F16),0)","v":0},{"$f":"SUM(AE4,AG4,AI4,AK4,AM4)","v":0},0,{"$f":"AO4-AP4","v":0}]
[null,null,null,null,null,null,null,"G7",null,null,null,null,null,{"$f":"P_D8","v":" "},null,"F",null,null,null,null,null,null,1,{"$f":"IF(OR(AND(P24=\"F\",P28=\"F\"),AND(P24=\"A\",P28=\"A\")),N24,IF(OR(P24=\"F\",P28=\"A\"),N28,IF(OR(P28=\"F\",P28=\"A\"),N24,IF(P24=P28,\"\",(IF(P24>P28,N24,N28))))))","v":""},{"$f":"QP1_AG","v":""},"D",3,{"$f":"IF(B8=\"\",\"\",IF(B8=G6,G6,G10))","v":""},null,{"$f":"N5","v":" "},{"$f":"IF(AD5=N5,IF(P3=\"F\",\"\",P5),0)","v":"F"},{"$f":"IF(AD5=N5,IF(P5=\"F\",\"\",P3),0)","v":""},{"$f":"IF(AD5=R4,IF(T8=\"F\",\"\",T4),0)","v":0},{"$f":"IF(AD5=R4,IF(T4=\"F\",\"\",T8),0)","v":0},{"$f":"IF(AD5=K4,IF(J8=\"F\",\"\",J4),0)","v":""},{"$f":"IF(AD5=K4,IF(J4=\"F\",\"\",J8),0)","v":""},{"$f":"IF(AD5=G6,IF(F10=\"F\",\"\",F6),0)","v":"F"},{"$f":"IF(AD5=G6,IF(F6=\"F\",\"\",F10),0)","v":""},{"$f":"IF(AD5=G20,IF(F16=\"F\",\"\",F20),0)","v":0},{"$f":"IF(AD5=G20,IF(F20=\"F\",\"\",F16),0)","v":0},0,0,{"$f":"AO5-AP5","v":0}]
[null,null,null,null,null,"F",{"$f":"IF(OR(J4=\"F\",J4=\"A\"),K8,IF(OR(J8=\"F\",J8=\"A\"),K4,IF(J4=J8,\"\",(IF(J4>J8,K4,K8)))))","v":" "},{"$f":"IF(OR(J4=\"F\",J4=\"A\"),L8,IF(OR(J8=\"F\",J8=\"A\"),L4,IF(J4=J8,\"\",(IF(J4>J8,J4-J8+L4,J8-J4+L8)))))","v":0},null,null,"Match 7 - Billard num :",null,null,null,null,null,null,"Match 5 - Billard num  :",null,null,null,null,2,{"$f":"IF(I24=I28,\"\",IF(I24>I28,G24,G28))","v":""},{"$f":"IF(OR(I24=\"F\",I28=\"A\"),H24,IF(OR(I24=\"A\",I28=\"F\"),H28,IF(I24=I28,\"\",(IF(I24>I28,I24-I28+H24,I28-I24+H28)))))","v":""},"H",5,{"$f":"IF(B8=\"\",\"\",IF(B8=G6,G10,G6))","v":""},null,{"$f":"N7","v":" "},{"$f":"IF(AD6=N7,IF(P9=\"F\",\"\",P7),0)","v":"F"},{"$f":"IF(AD6=N7,IF(P7=\"F\",\"\",P9),0)","v":""},{"$f":"IF(AD6=R8,IF(T4=\"F\",\"\",T8),0)","v":0},{"$f":"IF(AD6=R8,IF(T8=\"F\",\"\",T4),0)","v":0},{"$f":"IF(AD6=K8,IF(J4=\"F\",\"\",J8),0)","v":""},{"$f":"IF(AD6=K8,IF(J8=\"F\",\"\",J4),0)","v":""},{"$f":"IF(AD6=G6,IF(F10=\"F\",\"\",F6),0)","v":"F"},{"$f":"IF(AD6=G6,IF(F6=\"F\",\"\",F10),0)","v":""},{"$f":"IF(AD6=G20,IF(F16=\"F\",\"\",F20),0)","v":0},{"$f":"IF(AD6=G20,IF(F20=\"F\",\"\",F16),0)","v":0},0,0,{"$f":"AO6-AP6","v":0}]
{"$rows_left_out":23}
{"sheet":"Final","index":8,"n_rows":69,"n_cols":56,"rows_kept":69,"cut":false,"hidden":false,"merged":[[2,11,2,13],[2,3,2,5],[30,16,30,17],[0,3,0,5],[1,3,1,5],[1,18,1,20],[1,24,1,26],[1,30,1,32],[0,11,0,13],[1,11,1,13],[0,30,0,32],[0,24,0,26],[0,18,0,20]]}
[null,null,null,"1/16 de finale",null,null,null,null,null,null,null,"1/8 de finale",null,null,null,null,null,null,"1/4 de finale",null,null,null,null,null,"1/2 finale",null,null,null,null,null,"Finale"]
[null,null,null,"(4 manches)",null,null,null,null,null,null,null,"(4 manches)",null,null,null,null,null,null,"(4 manches)",null,null,null,null,null,"(4 manches)",null,null,null,null,null,"(5 manches)"]
[null,null,null,"Entrée des TSB",null,null,null,null,null,null,null,"Entrée des TSA"]
[]
[]
[null,null,null,null,null,"GA","CF","RF","N°",null,null,null,null,"GA","CF","RF","N°"]
{"$rows_left_out":64}
{"sheet":"Billards","index":9,"n_rows":53,"n_cols":21,"rows_kept":53,"cut":false,"hidden":true,"merged":[[0,1,0,3],[0,4,0,6],[0,7,0,9],[0,10,0,12],[0,18,0,20]]}
[null,"Poule1",null,null,"Poule 2",null,null,"Poule3",null,null,"Poule4",null,null,null,null,null,null,null,"Concatenation"]
[null,"Billard","Score A","Score B","Billard","Score A","Score B","Billard","Score A","Score B","Billard","Score A","Score B",null,1,"O4","P3","P5",{"$f":"\"=\"&\"'\"&O2&\"'\"&\"!\"&P2","v":"='1'!O4"},{"$f":"\"=\"&\"'\"&O2&\"'\"&\"!\"&Q2","v":"='1'!P3"},{"$f":"\"=\"&\"'\"&O2&\"'\"&\"!\"&R2","v":"='1'!P5"}]
["Match 1",{"$f":"J23","v":0},{"$f":"'1'!P3","v":0},{"$f":"'1'!P5","v":"F"},{"$f":"'2'!O4","v":0},{"$f":"'2'!P3","v":0},{"$f":"'2'!P5","v":"F"},{"$f":"'3'!O4","v":0},{"$f":"'3'!P3","v":0},{"$f":"'3'!P5","v":"F"},{"$f":"'4'!O4","v":0},{"$f":"'4'!P3","v":0},{"$f":"'4'!P5","v":"F"},null,1,"O8","P7","P9","='1'!O8","='1'!P7","='1'!P9"]
["Match 2",{"$f":"'1'!O8","v":0},{"$f":"'1'!P7","v":0},{"$f":"'1'!P9","v":0},{"$f":"'2'!O8","v":0},{"$f":"'2'!P7","v":0},{"$f":"'2'!P9","v":0},{"$f":"'3'!O8","v":0},{"$f":"'3'!P7","v":"F"},{"$f":"'3'!P9","v":0},{"$f":"'4'!O8","v":0},{"$f":"'4'!P7","v":"F"},{"$f":"'4'!P9","v":0},null,1,"O14","P13","P15","='1'!O14","='1'!P13","='1'!P15"]
["Match 3",{"$f":"'1'!O14","v":0},{"$f":"'1'!P13","v":0},{"$f":"'1'!P15","v":"F"},{"$f":"'2'!O14","v":0},{"$f":"'2'!P13","v":0},{"$f":"'2'!P15","v":"F"},{"$f":"'3'!O14","v":0},{"$f":"'3'!P13","v":0},{"$f":"'3'!P15","v":"F"},{"$f":"'4'!O14","v":0},{"$f":"'4'!P13","v":0},{"$f":"'4'!P15","v":"F"},null,1,"O18","P17","P19","='1'!O18","='1'!P17","='1'!P19"]
["Match 4",{"$f":"'1'!O18","v":0},{"$f":"'1'!P17","v":"F"},{"$f":"'1'!P19","v":0},{"$f":"'2'!O18","v":0},{"$f":"'2'!P17","v":"F"},{"$f":"'2'!P19","v":0},{"$f":"'3'!O18","v":0},{"$f":"'3'!P17","v":"F"},{"$f":"'3'!P19","v":0},{"$f":"'4'!O18","v":0},{"$f":"'4'!P17","v":"F"},{"$f":"'4'!P19","v":0},null,1,"S6","T4","T8","='1'!S6","='1'!T4","='1'!T8"]
{"$rows_left_out":48}
{"sheet":"Classement","index":10,"n_rows":70,"n_cols":15,"rows_kept":70,"cut":false,"hidden":true,"merged":[[33,14,48,14],[5,14,8,14],[3,14,4,14],[9,14,16,14],[17,14,24,14],[25,14,32,14]]}
[null,null,"Formules Initiales","Nom & Prénom","Place","Points","GA","CF","RF","Club","Ville","Licence","Division"]
[null,null,1,{"$f":"Vainqueur","v":""},1,200,{"$f":"Final!AL18","v":""},0,0,{"$f":"VLOOKUP(D2,'Listing joueurs'!B:E,2,TRUE)","v":{"$error":"#N/A"}},{"$f":"VLOOKUP(D2,'Listing joueurs'!B:E,3,TRUE)","v":{"$error":"#N/A"}},{"$f":"VLOOKUP(D2,'Listing joueurs'!B:E,4,TRUE)","v":{"$error":"#N/A"}},"R1",null,"Vainqueur"]
[null,null,2,{"$f":"IF(Final!AG12>Final!AG24,Final!AE24,Final!AE12)","v":""},2,180,{"$f":"IF(Final!AG12<Final!AG24,Final!AG12-Final!AG24+Final!AF12,Final!AG24-Final!AG12+Final!AF24)","v":{"$error":"#VALUE!"}},1,0,{"$f":"VLOOKUP(D3,'Listing joueurs'!B:E,2,TRUE)","v":{"$error":"#N/A"}},{"$f":"VLOOKUP(D3,'Listing joueurs'!B:E,3,TRUE)","v":{"$error":"#N/A"}},{"$f":"VLOOKUP(D3,'Listing joueurs'!B:E,4,TRUE)","v":{"$error":"#N/A"}},"R1",null,"Finaliste"]
[null,null,3,{"$f":"Clst_3","v":0},3,161,{"$f":"Clst_GA_3","v":0},{"$f":"Clst_CF_03","v":0},{"$f":"Clst_RF_03","v":0},{"$f":"VLOOKUP(D4,'Listing joueurs'!B:E,2,TRUE)","v":{"$error":"#N/A"}},{"$f":"VLOOKUP(D4,'Listing joueurs'!B:E,3,TRUE)","v":{"$error":"#N/A"}},{"$f":"VLOOKUP(D4,'Listing joueurs'!B:E,4,TRUE)","v":{"$error":"#N/A"}},"R1",null,"Perdants en 1/2 Finale"]
[null,null,4,{"$f":"Clst_4","v":0},4,161,{"$f":"Clst_GA_4","v":0},{"$f":"Clst_CF_04","v":0},{"$f":"Clst_RF_04","v":0},{"$f":"VLOOKUP(D5,'Listing joueurs'!B:E,2,TRUE)","v":{"$error":"#N/A"}},{"$f":"VLOOKUP(D5,'Listing joueurs'!B:E,3,TRUE)","v":{"$error":"#N/A"}},{"$f":"VLOOKUP(D5,'Listing joueurs'!B:E,4,TRUE)","v":{"$error":"#N/A"}},"R1"]
[null,null,5,{"$f":"Clst_5","v":0},5,143,{"$f":"Clst_5_GA","v":0},{"$f":"Clst_5_CF","v":0},{"$f":"Clst_5_RF","v":0},{"$f":"VLOOKUP(D6,'Listing joueurs'!B:E,2,TRUE)","v":{"$error":"#N/A"}},{"$f":"VLOOKUP(D6,'Listing joueurs'!B:E,3,TRUE)","v":{"$error":"#N/A"}},{"$f":"VLOOKUP(D6,'Listing joueurs'!B:E,4,TRUE)","v":{"$error":"#N/A"}},"R1",null,"Perdants en 1/4\nde Finale"]
{"$rows_left_out":65}
{"sheet":"Points","index":11,"n_rows":68,"n_cols":8,"rows_kept":68,"cut":false,"hidden":true,"merged":[]}
["Place","R1","R2","R3"]
[1,200,200,93]
[2,180,180,79]
[3,161,161,66]
[4,161,161,66,null,null,{"$f":"IF(AND(#REF!=\"A\",#REF!=\"A\"),#REF!,IF(#REF!=\"A\",#REF!,IF(#REF!=\"A\",#REF!,IF(#REF!=#REF!,\"\",(IF(#REF!>#REF!,#REF!,#REF!))))))","v":{"$error":"#REF!"}},{"$f":"IF(AND(#REF!=\"A\",#REF!=\"A\"),#REF!,IF(#REF!=\"A\",#REF!,IF(#REF!=\"A\",#REF!,IF(#REF!=#REF!,\"\",(IF(#REF!>#REF!,#REF!+#REF!-#REF!,#REF!+#REF!-#REF!))))))","v":{"$error":"#REF!"}}]
[5,143,143,54,null,null,{"$f":"IF(AND(#REF!=\"A\",#REF!=\"A\"),#REF!,IF(#REF!=\"A\",#REF!,IF(#REF!=\"A\",#REF!,IF(#REF!=#REF!,\"\",(IF(#REF!>#REF!,#REF!,#REF!))))))","v":{"$error":"#REF!"}},{"$f":"IF(AND(#REF!=\"A\",#REF!=\"A\"),#REF!,IF(#REF!=\"A\",#REF!,IF(#REF!=\"A\",#REF!,IF(#REF!=#REF!,\"\",(IF(#REF!>#REF!,#REF!+#REF!-#REF!,#REF!+#REF!-#REF!))))))","v":{"$error":"#REF!"}}]
{"$rows_left_out":63}
{"sheet":"Parametres","index":12,"n_rows":29,"n_cols":5,"rows_kept":29,"cut":false,"hidden":true,"merged":[]}
[]
[]
[]
[]
[]
[]
{"$rows_left_out":23}