{"text_format":"1","workbook":"xlsx","n_sheets":13,"sheets":["Listing joueurs","Liste Joueurs","Calcul","Poules","1","2","3","4","Final","Billards","Classement","Points","Parametres"],"not_rendered":{"charts":0,"images":5,"macros":1,"external_links":8,"defined_names":337,"comments":0,"pivot_tables":0},"unopened":[],"bounds":{"document_bytes":16777216,"sheet_cells":100000,"rows_first":2000,"rows_last":500,"rows_between":2000,"halvings":0,"cell_chars":16384,"cell_head_chars":4096},"cells_cut":0,"cells_raw":0,"read":"whole","date_system":"1900"}

{"sheet":"Listing joueurs","index":0,"n_rows":41,"n_cols":10,"rows_kept":41,"cut":false,"hidden":false,"merged":[]}
["Num","Concaténation","Groupe Sportif","Ville","Licence","Nom","Prénom"]
[1,{"$f":"F2&\" \"&G2","v":"BACCAM BOUNLIENG"},"NIGHT BILLARD CLUB","BEAUREGARD","137597F","BACCAM","BOUNLIENG"]
[2,"BACCAM HELENE","NIGHT BILLARD CLUB","BEAUREGARD","146104K","BACCAM","HELENE"]
[3,"BOBROSKY BERNARD","NIGHT BILLARD CLUB","BEAUREGARD","156618M","BOBROSKY","BERNARD"]
[4,"BONTEMPS MIKAEL","NIGHT BILLARD CLUB","BEAUREGARD","150507V","BONTEMPS","MIKAEL"]
[5,"BRENDEL CHRISTIAN","NIGHT BILLARD CLUB","BEAUREGARD","135920S","BRENDEL","CHRISTIAN"]
[6,"BRUNET MAURICE","BILLARD CLUB DE BOURG EN BRESSE","BOURG EN BRESSE","156980F","BRUNET","MAURICE"]
[7,"CABANET FLORENCE","NIGHT BILLARD CLUB","BEAUREGARD","150869N","CABANET","FLORENCE"]
[8,"CHAIR MOURAD","NIGHT BILLARD CLUB","BEAUREGARD","148985Q","CHAIR","MOURAD"]
[9,"CHIEZE MIREILLE","NIGHT BILLARD CLUB","BEAUREGARD","128996K","CHIEZE","MIREILLE"]
[10,"COLLET AURELIE","BILLARD CLUB DE BOURG EN BRESSE","BOURG EN BRESSE","150509X","COLLET","AURELIE"]
[11,"DI BELLA STEPHANIE","NIGHT BILLARD CLUB","BEAUREGARD","155784F","DI BELLA","STEPHANIE"]
[12,"DUDIT FABIEN","BILLARD CLUB DE BOURG EN BRESSE","BOURG EN BRESSE","130105B","DUDIT","FABIEN"]
[13,"ENGEL JEAN MARIE","NIGHT BILLARD CLUB","BEAUREGARD","152851S","ENGEL","JEAN MARIE"]
[14,"GARNIER NICOLAS","BILLARD CLUB DE BOURG EN BRESSE","BOURG EN BRESSE","145371F","GARNIER","NICOLAS"]
[15,"HERRY MIREILLE","NIGHT BILLARD CLUB","BEAUREGARD","152190Z","HERRY","MIREILLE"]
[16,"HISIGER CHARLOTTE","NIGHT BILLARD CLUB","BEAUREGARD","158397W","HISIGER","CHARLOTTE"]
[17,"HISIGER KELLY","NIGHT BILLARD CLUB","BEAUREGARD","156933E","HISIGER","KELLY"]
[18,"KAABECHE RIAD","NIGHT BILLARD CLUB","BEAUREGARD","163595W","KAABECHE","RIAD"]
[19,"KLEIN STEPHANE","NIGHT BILLARD CLUB","BEAUREGARD","148984P","KLEIN","STEPHANE"]
[20,"LACROIX DYLAN","NIGHT BILLARD CLUB","BEAUREGARD","152192B","LACROIX","DYLAN"]
[21,"LACROIX VALERIE","NIGHT BILLARD CLUB","BEAUREGARD","152915M","LACROIX","VALERIE"]
[22,{"$f":"F23&\" \"&G23","v":"LE GOFF THIERRY"},"NIGHT BILLARD CLUB","BEAUREGARD","160236V","LE GOFF","THIERRY"]
[23,"LETOURNEUR SEBASTIEN","BILLARD CLUB DE BOURG EN BRESSE","BOURG EN BRESSE","135922U","LETOURNEUR","SEBASTIEN"]
[24,"MANDY NATHALIE","BILLARD CLUB DE BOURG EN BRESSE","BOURG EN BRESSE","135919R","MANDY","NATHALIE"]
[25,"MIRTO EVELYNE","NIGHT BILLARD CLUB","BEAUREGARD","156415R","MIRTO","EVELYNE"]
[26,"MOREL SYLVAIN","NIGHT BILLARD CLUB","BEAUREGARD","152633F","MOREL","SYLVAIN"]
[27,"NGUYEN MICHEL","NIGHT BILLARD CLUB","BEAUREGARD","138325F","NGUYEN","MICHEL"]
[28,"NOCERA GIUSEPPE","NIGHT BILLARD CLUB","BEAUREGARD","153712D","NOCERA","GIUSEPPE"]
[29,"PARDO RAMON","NIGHT BILLARD CLUB","BEAUREGARD","158398X","PARDO","RAMON"]
[30,"POTIQUET SEBASTIEN","BILLARD CLUB DE BOURG EN BRESSE","BOURG EN BRESSE","131278E","POTIQUET","SEBASTIEN"]
[31,"REDON VALERIE","NIGHT BILLARD CLUB","BEAUREGARD","152167Z","REDON","VALERIE"]
[32,"ROBEZ FLORENT","NIGHT BILLARD CLUB","BEAUREGARD","140694I","ROBEZ","FLORENT"]
[33,"ROZIER MYRIAM","NIGHT BILLARD CLUB","BEAUREGARD","156252P","ROZIER","MYRIAM"]
[34,"SOPIC NICOLAS","NIGHT BILLARD CLUB","BEAUREGARD","128998M","SOPIC","NICOLAS"]
[35,"TEBBANI AZIZ","NIGHT BILLARD CLUB","BEAUREGARD","128999N","TEBBANI","AZIZ"]
[36,"THENET JESSY","NIGHT BILLARD CLUB","BEAUREGARD","153187H","THENET","JESSY"]
[37,"URAY JIMMY","NIGHT BILLARD CLUB","BEAUREGARD","138326G","URAY","JIMMY"]
[38,"VALLOT PATRICE","BILLARD CLUB DE BOURG EN BRESSE","BOURG EN BRESSE","156333C","VALLOT","PATRICE",null,null,{"$f":"VLOOKUP(#REF!,Lst_Joueurs[#All],3)","v":{"$error":"#REF!"}}]
[39,"VALLOT ROMAIN","BILLARD CLUB DE BOURG EN BRESSE","BOURG EN BRESSE","156334D","VALLOT","ROMAIN"]
[40,"VAPILLON DANIEL","NIGHT BILLARD CLUB","BEAUREGARD","152287E","VAPILLON","DANIEL"]

{"sheet":"Liste Joueurs","index":1,"n_rows":141,"n_cols":7,"rows_kept":141,"cut":false,"hidden":false,"merged":[]}
[null,"Nom","Prénom",null,"Concatenation","Présent","Horaires "]
[null,"DUDIT FABIEN ",null,1,{"$f":"B2&\" \"&C2","v":"DUDIT FABIEN  "},null,"14H00"]
[null,"GARNIER NICOLAS ",null,2,{"$f":"B3&\" \"&C3","v":"GARNIER NICOLAS  "},null,"14H00"]
[null,"LACROIX DYLAN ",null,3,"LACROIX DYLAN  ",null,"14H00"]
[null,"ROBEZ FLORENT ",null,4,"ROBEZ FLORENT  ",null,"14H00"]
[null,"BACCAM BOUNLIENG ",null,5,"BACCAM BOUNLIENG  ",null,"14H00"]
[null,"URAY JIMMY ",null,6,"URAY JIMMY  ",null,"14H00"]
["A","POTIQUET SEBASTIEN ",null,7,"POTIQUET SEBASTIEN  ",null,"14H00"]
["F","LETOURNEUR SEBASTIEN ",null,8,"LETOURNEUR SEBASTIEN  ",null,"14H00"]
[0,"SOPIC NICOLAS ",null,9,{"$f":"B10&\" \"&C10","v":"SOPIC NICOLAS  "},null,"11h00"]
[1,"KLEIN STEPHANE ",null,10,"KLEIN STEPHANE  ",null,"11h00"]
[2,"NGUYEN MICHEL ",null,11,"NGUYEN MICHEL  ",null,"11h00"]
[3,"PARDO RAMON ",null,12,"PARDO RAMON  ",null,"11h00"]
[null,"CHAIR MOURAD ",null,13,"CHAIR MOURAD  ",null,"11h00"]
["F","TEBBANI AZIZ ",null,14,"TEBBANI AZIZ  ",null,"11h00"]
["A","VAPILLON DANIEL ",null,15,"VAPILLON DANIEL  ",null,"11h00"]
[0,"HERRY MIREILLE ",null,16,"HERRY MIREILLE  ",null,"11h00"]
[1,"CHIEZE MIREILLE ",null,17,"CHIEZE MIREILLE  ",null,"9H00"]
[2,"BRENDEL CHRISTIAN ",null,18,"BRENDEL CHRISTIAN  ",null,"9H00"]
[3,"CABANET FLORENCE ",null,19,"CABANET FLORENCE  ",null,"9H00"]
[4,"LE GOFF THIERRY ",null,20,"LE GOFF THIERRY  ",null,"9H00"]
[null,"VALLOT ROMAIN ",null,21,"VALLOT ROMAIN  ",null,"9H00"]
["F","BRUNET MAURICE ",null,22,"BRUNET MAURICE  ",null,"9H00"]
["A","MANDY NATHALIE ",null,23,"MANDY NATHALIE  ",null,"9H00"]
[0,"REDON VALERIE ",null,24,"REDON VALERIE  ",null,"9H00"]
[1,"DI BELLA STEPHANIE ",null,25,"DI BELLA STEPHANIE  ",null,"9H00"]
[2,"HISIGER KELLY ",null,26,"HISIGER KELLY  ",null,"9H00"]
[3,"MIRTO EVELYNE ",null,27,"MIRTO EVELYNE  ",null,"9H00"]
[4,"ROZIER MYRIAM ",null,28,"ROZIER MYRIAM  ",null,"9H00"]
[null,"BACCAM HELENE ",null,29,"BACCAM HELENE  ",null,"9H00"]
["F","HISIGER CHARLOTTE ",null,30,"HISIGER CHARLOTTE  ",null,"9H00"]
["A","KAABECHE RIAD ",null,31,"KAABECHE RIAD  ",null,"9H00"]
[0,"MOREL SYLVAIN ",null,32,"MOREL SYLVAIN  ",null,"9H00"]
[1,"NOCERA GIUSEPPE ",null,33,"NOCERA GIUSEPPE  ",null,"9H00"]
[2,"LACROIX VALERIE ",null,34,"LACROIX VALERIE  ",null,"9H00"]
[3,null,null,35," ",null,"9H00"]
[4,null,null,36," ",null,"9H00"]
[null,null,null,37," ",null,"9H00"]
["F",null,null,38," ",null,"9H00"]
["A",null,null,39," ",null,"9H00"]
[0,null,null,40,{"$f":"B38&\" \"&C41","v":" "},null,"9H00"]
[1,null,null,41,{"$f":"B39&\" \"&C42","v":" "},null,"9H00"]
[2,null,null,42,{"$f":"B40&\" \"&C43","v":" "},null,"9H00"]
[3,null,null,43,{"$f":"B41&\" \"&C44","v":" "},null,"9H00"]
[4,null,null,44,{"$f":"B42&\" \"&C45","v":" "},null,"9H00"]
[5,null,null,45,{"$f":"B43&\" \"&C46","v":" "},null,"9H00"]
[null,null,null,46,{"$f":"B44&\" \"&C47","v":" "},null,"9H00"]
["F",null,null,47,{"$f":"B45&\" \"&C48","v":" "},null,"9H00"]
["A",null,null,48,{"$f":"B46&\" \"&C49","v":" "},null,"9H00"]
[0]
[1]
[2]
[3]
[4]
[]
[]
[1]
[2,null,null,null,{"$f":"B55&\" \"&C58","v":" "}]
[3]
[4]
[5]
[6]
[7]
[8]
[9]
[10,null,null,null,{"$f":"B63&\" \"&C66","v":" "}]
[11]
[12]
[13]
[14]
[15]
[16]
[17]
[18]
[19]
[20]
[21]
[22]
[23]
[24]
["A"]
["B"]
["C"]
["D"]
["E"]
["F"]
["G"]
["H"]
["I"]
["J"]
["K"]
["L"]
["M"]
["N"]
["O"]
["P"]
["Q"]
[]
[]
[]
[]
[]
[]
[]
[]
[]
[]
[]
[]
[]
[]
[]
[]
[]
[]
[]
[]
[]
[]
[]
[]
[]
[]
[]
[]
[]
[]
[]
[]
[]
[]
[]
[]
[]
[]
[]
[]
[]
[]
[]
["DAMIENFFB8POOL"]

{"sheet":"Calcul","index":2,"n_rows":50,"n_cols":5,"rows_kept":50,"cut":false,"hidden":false,"merged":[[17,2,17,3],[0,3,0,4]]}
["Classement","Tête de \nSérie","Horaires","Joueurs"]
[1,"TSA","14H00",null,{"$f":"'Liste Joueurs'!E2","v":"DUDIT FABIEN  "}]
[2,"TSA","14H00",null,{"$f":"'Liste Joueurs'!E3","v":"GARNIER NICOLAS  "}]
[3,"TSA","14H00",null,{"$f":"'Liste Joueurs'!E4","v":"LACROIX DYLAN  "}]
[4,"TSA","14H00",null,{"$f":"'Liste Joueurs'!E5","v":"ROBEZ FLORENT  "}]
[5,"TSA","14H00",null,{"$f":"'Liste Joueurs'!E6","v":"BACCAM BOUNLIENG  "}]
[6,"TSA","14H00",null,{"$f":"'Liste Joueurs'!E7","v":"URAY JIMMY  "}]
[7,"TSA","14H00",null,{"$f":"'Liste Joueurs'!E8","v":"POTIQUET SEBASTIEN  "}]
[8,"TSA","14H00",null,{"$f":"'Liste Joueurs'!E9","v":"LETOURNEUR SEBASTIEN  "}]
[9,"TSB","11h00",null,{"$f":"'Liste Joueurs'!E10","v":"SOPIC NICOLAS  "}]
[10,"TSB","11h00",null,{"$f":"'Liste Joueurs'!E11","v":"KLEIN STEPHANE  "}]
[11,"TSB","11h00",null,{"$f":"'Liste Joueurs'!E12","v":"NGUYEN MICHEL  "}]
[12,"TSB","11h00",null,{"$f":"'Liste Joueurs'!E13","v":"PARDO RAMON  "}]
[13,"TSB","11h00",null,{"$f":"'Liste Joueurs'!E14","v":"CHAIR MOURAD  "}]
[14,"TSB","11h00",null,{"$f":"'Liste Joueurs'!E15","v":"TEBBANI AZIZ  "}]
[15,"TSB","11h00",null,{"$f":"'Liste Joueurs'!E16","v":"VAPILLON DANIEL  "}]
[16,"TSB","11h00",null,{"$f":"'Liste Joueurs'!E17","v":"HERRY MIREILLE  "}]
[null,"Classement\nHors TS","Poule",null,"Horaires 9H00"]
[17,{"$f":"SUM(A19-16)","v":1},"A",1,{"$f":"'Liste Joueurs'!E18","v":"CHIEZE MIREILLE  "}]
[18,{"$f":"SUM(A20-16)","v":2},"B",1,{"$f":"'Liste Joueurs'!E19","v":"BRENDEL CHRISTIAN  "}]
[19,3,"C",1,{"$f":"'Liste Joueurs'!E20","v":"CABANET FLORENCE  "}]
[20,4,"D",1,{"$f":"'Liste Joueurs'!E21","v":"LE GOFF THIERRY  "}]
[21,5,"D",2,{"$f":"'Liste Joueurs'!E22","v":"VALLOT ROMAIN  "}]
[22,6,"C",2,{"$f":"'Liste Joueurs'!E23","v":"BRUNET MAURICE  "}]
[23,7,"B",2,{"$f":"'Liste Joueurs'!E24","v":"MANDY NATHALIE  "}]
[24,8,"A",2,{"$f":"'Liste Joueurs'!E25","v":"REDON VALERIE  "}]
[25,9,"A",3,{"$f":"'Liste Joueurs'!E26","v":"DI BELLA STEPHANIE  "}]
[26,10,"B",3,{"$f":"'Liste Joueurs'!E27","v":"HISIGER KELLY  "}]
[27,11,"C",3,{"$f":"'Liste Joueurs'!E28","v":"MIRTO EVELYNE  "}]
[28,12,"D",3,{"$f":"'Liste Joueurs'!E29","v":"ROZIER MYRIAM  "}]
[29,13,"D",4,{"$f":"'Liste Joueurs'!E30","v":"BACCAM HELENE  "}]
[30,14,"C",4,{"$f":"'Liste Joueurs'!E31","v":"HISIGER CHARLOTTE  "}]
[31,15,"B",4,{"$f":"'Liste Joueurs'!E32","v":"KAABECHE RIAD  "}]
[32,16,"A",4,{"$f":"'Liste Joueurs'!E33","v":"MOREL SYLVAIN  "}]
[33,17,"A",5,{"$f":"'Liste Joueurs'!E34","v":"NOCERA GIUSEPPE  "}]
[34,18,"B",5,{"$f":"'Liste Joueurs'!E35","v":"LACROIX VALERIE  "}]
[35,19,"C",5,{"$f":"'Liste Joueurs'!E36","v":" "}]
[36,20,"D",5,{"$f":"'Liste Joueurs'!E37","v":" "}]
[37,21,"D",6,{"$f":"'Liste Joueurs'!E38","v":" "}]
[38,22,"C",6,{"$f":"'Liste Joueurs'!E39","v":" "}]
[39,23,"B",6,{"$f":"'Liste Joueurs'!E40","v":" "}]
[40,24,"A",6,{"$f":"'Liste Joueurs'!E41","v":" "}]
[41,25,"A",7,{"$f":"'Liste Joueurs'!E42","v":" "}]
[42,26,"B",7,{"$f":"'Liste Joueurs'!E43","v":" "}]
[43,27,"C",7,{"$f":"'Liste Joueurs'!E44","v":" "}]
[44,28,"D",7,{"$f":"'Liste Joueurs'!E45","v":" "}]
[45,29,"D",8,{"$f":"'Liste Joueurs'!E46","v":" "}]
[46,30,"C",8,{"$f":"'Liste Joueurs'!E47","v":" "}]
[47,31,"B",8,{"$f":"'Liste Joueurs'!E48","v":" "}]
[48,32,"A",8,{"$f":"'Liste Joueurs'!E49","v":" "}]

{"sheet":"Poules","index":3,"n_rows":28,"n_cols":7,"rows_kept":28,"cut":false,"hidden":false,"merged":[[0,1,0,4],[26,6,26,7],[27,6,27,7],[28,6,28,7],[24,6,24,7],[22,6,22,7],[23,6,23,7],[21,6,21,7],[20,1,20,7],[25,6,25,7],[11,3,11,4],[11,5,11,6]]}
[null,"Poule de 8 joueurs pour le 2 X KO"]
[null,"Poule A/1","Poule B/2","Poule C/3 ","Poule D/4"]
["Joueur 1",{"$f":"P_A1","v":"CHIEZE MIREILLE  "},{"$f":"P_B1","v":"BRENDEL CHRISTIAN  "},{"$f":"P_C1","v":"CABANET FLORENCE  "},{"$f":"P_D1","v":"LE GOFF THIERRY  "}]
["Joueur 2",{"$f":"P_A8","v":" "},{"$f":"P_B8","v":" "},{"$f":"P_C8","v":" "},{"$f":"P_D8","v":" "}]
["Joueur 3",{"$f":"P_A5","v":"NOCERA GIUSEPPE  "},{"$f":"P_B5","v":"LACROIX VALERIE  "},{"$f":"P_C5","v":" "},{"$f":"P_D5","v":" "}]
["Joueur 4",{"$f":"P_A4","v":"MOREL SYLVAIN  "},{"$f":"P_B4","v":"KAABECHE RIAD  "},{"$f":"P_C4","v":"HISIGER CHARLOTTE  "},{"$f":"P_D4","v":"BACCAM HELENE  "}]
["Joueur 5",{"$f":"P_A3","v":"DI BELLA STEPHANIE  "},{"$f":"P_B3","v":"HISIGER KELLY  "},{"$f":"P_C3","v":"MIRTO EVELYNE  "},{"$f":"P_D3","v":"ROZIER MYRIAM  "}]
["Joueur 6",{"$f":"P_A6","v":" "},{"$f":"P_B6","v":" "},{"$f":"P_C6","v":" "},{"$f":"P_D6","v":" "}]
["Joueur 7",{"$f":"P_A7","v":" "},{"$f":"P_B7","v":" "},{"$f":"P_C7","v":" "},{"$f":"P_D7","v":" "}]
["Joueur 8",{"$f":"P_A2","v":"REDON VALERIE  "},{"$f":"P_B2","v":"MANDY NATHALIE  "},{"$f":"P_C2","v":"BRUNET MAURICE  "},{"$f":"P_D2","v":"VALLOT ROMAIN  "}]
[]
["Ordre",null,null,"Casse Ferme",null,"Reprise Ferme"]
[1]
[8]
[5]
[4]
[3]
[6]
[7]
[2]
[null,"ABSENT LE 11/10/2015"]
[null,"Nom","Prénom",null,"Concatenation","Présent","Excuses"]
[null,null,null,null,null,null,"N/A"]
[null,null,null,null,null,null,"N/A"]
[null,null,null,null,null,null,"N/A"]
[null,null,null,null,null,null,"N/A"]
[null,null,null,null,null,null,"N/A"]
[null,null,null,null,null,null,"N/A"]

{"sheet":"1","index":4,"n_rows":28,"n_cols":43,"rows_kept":28,"cut":false,"hidden":false,"merged":[[21,5,21,9],[21,13,21,15],[10,9,10,12],[10,14,10,17],[28,13,28,17]]}
[]
[]
[null,null,null,null,null,null,null,null,null,null,null,"P1",null,{"$f":"P_A1","v":"CHIEZE MIREILLE  "},null,null,null,"G1",null,null,null,null,null,null,null,null,null,null,null,null,"G","P","G","P","G","P","G","P","G","P","G","P","Ga"]
[null,null,null,null,null,null,null,null,null,"F",{"$f":"IF(OR(AND(P3=\"F\",P5=\"F\"),AND(P3=\"A\",P5=\"A\")),N5,IF(OR(P3=\"F\",P3=\"A\"),N3,IF(OR(P5=\"F\",P5=\"A\"),N5,IF(P3=P5,\"\",(IF(P3<P5,N3,N5))))))","v":" "},{"$f":"IF(OR(AND(P3=\"F\",P5=\"F\"),AND(P3=\"A\",P5=\"A\")),O5,IF(OR(P3=\"F\",P3=\"A\"),O3,IF(OR(P5=\"F\",P5=\"A\"),O5,IF(P3=P5,\"\",(IF(P3<P5,P3-P5,P5-P3))))))","v":0},null,"Match 1 - Billard num  :",null,null,null,{"$f":"IF(OR(AND(P3=\"F\",P5=\"F\"),AND(P3=\"A\",P5=\"A\")),N3,IF(OR(P3=\"F\",P3=\"A\"),N5,IF(OR(P5=\"F\",P5=\"A\"),N3,IF(P3=P5,\"\",(IF(P3>P5,N3,N5))))))","v":"CHIEZE MIREILLE  "},{"$f":"IF(OR(AND(P3=\"F\",P5=\"F\"),AND(P3=\"A\",P5=\"A\")),O3,IF(OR(P3=\"F\",P3=\"A\"),O5,IF(OR(P5=\"F\",P5=\"A\"),O3,IF(P3=P5,\"\",(IF(P3>P5,P3-P5,P5-P3))))))","v":0},null,null,null,null,"Classement Poule 1",null,null,1,{"$f":"IF(N24=\"\",\"\",IF(N24=R4,R4,R8))","v":""},null,{"$f":"N3","v":"CHIEZE MIREILLE  "},{"$f":"IF(AD4=N3,IF(P5=\"F\",\"\",P3),0)","v":""},{"$f":"IF(AD4=N3,IF(P3=\"F\",\"\",P5),0)","v":"F"},{"$f":"IF(AD4=R4,IF(T8=\"F\",\"\",T4),0)","v":0},{"$f":"IF(AD4=R4,IF(T4=\"F\",\"\",T8),0)","v":0},{"$f":"IF(AD4=K4,IF(J8=\"F\",\"\",J4),0)","v":0},{"$f":"IF(AD4=K4,IF(J4=\"F\",\"\",J8),0)","v":0},{"$f":"IF(AD4=G6,IF(F10=\"F\",\"\",F6),0)","v":0},{"$f":"IF(AD4=G6,IF(F6=\"F\",\"\",F10),0)","v":0},{"$f":"IF(AD4=G20,IF(F16=\"F\",\"\",F20),0)","v":0},{"$f":"IF(AD4=G20,IF(F20=\"F\",\"\",F16),0)","v":0},{"$f":"SUM(AE4,AG4,AI4,AK4,AM4)","v":0},0,{"$f":"AO4-AP4","v":0}]
[null,null,null,null,null,null,null,"G7",null,null,null,null,null,{"$f":"P_A8","v":" "},null,"F",null,null,null,null,null,null,1,{"$f":"IF(OR(AND(P24=\"F\",P28=\"F\"),AND(P24=\"A\",P28=\"A\")),N24,IF(OR(P24=\"F\",P28=\"A\"),N28,IF(OR(P28=\"F\",P28=\"A\"),N24,IF(P24=P28,\"\",(IF(P24>P28,N24,N28))))))","v":""},{"$f":"QP1_AG","v":""},"A",3,{"$f":"IF(B8=\"\",\"\",IF(B8=G6,G6,G10))","v":""},null,{"$f":"N5","v":" "},{"$f":"IF(AD5=N5,IF(P3=\"F\",\"\",P5),0)","v":"F"},{"$f":"IF(AD5=N5,IF(P5=\"F\",\"\",P3),0)","v":""},{"$f":"IF(AD5=R4,IF(T8=\"F\",\"\",T4),0)","v":0},{"$f":"IF(AD5=R4,IF(T4=\"F\",\"\",T8),0)","v":0},{"$f":"IF(AD5=K4,IF(J8=\"F\",\"\",J4),0)","v":"F"},{"$f":"IF(AD5=K4,IF(J4=\"F\",\"\",J8),0)","v":""},{"$f":"IF(AD5=G6,IF(F10=\"F\",\"\",F6),0)","v":0},{"$f":"IF(AD5=G6,IF(F6=\"F\",\"\",F10),0)","v":0},{"$f":"IF(AD5=G20,IF(F16=\"F\",\"\",F20),0)","v":0},{"$f":"IF(AD5=G20,IF(F20=\"F\",\"\",F16),0)","v":0},0,0,{"$f":"AO5-AP5","v":0}]
[null,null,null,null,null,null,{"$f":"IF(OR(J4=\"F\",J4=\"A\"),K8,IF(OR(J8=\"F\",J8=\"A\"),K4,IF(J4=J8,\"\",(IF(J4>J8,K4,K8)))))","v":""},{"$f":"IF(OR(J4=\"F\",J4=\"A\"),L8,IF(OR(J8=\"F\",J8=\"A\"),L4,IF(J4=J8,\"\",(IF(J4>J8,J4-J8+L4,J8-J4+L8)))))","v":""},null,null,"Match 7 - Billard num :",null,null,null,null,null,null,"Match 5 - Billard num  :",null,null,null,null,2,{"$f":"IF(I24=I28,\"\",IF(I24>I28,G24,G28))","v":""},{"$f":"IF(OR(I24=\"F\",I28=\"A\"),H24,IF(OR(I24=\"A\",I28=\"F\"),H28,IF(I24=I28,\"\",(IF(I24>I28,I24-I28+H24,I28-I24+H28)))))","v":""},"E",5,{"$f":"IF(B8=\"\",\"\",IF(B8=G6,G10,G6))","v":""},null,{"$f":"N7","v":"NOCERA GIUSEPPE  "},{"$f":"IF(AD6=N7,IF(P9=\"F\",\"\",P7),0)","v":0},{"$f":"IF(AD6=N7,IF(P7=\"F\",\"\",P9),0)","v":0},{"$f":"IF(AD6=R8,IF(T4=\"F\",\"\",T8),0)","v":0},{"$f":"IF(AD6=R8,IF(T8=\"F\",\"\",T4),0)","v":0},{"$f":"IF(AD6=K8,IF(J4=\"F\",\"\",J8),0)","v":0},{"$f":"IF(AD6=K8,IF(J8=\"F\",\"\",J4),0)","v":0},{"$f":"IF(AD6=G6,IF(F10=\"F\",\"\",F6),0)","v":0},{"$f":"IF(AD6=G6,IF(F6=\"F\",\"\",F10),0)","v":0},{"$f":"IF(AD6=G20,IF(F16=\"F\",\"\",F20),0)","v":0},{"$f":"IF(AD6=G20,IF(F20=\"F\",\"\",F16),0)","v":0},0,0,{"$f":"AO6-AP6","v":0}]
[null,null,"G9",null,null,null,null,null,null,null,null,null,null,{"$f":"P_A5","v":"NOCERA GIUSEPPE  "},null,null,null,null,null,null,null,null,3,{"$f":"IF(I24=I28,\"\",IF(I24<I28,G24,G28))","v":""},{"$f":"IF(OR(I24=\"F\",I28=\"A\"),H24,IF(OR(I24=\"A\",I28=\"F\"),H28,IF(I24=I28,\"\",(IF(I24<I28,I24-I28+H24,I28-I24+H28)))))","v":""},null,7,{"$f":"IF(G6=\"\",\"\",IF(G6=K4,K8,K4))","v":""},null,{"$f":"N9","v":"MOREL SYLVAIN  "},{"$f":"IF(AD7=N9,IF(P7=\"F\",\"\",P9),0)","v":0},{"$f":"IF(AD7=N9,IF(P9=\"F\",\"\",P7),0)","v":0},{"$f":"IF(AD7=R8,IF(T4=\"F\",\"\",T8),0)","v":0},{"$f":"IF(AD7=R8,IF(T8=\"F\",\"\",T4),0)","v":0},{"$f":"IF(AD7=K8,IF(J4=\"F\",\"\",J8),0)","v":0},{"$f":"IF(AD7=K8,IF(J8=\"F\",\"\",J4),0)","v":0},{"$f":"IF(AD7=G6,IF(F10=\"F\",\"\",F6),0)","v":0},{"$f":"IF(AD7=G6,IF(F6=\"F\",\"\",F10),0)","v":0},{"$f":"IF(AD7=G20,IF(F16=\"F\",\"\",F20),0)","v":0},{"$f":"IF(AD7=G20,IF(F20=\"F\",\"\",F16),0)","v":0},0,0,{"$f":"AO7-AP7","v":0}]
[null,{"$f":"IF(OR(F6=\"F\",F6=\"A\"),G10,IF(OR(F10=\"F\",F10=\"A\"),G6,IF(F6=F10,\"\",(IF(F6>F10,G6,G10)))))","v":""},{"$f":"IF(OR(F6=\"F\",F6=\"A\"),H10,IF(OR(F10=\"F\",F10=\"A\"),H6,IF(F6=F10,\"\",(IF(F6>F10,F6-F10+H6,F10-F6+H10)))))","v":""},null,null,null,"Match 9 - Billard num  :",null,null,null,{"$f":"IF(OR(AND(P7=\"F\",P9=\"F\"),AND(P7=\"A\",P9=\"A\")),N9,IF(OR(P7=\"F\",P7=\"A\"),N7,IF(OR(P9=\"F\",P9=\"A\"),N9,IF(P7=P9,\"\",(IF(P7<P9,N7,N9))))))","v":""},{"$f":"IF(OR(AND(P7=\"F\",P9=\"F\"),AND(P7=\"A\",P9=\"A\")),O9,IF(OR(P7=\"F\",P7=\"A\"),O7,IF(OR(P9=\"F\",P9=\"A\"),O9,IF(P7=P9,\"\",(IF(P7<P9,P7-P9,P9-P7))))))","v":""},null,"Match 2 - Billard num  :",null,null,null,{"$f":"IF(OR(AND(P7=\"F\",P9=\"F\"),AND(P7=\"A\",P9=\"A\")),N7,IF(OR(P7=\"F\",P7=\"A\"),N9,IF(OR(P9=\"F\",P9=\"A\"),N7,IF(P7=P9,\"\",(IF(P7>P9,N7,N9))))))","v":""},{"$f":"IF(OR(AND(P7=\"F\",P9=\"F\"),AND(P7=\"A\",P9=\"A\")),O7,IF(OR(P7=\"F\",P7=\"A\"),O9,IF(OR(P9=\"F\",P9=\"A\"),O7,IF(P7=P9,\"\",(IF(P7>P9,P7-P9,P9-P7))))))","v":""},null,null,null,4,{"$f":"IF(OR(D8=\"F\",D8=\"A\"),K18,IF(OR(D18=\"F\",D18=\"A\"),K8,IF(D8=D18,\"\",(IF(D8<D18,B8,B18)))))","v":""},{"$f":"IF(OR(D8=\"F\",D8=\"A\"),C18,IF(OR(D18=\"F\",D18=\"A\"),C8,IF(D8=D18,\"\",(IF(D8<D18,D8-D18+C8,D18-D8+C18)))))","v":""}]
[null,null,null,"  ",null,null,null,null,null,null,null,"P2",null,{"$f":"P_A4","v":"MOREL SYLVAIN  "},null,null,null,"G2",null,null,null,null,5,{"$f":"AB6","v":""},{"$f":"IF(X9=\"\",\"\",(VLOOKUP(X9,AD4:AQ17,14,FALSE)))","v":""}]
[null,null,null,null,null,null,{"$f":"IF(OR(T14=\"F\",T14=\"A\"),R14,IF(OR(T18=\"F\",T18=\"A\"),R18,IF(T14=T18,\"\",(IF(T14<T18,R14,R18)))))","v":""},{"$f":"IF(OR(T14=\"F\",T14=\"A\"),S14,IF(OR(T18=\"F\",T18=\"A\"),S18,IF(T14=T18,\"\",(IF(T14<T18,T14-T18+S14,T18-T14+S18)))))","v":""},null,null,null,null,null,null,null,null,null,null,null,null,null,null,6,{"$f":"AB16","v":""},{"$f":"IF(X10=\"\",\"\",(VLOOKUP(X10,AD4:AQ17,14,FALSE)))","v":""}]
[null,null,null,null,null,null,null,"P6",null,"ïMATCHS EN 2 PARTIES GAGNANTES",null,null,null,null,"MATCHS EN 3 PARTIES GAGNANTES ð",null,null,null,null,null,null,null,7,{"$f":"AB7","v":""},{"$f":"IF(X11=\"\",\"\",(VLOOKUP(X11,AD4:AQ17,14,FALSE)))","v":""}]
[null,{"$f":"IF(OR(D8=\"F\",D8=\"A\"),K18,IF(OR(D18=\"F\",D18=\"A\"),K8,IF(D8=D18,\"\",(IF(D8>D18,B8,B18)))))","v":""},{"$f":"IF(OR(D8=\"F\",D8=\"A\"),C18,IF(OR(D18=\"F\",D18=\"A\"),C8,IF(D8=D18,\"\",(IF(D8>D18,D8-D18+C8,D18-D8+C18)))))","v":""},null,null,null,null,null,null,null,null,null,null,null,null,null,null,null,null,null,null,null,8,{"$f":"AB17","v":" "},{"$f":"IF(X12=\"\",\"\",(VLOOKUP(X12,AD4:AQ17,14,FALSE)))","v":0}]
[null,"Match 12 - Billard num  :",null,null,null,null,null,null,null,null,null,"P3",null,{"$f":"P_A3","v":"DI BELLA STEPHANIE  "},null,null,null,"G3",null,null,null,null,null,null,null,null,null,null,null,null,"G","P","G","P","G","P","G","P","G","P","G","P","Ga"]
[null,null,null,null,null,null,null,null,null,"F",{"$f":"IF(OR(AND(P13=\"F\",P15=\"F\"),AND(P13=\"A\",P15=\"A\")),N15,IF(OR(P13=\"F\",P13=\"A\"),N13,IF(OR(P15=\"F\",P15=\"A\"),N15,IF(P13=P15,\"\",(IF(P13<P15,N13,N15))))))","v":" "},{"$f":"IF(OR(AND(P13=\"F\",P15=\"F\"),AND(P13=\"A\",P15=\"A\")),O15,IF(OR(P13=\"F\",P13=\"A\"),O13,IF(OR(P15=\"F\",P15=\"A\"),O15,IF(P13=P15,\"\",(IF(P13<P15,P13-P15,P15-P13))))))","v":0},null,"Match 3 - Billard num  :",null,null,null,{"$f":"IF(OR(AND(P13=\"F\",P15=\"F\"),AND(P13=\"A\",P15=\"A\")),N13,IF(OR(P13=\"F\",P13=\"A\"),N15,IF(OR(P15=\"F\",P15=\"A\"),N13,IF(P13=P15,\"\",(IF(P13>P15,N13,N15))))))","v":"DI BELLA STEPHANIE  "},{"$f":"IF(OR(AND(P13=\"F\",P15=\"F\"),AND(P13=\"A\",P15=\"A\")),O13,IF(OR(P13=\"F\",P13=\"A\"),O15,IF(OR(P15=\"F\",P15=\"A\"),O13,IF(P13=P15,\"\",(IF(P13>P15,P13-P15,P15-P13))))))","v":0},null,null,null,null,"Billard Libre",null,null,2,{"$f":"IF(N28=\"\",\"\",IF(N28=R14,R14,R18))","v":""},null,{"$f":"N13","v":"DI BELLA STEPHANIE  "},{"$f":"IF(AD14=N13,IF(P15=\"F\",\"\",P13),0)","v":""},{"$f":"IF(AD14=N13,IF(P13=\"F\",\"\",P15),0)","v":"F"},{"$f":"IF(AD14=R14,IF(T18=\"F\",\"\",T14),0)","v":0},{"$f":"IF(AD14=R14,IF(T14=\"F\",\"\",T18),0)","v":0},{"$f":"IF(AD14=K14,IF(J18=\"F\",\"\",J14),0)","v":0},{"$f":"IF(AD14=K14,IF(J14=\"F\",\"\",J18),0)","v":0},{"$f":"IF(AD14=G16,IF(F20=\"F\",\"\",F16),0)","v":0},{"$f":"IF(AD14=G16,IF(F16=\"F\",\"\",F20),0)","v":0},{"$f":"IF(AD14=G10,IF(F6=\"F\",\"\",F10),0)","v":0},{"$f":"IF(AD14=G10,IF(F10=\"F\",\"\",F6),0)","v":0},{"$f":"SUM(AE14,AG14,AI14,AK14,AM14)","v":0},0,{"$f":"AO14-AP14","v":0}]
[null,null,null,null,null,null,null,"G8",null,null,null,null,null,{"$f":"P_A6","v":" "},null,"F",null,null,null,null,null,null,null,"Billard 1",null,null,4,{"$f":"IF(B18=\"\",\"\",IF(B18=G16,G16,G20))","v":""},null,{"$f":"N15","v":" "},{"$f":"IF(AD15=N15,IF(P13=\"F\",\"\",P15),0)","v":"F"},{"$f":"IF(AD15=N15,IF(P15=\"F\",\"\",P13),0)","v":""},{"$f":"IF(AD15=R14,IF(T18=\"F\",\"\",T14),0)","v":0},{"$f":"IF(AD15=R14,IF(T14=\"F\",\"\",T18),0)","v":0},{"$f":"IF(AD15=K14,IF(J18=\"F\",\"\",J14),0)","v":""},{"$f":"IF(AD15=K14,IF(J14=\"F\",\"\",J18),0)","v":""},{"$f":"IF(AD15=G16,IF(F20=\"F\",\"\",F16),0)","v":"F"},{"$f":"IF(AD15=G16,IF(F16=\"F\",\"\",F20),0)","v":""},{"$f":"IF(AD15=G10,IF(F6=\"F\",\"\",F10),0)","v":0},{"$f":"IF(AD15=G10,IF(F10=\"F\",\"\",F6),0)","v":0},0,0,{"$f":"AO15-AP15","v":0}]
[null,null,null,null,null,"F",{"$f":"IF(OR(J14=\"F\",J14=\"A\"),K18,IF(OR(J18=\"F\",J18=\"A\"),K14,IF(J14=J18,\"\",(IF(J14>J18,K14,K18)))))","v":" "},{"$f":"IF(OR(J14=\"F\",J14=\"A\"),L18,IF(OR(J18=\"F\",J18=\"A\"),L14,IF(J14=J18,\"\",(IF(J14>J18,J14-J18+L14,J18-J14+L18)))))","v":0},null,null,"Match 8 - Billard num  :",null,null,null,null,null,null,"Match 6 - Billard num  :",null,null,null,null,null,"Billard 2",null,null,6,{"$f":"IF(B18=\"\",\"\",IF(B18=G16,G20,G16))","v":""},null,{"$f":"N17","v":" "},{"$f":"IF(AD16=N17,IF(P19=\"F\",\"\",P17),0)","v":"F"},{"$f":"IF(AD16=N17,IF(P17=\"F\",\"\",P19),0)","v":""},{"$f":"IF(AD16=R18,IF(T14=\"F\",\"\",T18),0)","v":0},{"$f":"IF(AD16=R18,IF(T18=\"F\",\"\",T14),0)","v":0},{"$f":"IF(AD16=K18,IF(J14=\"F\",\"\",J18),0)","v":""},{"$f":"IF(AD16=K18,IF(J18=\"F\",\"\",J14),0)","v":""},{"$f":"IF(AD16=G16,IF(F20=\"F\",\"\",F16),0)","v":"F"},{"$f":"IF(AD16=G16,IF(F16=\"F\",\"\",F20),0)","v":""},{"$f":"IF(AD16=G10,IF(F6=\"F\",\"\",F10),0)","v":0},{"$f":"IF(AD16=G10,IF(F10=\"F\",\"\",F6),0)","v":0},0,0,{"$f":"AO16-AP16","v":0}]
[null,null,"G10",null,null,null,null,null,null,null,null,null,null,{"$f":"P_A7","v":" "},null,"F",null,null,null,null,null,null,null,"Billard 3",null,null,8,{"$f":"IF(G16=\"\",\"\",IF(G16=K14,K18,K14))","v":" "},null,{"$f":"N19","v":"REDON VALERIE  "},{"$f":"IF(AD17=N19,IF(P17=\"F\",\"\",P19),0)","v":""},{"$f":"IF(AD17=N19,IF(P19=\"F\",\"\",P17),0)","v":"F"},{"$f":"IF(AD17=R18,IF(T14=\"F\",\"\",T18),0)","v":0},{"$f":"IF(AD17=R18,IF(T18=\"F\",\"\",T14),0)","v":0},{"$f":"IF(AD17=K18,IF(J14=\"F\",\"\",J18),0)","v":0},{"$f":"IF(AD17=K18,IF(J18=\"F\",\"\",J14),0)","v":0},{"$f":"IF(AD17=G16,IF(F20=\"F\",\"\",F16),0)","v":0},{"$f":"IF(AD17=G16,IF(F16=\"F\",\"\",F20),0)","v":0},{"$f":"IF(AD17=G10,IF(F6=\"F\",\"\",F10),0)","v":0},{"$f":"IF(AD17=G10,IF(F10=\"F\",\"\",F6),0)","v":0},0,{"$f":"SUM(AF17,AH17,AJ17,AL17,AN17)","v":0},{"$f":"AO17-AP17","v":0}]
[null,{"$f":"IF(OR(F16=\"F\",F16=\"A\"),G20,IF(OR(F20=\"F\",F20=\"A\"),G16,IF(F16=F20,\"\",(IF(F16>F20,G16,G20)))))","v":""},{"$f":"IF(OR(F16=\"F\",F16=\"A\",F16<>\"\"),H20,IF(OR(F20=\"F\",F20=\"A\"),H16,IF(F16=F20,\"\",(IF(F16>F20,F16-F20+H16,F20-F16+H20)))))","v":""},null,null,null,"Match 10 - Billard num  :",null,null,"F",{"$f":"IF(OR(AND(P17=\"F\",P19=\"F\"),AND(P17=\"A\",P19=\"A\"),AND(N17=\"\")),N19,IF(OR(P17=\"F\",P17=\"A\"),N17,IF(OR(P19=\"F\",P19=\"A\"),N19,IF(P17=P19,\"\",(IF(P17<P19,N17,N19))))))","v":" "},{"$f":"IF(OR(AND(P17=\"F\",P19=\"F\"),AND(P17=\"A\",P19=\"A\")),O19,IF(OR(P17=\"F\",P17=\"A\"),O17,IF(OR(P19=\"F\",P19=\"A\"),O19,IF(P17=P19,\"\",(IF(P17<P19,P17-P19,P19-P17))))))","v":0},null,"Match 4 - Billard num  :",null,null,null,{"$f":"IF(OR(AND(P17=\"F\",P19=\"F\"),AND(P17=\"A\",P19=\"A\")),N17,IF(OR(P17=\"F\",P17=\"A\"),N19,IF(OR(P19=\"F\",P19=\"A\"),N17,IF(P17=P19,\"\",(IF(P17>P19,N17,N19))))))","v":"REDON VALERIE  "},{"$f":"IF(OR(AND(P17=\"F\",P19=\"F\"),AND(P17=\"A\",P19=\"A\")),O17,IF(OR(P17=\"F\",P17=\"A\"),O19,IF(OR(P19=\"F\",P19=\"A\"),O17,IF(P17=P19,\"\",(IF(P17>P19,P17-P19,P19-P17))))))","v":0},null,null,null,null,"Billard 4"]
[null,null,null,null,null,null,null,null,null,null,null,"P4",null,{"$f":"P_A2","v":"REDON VALERIE  "},null,null,null,"G4",null,null,null,null,null,"Billard 5"]
[null,null,null,null,null,null,{"$f":"IF(OR(T4=\"F\",T4=\"A\"),R4,IF(OR(T8=\"F\",T8=\"A\"),R8,IF(T4=T8,\"\",(IF(T4<T8,R4,R8)))))","v":""},{"$f":"IF(OR(T4=\"F\",T4=\"A\"),S4,IF(OR(T8=\"F\",T8=\"A\"),S8,IF(T4=T8,\"\",(IF(T4<T8,T4-T8+S4,T8-T4+S8)))))","v":""},null,null,null,null,null,null,null,null,null,null,null,null,null,null,null,"Billard 6"]
[null,null,null,null,null,null,null,"P5"]
[null,null,null,null,null,"Sortie de poule : 2eme et 3eme place",null,null,null,null,null,null,null,"Sortie de poule : 1ere place"]
[null,null,null,null,null,null,"P11 (Perdant de la finale)",null,null,null,null,null,null,"G5"]
[null,null,null,null,null,null,{"$f":"IF(OR(AND(P24=\"F\",P28=\"F\"),AND(P24=\"A\",P28=\"A\")),N28,IF(OR(P24=\"F\",P24=\"A\"),N24,IF(OR(P28=\"F\",P28=\"A\"),N28,IF(P24=P28,\"\",(IF(P24<P28,N24,N28))))))","v":""},{"$f":"(IF(P24=P28,\"\",IF(P24>P28,P28-P24+P24,P24-P28+O24)))","v":""},null,null,null,null,null,{"$f":"IF(OR(T4=\"F\",T4=\"A\"),R8,IF(OR(T8=\"F\",T8=\"A\"),R4,IF(T4=T8,\"\",(IF(T4>T8,R4,R8)))))","v":""},{"$f":"IF(OR(T4=\"F\",T4=\"A\"),S8,IF(OR(T8=\"F\",T8=\"A\"),S4,IF(T4=T8,\"\",(IF(T4>T8,T4-T8+S4,T8-T4+S8)))))","v":""}]
[]
[null,null,null,null,null,null,"Match 13 - Billard num  :",null,null,"E",{"$f":"IF(I24=I28,\"\",IF(I24>I28,G24,G28))","v":""},{"$f":"IF(OR(I24=\"F\",I28=\"A\"),H24,IF(OR(I24=\"A\",I28=\"F\"),H28,IF(I24=I28,\"\",(IF(I24>I28,I24-I28+H24,I28-I24+H28)))))","v":""},null,"Match 11 - Billard num  :",4,null,"A",{"$f":"IF(OR(AND(P24=\"F\",P28=\"F\"),AND(P24=\"A\",P28=\"A\")),N24,IF(OR(P24=\"F\",P28=\"A\"),N28,IF(OR(P28=\"F\",P28=\"A\"),N24,IF(P24=P28,\"\",(IF(P24>P28,N24,N28))))))","v":""},{"$f":"IF(OR(P24=\"F\",P28=\"A\"),O24,IF(OR(P24=\"A\",P28=\"F\"),O28,IF(P24=P28,\"\",(IF(P24>P28,P24-P28+O24,P28-P24+O28)))))","v":""}]
[null,null,null,null,null,null,"G12 (Gagnant côté perdant)",null,null,null,null,null,null,"G6"]
[null,null,null,null,null,null,{"$f":"B12","v":""},{"$f":"C12","v":""},null,null,null,null,null,{"$f":"IF(OR(T14=\"F\",T14=\"A\"),R18,IF(OR(T18=\"F\",T18=\"A\"),R14,IF(T14=T18,\"\",(IF(T14>T18,R14,R18)))))","v":""},{"$f":"IF(OR(T14=\"F\",T14=\"A\"),S18,IF(OR(T18=\"F\",T18=\"A\"),S14,IF(T14=T18,\"\",(IF(T14>T18,T14-T18+S14,T18-T14+S18)))))","v":""}]

{"sheet":"2","index":5,"n_rows":28,"n_cols":43,"rows_kept":28,"cut":false,"hidden":false,"merged":[[0,10,0,18],[21,5,21,9],[21,13,21,15],[10,9,10,12],[10,14,10,17],[20,10,20,18]]}
[]
[]
[null,null,null,null,null,null,null,null,null,null,null,"P1",null,{"$f":"P_B1","v":"BRENDEL CHRISTIAN  "},null,null,null,"G1",null,null,null,null,null,null,null,null,null,null,null,null,"G","P","G","P","G","P","G","P","G","P","G","P","Ga"]
[null,null,null,null,null,null,null,null,null,"F",{"$f":"IF(OR(AND(P3=\"F\",P5=\"F\"),AND(P3=\"A\",P5=\"A\")),N5,IF(OR(P3=\"F\",P3=\"A\"),N3,IF(OR(P5=\"F\",P5=\"A\"),N5,IF(P3=P5,\"\",(IF(P3<P5,N3,N5))))))","v":" "},{"$f":"IF(OR(AND(P3=\"F\",P5=\"F\"),AND(P3=\"A\",P5=\"A\")),O5,IF(OR(P3=\"F\",P3=\"A\"),O3,IF(OR(P5=\"F\",P5=\"A\"),O5,IF(P3=P5,\"\",(IF(P3<P5,P3-P5,P5-P3))))))","v":0},null,"Match 1 - Billard num  :",null,null,null,{"$f":"IF(OR(AND(P3=\"F\",P5=\"F\"),AND(P3=\"A\",P5=\"A\")),N3,IF(OR(P3=\"F\",P3=\"A\"),N5,IF(OR(P5=\"F\",P5=\"A\"),N3,IF(P3=P5,\"\",(IF(P3>P5,N3,N5))))))","v":"BRENDEL CHRISTIAN  "},{"$f":"IF(OR(AND(P3=\"F\",P5=\"F\"),AND(P3=\"A\",P5=\"A\")),O3,IF(OR(P3=\"F\",P3=\"A\"),O5,IF(OR(P5=\"F\",P5=\"A\"),O3,IF(P3=P5,\"\",(IF(P3>P5,P3-P5,P5-P3))))))","v":0},null,null,null,null,"Classement Poule 2",null,null,1,{"$f":"IF(N24=\"\",\"\",IF(N24=R4,R4,R8))","v":""},null,{"$f":"N3","v":"BRENDEL CHRISTIAN  "},{"$f":"IF(AD4=N3,IF(P5=\"F\",\"\",P3),0)","v":""},{"$f":"IF(AD4=N3,IF(P3=\"F\",\"\",P5),0)","v":"F"},{"$f":"IF(AD4=R4,IF(T8=\"F\",\"\",T4),0)","v":0},{"$f":"IF(AD4=R4,IF(T4=\"F\",\"\",T8),0)","v":0},{"$f":"IF(AD4=K4,IF(J8=\"F\",\"\",J4),0)","v":0},{"$f":"IF(AD4=K4,IF(J4=\"F\",\"\",J8),0)","v":0},{"$f":"IF(AD4=G6,IF(F10=\"F\",\"\",F6),0)","v":0},{"$f":"IF(AD4=G6,IF(F6=\"F\",\"\",F10),0)","v":0},{"$f":"IF(AD4=G20,IF(F16=\"F\",\"\",F20),0)","v":0},{"$f":"IF(AD4=G20,IF(F20=\"F\",\"\",F16),0)","v":0},{"$f":"SUM(AE4,AG4,AI4,AK4,AM4)","v":0},0,{"$f":"AO4-AP4","v":0}]
[null,null,null,null,null,null,null,"G7",null,null,null,null,null,{"$f":"P_B8","v":" "},null,"F",null,null,null,null,null,null,1,{"$f":"IF(OR(AND(P24=\"F\",P28=\"F\"),AND(P24=\"A\",P28=\"A\")),N24,IF(OR(P24=\"F\",P28=\"A\"),N28,IF(OR(P28=\"F\",P28=\"A\"),N24,IF(P24=P28,\"\",(IF(P24>P28,N24,N28))))))","v":""},{"$f":"QP1_AG","v":""},"B",3,{"$f":"IF(B8=\"\",\"\",IF(B8=G6,G6,G10))","v":""},null,{"$f":"N5","v":" "},{"$f":"IF(AD5=N5,IF(P3=\"F\",\"\",P5),0)","v":"F"},{"$f":"IF(AD5=N5,IF(P5=\"F\",\"\",P3),0)","v":""},{"$f":"IF(AD5=R4,IF(T8=\"F\",\"\",T4),0)","v":0},{"$f":"IF(AD5=R4,IF(T4=\"F\",\"\",T8),0)","v":0},{"$f":"IF(AD5=K4,IF(J8=\"F\",\"\",J4),0)","v":"F"},{"$f":"IF(AD5=K4,IF(J4=\"F\",\"\",J8),0)","v":""},{"$f":"IF(AD5=G6,IF(F10=\"F\",\"\",F6),0)","v":0},{"$f":"IF(AD5=G6,IF(F6=\"F\",\"\",F10),0)","v":0},{"$f":"IF(AD5=G20,IF(F16=\"F\",\"\",F20),0)","v":0},{"$f":"IF(AD5=G20,IF(F20=\"F\",\"\",F16),0)","v":0},0,0,{"$f":"AO5-AP5","v":0}]
[null,null,null,null,null,null,{"$f":"IF(OR(J4=\"F\",J4=\"A\"),K8,IF(OR(J8=\"F\",J8=\"A\"),K4,IF(J4=J8,\"\",(IF(J4>J8,K4,K8)))))","v":""},{"$f":"IF(OR(J4=\"F\",J4=\"A\"),L8,IF(OR(J8=\"F\",J8=\"A\"),L4,IF(J4=J8,\"\",(IF(J4>J8,J4-J8+L4,J8-J4+L8)))))","v":""},null,null,"Match 7 - Billard num :",null,null,null,null,null,null,"Match 5 - Billard num  :",null,null,null,null,2,{"$f":"IF(I24=I28,\"\",IF(I24>I28,G24,G28))","v":""},{"$f":"IF(OR(I24=\"F\",I28=\"A\"),H24,IF(OR(I24=\"A\",I28=\"F\"),H28,IF(I24=I28,\"\",(IF(I24>I28,I24-I28+H24,I28-I24+H28)))))","v":""},"F",5,{"$f":"IF(B8=\"\",\"\",IF(B8=G6,G10,G6))","v":""},null,{"$f":"N7","v":"LACROIX VALERIE  "},{"$f":"IF(AD6=N7,IF(P9=\"F\",\"\",P7),0)","v":0},{"$f":"IF(AD6=N7,IF(P7=\"F\",\"\",P9),0)","v":0},{"$f":"IF(AD6=R8,IF(T4=\"F\",\"\",T8),0)","v":0},{"$f":"IF(AD6=R8,IF(T8=\"F\",\"\",T4),0)","v":0},{"$f":"IF(AD6=K8,IF(J4=\"F\",\"\",J8),0)","v":0},{"$f":"IF(AD6=K8,IF(J8=\"F\",\"\",J4),0)","v":0},{"$f":"IF(AD6=G6,IF(F10=\"F\",\"\",F6),0)","v":0},{"$f":"IF(AD6=G6,IF(F6=\"F\",\"\",F10),0)","v":0},{"$f":"IF(AD6=G20,IF(F16=\"F\",\"\",F20),0)","v":0},{"$f":"IF(AD6=G20,IF(F20=\"F\",\"\",F16),0)","v":0},0,0,{"$f":"AO6-AP6","v":0}]
[null,null,"G9",null,null,null,null,null,null,null,null,null,null,{"$f":"P_B5","v":"LACROIX VALERIE  "},null,null,null,null,null,null,null,null,3,{"$f":"IF(I24=I28,\"\",IF(I24<I28,G24,G28))","v":""},{"$f":"IF(OR(I24=\"F\",I28=\"A\"),H24,IF(OR(I24=\"A\",I28=\"F\"),H28,IF(I24=I28,\"\",(IF(I24<I28,I24-I28+H24,I28-I24+H28)))))","v":""},null,7,{"$f":"IF(G6=\"\",\"\",IF(G6=K4,K8,K4))","v":""},null,{"$f":"N9","v":"KAABECHE RIAD  "},{"$f":"IF(AD7=N9,IF(P7=\"F\",\"\",P9),0)","v":0},{"$f":"IF(AD7=N9,IF(P9=\"F\",\"\",P7),0)","v":0},{"$f":"IF(AD7=R8,IF(T4=\"F\",\"\",T8),0)","v":0},{"$f":"IF(AD7=R8,IF(T8=\"F\",\"\",T4),0)","v":0},{"$f":"IF(AD7=K8,IF(J4=\"F\",\"\",J8),0)","v":0},{"$f":"IF(AD7=K8,IF(J8=\"F\",\"\",J4),0)","v":0},{"$f":"IF(AD7=G6,IF(F10=\"F\",\"\",F6),0)","v":0},{"$f":"IF(AD7=G6,IF(F6=\"F\",\"\",F10),0)","v":0},{"$f":"IF(AD7=G20,IF(F16=\"F\",\"\",F20),0)","v":0},{"$f":"IF(AD7=G20,IF(F20=\"F\",\"\",F16),0)","v":0},0,0,{"$f":"AO7-AP7","v":0}]
[null,{"$f":"IF(OR(F6=\"F\",F6=\"A\"),G10,IF(OR(F10=\"F\",F10=\"A\"),G6,IF(F6=F10,\"\",(IF(F6>F10,G6,G10)))))","v":""},{"$f":"IF(OR(F6=\"F\",F6=\"A\"),H10,IF(OR(F10=\"F\",F10=\"A\"),H6,IF(F6=F10,\"\",(IF(F6>F10,F6-F10+H6,F10-F6+H10)))))","v":""},null,null,null,"Match 9 - Billard num  :",null,null,null,{"$f":"IF(OR(AND(P7=\"F\",P9=\"F\"),AND(P7=\"A\",P9=\"A\")),N9,IF(OR(P7=\"F\",P7=\"A\"),N7,IF(OR(P9=\"F\",P9=\"A\"),N9,IF(P7=P9,\"\",(IF(P7<P9,N7,N9))))))","v":""},{"$f":"IF(OR(AND(P7=\"F\",P9=\"F\"),AND(P7=\"A\",P9=\"A\")),O9,IF(OR(P7=\"F\",P7=\"A\"),O7,IF(OR(P9=\"F\",P9=\"A\"),O9,IF(P7=P9,\"\",(IF(P7<P9,P7-P9,P9-P7))))))","v":""},null,"Match 2 - Billard num  :",null,null,null,{"$f":"IF(OR(AND(P7=\"F\",P9=\"F\"),AND(P7=\"A\",P9=\"A\")),N7,IF(OR(P7=\"F\",P7=\"A\"),N9,IF(OR(P9=\"F\",P9=\"A\"),N7,IF(P7=P9,\"\",(IF(P7>P9,N7,N9))))))","v":""},{"$f":"IF(OR(AND(P7=\"F\",P9=\"F\"),AND(P7=\"A\",P9=\"A\")),O7,IF(OR(P7=\"F\",P7=\"A\"),O9,IF(OR(P9=\"F\",P9=\"A\"),O7,IF(P7=P9,\"\",(IF(P7>P9,P7-P9,P9-P7))))))","v":""},null,null,null,4,{"$f":"IF(OR(D8=\"F\",D8=\"A\"),K18,IF(OR(D18=\"F\",D18=\"A\"),K8,IF(D8=D18,\"\",(IF(D8<D18,B8,B18)))))","v":""},{"$f":"IF(OR(D8=\"F\",D8=\"A\"),C18,IF(OR(D18=\"F\",D18=\"A\"),C8,IF(D8=D18,\"\",(IF(D8<D18,D8-D18+C8,D18-D8+C18)))))","v":""}]
[null,null,null,"  ",null,null,null,null,null,null,null,"P2",null,{"$f":"P_B4","v":"KAABECHE RIAD  "},null,null,null,"G2",null,null,null,null,5,{"$f":"AB6","v":""},{"$f":"IF(X9=\"\",\"\",(VLOOKUP(X9,AD4:AQ17,14,FALSE)))","v":""}]
[null,null,null,null,null,null,{"$f":"IF(OR(T14=\"F\",T14=\"A\"),R14,IF(OR(T18=\"F\",T18=\"A\"),R18,IF(T14=T18,\"\",(IF(T14<T18,R14,R18)))))","v":""},{"$f":"IF(OR(T14=\"F\",T14=\"A\"),S14,IF(OR(T18=\"F\",T18=\"A\"),S18,IF(T14=T18,\"\",(IF(T14<T18,T14-T18+S14,T18-T14+S18)))))","v":""},null,null,null,null,null,null,null,null,null,null,null,null,null,null,6,{"$f":"AB16","v":""},{"$f":"IF(X10=\"\",\"\",(VLOOKUP(X10,AD4:AQ17,14,FALSE)))","v":""}]
[null,null,null,null,null,null,null,"P6",null,"ïMATCHS EN 2 PARTIES GAGNANTES",null,null,null,null,"MATCHS EN 3 PARTIES GAGNANTES ð",null,null,null,null,null,null,null,7,{"$f":"AB7","v":""},{"$f":"IF(X11=\"\",\"\",(VLOOKUP(X11,AD4:AQ17,14,FALSE)))","v":""}]
[null,{"$f":"IF(OR(D8=\"F\",D8=\"A\"),K18,IF(OR(D18=\"F\",D18=\"A\"),K8,IF(D8=D18,\"\",(IF(D8>D18,B8,B18)))))","v":""},{"$f":"IF(OR(D8=\"F\",D8=\"A\"),C18,IF(OR(D18=\"F\",D18=\"A\"),C8,IF(D8=D18,\"\",(IF(D8>D18,D8-D18+C8,D18-D8+C18)))))","v":""},null,null,null,null,null,null,null,null,null,null,null,null,null,null,null,null,null,null,null,8,{"$f":"AB17","v":" "},{"$f":"IF(X12=\"\",\"\",(VLOOKUP(X12,AD4:AQ17,14,FALSE)))","v":0}]
[null,"Match 12 - Billard num  :",null,null,null,null,null,null,null,null,null,"P3",null,{"$f":"P_B3","v":"HISIGER KELLY  "},null,null,null,"G3",null,null,null,null,null,null,null,null,null,null,null,null,"G","P","G","P","G","P","G","P","G","P","G","P","Ga"]
[null,null,null,null,null,null,null,null,null,"F",{"$f":"IF(OR(AND(P13=\"F\",P15=\"F\"),AND(P13=\"A\",P15=\"A\")),N15,IF(OR(P13=\"F\",P13=\"A\"),N13,IF(OR(P15=\"F\",P15=\"A\"),N15,IF(P13=P15,\"\",(IF(P13<P15,N13,N15))))))","v":" "},{"$f":"IF(OR(AND(P13=\"F\",P15=\"F\"),AND(P13=\"A\",P15=\"A\")),O15,IF(OR(P13=\"F\",P13=\"A\"),O13,IF(OR(P15=\"F\",P15=\"A\"),O15,IF(P13=P15,\"\",(IF(P13<P15,P13-P15,P15-P13))))))","v":0},null,"Match 3 - Billard num  :",null,null,null,{"$f":"IF(OR(AND(P13=\"F\",P15=\"F\"),AND(P13=\"A\",P15=\"A\")),N13,IF(OR(P13=\"F\",P13=\"A\"),N15,IF(OR(P15=\"F\",P15=\"A\"),N13,IF(P13=P15,\"\",(IF(P13>P15,N13,N15))))))","v":"HISIGER KELLY  "},{"$f":"IF(OR(AND(P13=\"F\",P15=\"F\"),AND(P13=\"A\",P15=\"A\")),O13,IF(OR(P13=\"F\",P13=\"A\"),O15,IF(OR(P15=\"F\",P15=\"A\"),O13,IF(P13=P15,\"\",(IF(P13>P15,P13-P15,P15-P13))))))","v":0},null,null,null,null,"Billard Libre",null,null,2,{"$f":"IF(N28=\"\",\"\",IF(N28=R14,R14,R18))","v":""},null,{"$f":"N13","v":"HISIGER KELLY  "},{"$f":"IF(AD14=N13,IF(P15=\"F\",\"\",P13),0)","v":""},{"$f":"IF(AD14=N13,IF(P13=\"F\",\"\",P15),0)","v":"F"},{"$f":"IF(AD14=R14,IF(T18=\"F\",\"\",T14),0)","v":0},{"$f":"IF(AD14=R14,IF(T14=\"F\",\"\",T18),0)","v":0},{"$f":"IF(AD14=K14,IF(J18=\"F\",\"\",J14),0)","v":0},{"$f":"IF(AD14=K14,IF(J14=\"F\",\"\",J18),0)","v":0},{"$f":"IF(AD14=G16,IF(F20=\"F\",\"\",F16),0)","v":0},{"$f":"IF(AD14=G16,IF(F16=\"F\",\"\",F20),0)","v":0},{"$f":"IF(AD14=G10,IF(F6=\"F\",\"\",F10),0)","v":0},{"$f":"IF(AD14=G10,IF(F10=\"F\",\"\",F6),0)","v":0},{"$f":"SUM(AE14,AG14,AI14,AK14,AM14)","v":0},0,{"$f":"AO14-AP14","v":0}]
[null,null,null,null,null,null,null,"G8",null,null,null,null,null,{"$f":"P_B6","v":" "},null,"F",null,null,null,null,null,null,null,"Billard 1",null,null,4,{"$f":"IF(B18=\"\",\"\",IF(B18=G16,G16,G20))","v":""},null,{"$f":"N15","v":" "},{"$f":"IF(AD15=N15,IF(P13=\"F\",\"\",P15),0)","v":"F"},{"$f":"IF(AD15=N15,IF(P15=\"F\",\"\",P13),0)","v":""},{"$f":"IF(AD15=R14,IF(T18=\"F\",\"\",T14),0)","v":0},{"$f":"IF(AD15=R14,IF(T14=\"F\",\"\",T18),0)","v":0},{"$f":"IF(AD15=K14,IF(J18=\"F\",\"\",J14),0)","v":""},{"$f":"IF(AD15=K14,IF(J14=\"F\",\"\",J18),0)","v":""},{"$f":"IF(AD15=G16,IF(F20=\"F\",\"\",F16),0)","v":"F"},{"$f":"IF(AD15=G16,IF(F16=\"F\",\"\",F20),0)","v":""},{"$f":"IF(AD15=G10,IF(F6=\"F\",\"\",F10),0)","v":0},{"$f":"IF(AD15=G10,IF(F10=\"F\",\"\",F6),0)","v":0},0,0,{"$f":"AO15-AP15","v":0}]
[null,null,null,null,null,"F",{"$f":"IF(OR(J14=\"F\",J14=\"A\"),K18,IF(OR(J18=\"F\",J18=\"A\"),K14,IF(J14=J18,\"\",(IF(J14>J18,K14,K18)))))","v":" "},{"$f":"IF(OR(J14=\"F\",J14=\"A\"),L18,IF(OR(J18=\"F\",J18=\"A\"),L14,IF(J14=J18,\"\",(IF(J14>J18,J14-J18+L14,J18-J14+L18)))))","v":0},null,null,"Match 8 - Billard num  :",null,null,null,null,null,null,"Match 6 - Billard num  :",null,null,null,null,null,"Billard 2",null,null,6,{"$f":"IF(B18=\"\",\"\",IF(B18=G16,G20,G16))","v":""},null,{"$f":"N17","v":" "},{"$f":"IF(AD16=N17,IF(P19=\"F\",\"\",P17),0)","v":"F"},{"$f":"IF(AD16=N17,IF(P17=\"F\",\"\",P19),0)","v":""},{"$f":"IF(AD16=R18,IF(T14=\"F\",\"\",T18),0)","v":0},{"$f":"IF(AD16=R18,IF(T18=\"F\",\"\",T14),0)","v":0},{"$f":"IF(AD16=K18,IF(J14=\"F\",\"\",J18),0)","v":""},{"$f":"IF(AD16=K18,IF(J18=\"F\",\"\",J14),0)","v":""},{"$f":"IF(AD16=G16,IF(F20=\"F\",\"\",F16),0)","v":"F"},{"$f":"IF(AD16=G16,IF(F16=\"F\",\"\",F20),0)","v":""},{"$f":"IF(AD16=G10,IF(F6=\"F\",\"\",F10),0)","v":0},{"$f":"IF(AD16=G10,IF(F10=\"F\",\"\",F6),0)","v":0},0,0,{"$f":"AO16-AP16","v":0}]
[null,null,"G10",null,null,null,null,null,null,null,null,null,null,{"$f":"P_B7","v":" "},null,"F",null,null,null,null,null,null,null,"Billard 3",null,null,8,{"$f":"IF(G16=\"\",\"\",IF(G16=K14,K18,K14))","v":" "},null,{"$f":"N19","v":"MANDY NATHALIE  "},{"$f":"IF(AD17=N19,IF(P17=\"F\",\"\",P19),0)","v":""},{"$f":"IF(AD17=N19,IF(P19=\"F\",\"\",P17),0)","v":"F"},{"$f":"IF(AD17=R18,IF(T14=\"F\",\"\",T18),0)","v":0},{"$f":"IF(AD17=R18,IF(T18=\"F\",\"\",T14),0)","v":0},{"$f":"IF(AD17=K18,IF(J14=\"F\",\"\",J18),0)","v":0},{"$f":"IF(AD17=K18,IF(J18=\"F\",\"\",J14),0)","v":0},{"$f":"IF(AD17=G16,IF(F20=\"F\",\"\",F16),0)","v":0},{"$f":"IF(AD17=G16,IF(F16=\"F\",\"\",F20),0)","v":0},{"$f":"IF(AD17=G10,IF(F6=\"F\",\"\",F10),0)","v":0},{"$f":"IF(AD17=G10,IF(F10=\"F\",\"\",F6),0)","v":0},0,{"$f":"SUM(AF17,AH17,AJ17,AL17,AN17)","v":0},{"$f":"AO17-AP17","v":0}]
[null,{"$f":"IF(OR(F16=\"F\",F16=\"A\"),G20,IF(OR(F20=\"F\",F20=\"A\"),G16,IF(F16=F20,\"\",(IF(F16>F20,G16,G20)))))","v":""},{"$f":"IF(OR(F16=\"F\",F16=\"A\"),H20,IF(OR(F20=\"F\",F20=\"A\"),H16,IF(F16=F20,\"\",(IF(F16>F20,F16-F20+H16,F20-F16+H20)))))","v":""},null,null,null,"Match 10 - Billard num  :",null,null,"F",{"$f":"IF(OR(AND(P17=\"F\",P19=\"F\"),AND(P17=\"A\",P19=\"A\")),N19,IF(OR(P17=\"F\",P17=\"A\"),N17,IF(OR(P19=\"F\",P19=\"A\"),N19,IF(P17=P19,\"\",(IF(P17<P19,N17,N19))))))","v":" "},{"$f":"IF(OR(AND(P17=\"F\",P19=\"F\"),AND(P17=\"A\",P19=\"A\")),O19,IF(OR(P17=\"F\",P17=\"A\"),O17,IF(OR(P19=\"F\",P19=\"A\"),O19,IF(P17=P19,\"\",(IF(P17<P19,P17-P19,P19-P17))))))","v":0},null,"Match 4 - Billard num  :",null,null,null,{"$f":"IF(OR(AND(P17=\"F\",P19=\"F\"),AND(P17=\"A\",P19=\"A\")),N17,IF(OR(P17=\"F\",P17=\"A\"),N19,IF(OR(P19=\"F\",P19=\"A\"),N17,IF(P17=P19,\"\",(IF(P17>P19,N17,N19))))))","v":"MANDY NATHALIE  "},{"$f":"IF(OR(AND(P17=\"F\",P19=\"F\"),AND(P17=\"A\",P19=\"A\")),O17,IF(OR(P17=\"F\",P17=\"A\"),O19,IF(OR(P19=\"F\",P19=\"A\"),O17,IF(P17=P19,\"\",(IF(P17>P19,P17-P19,P19-P17))))))","v":0},null,null,null,null,"Billard 4"]
[null,null,null,null,null,null,null,null,null,null,null,"P4",null,{"$f":"P_B2","v":"MANDY NATHALIE  "},null,null,null,"G4",null,null,null,null,null,"Billard 5"]
[null,null,null,null,null,null,{"$f":"IF(OR(T4=\"F\",T4=\"A\"),R4,IF(OR(T8=\"F\",T8=\"A\"),R8,IF(T4=T8,\"\",(IF(T4<T8,R4,R8)))))","v":""},{"$f":"IF(OR(T4=\"F\",T4=\"A\"),S4,IF(OR(T8=\"F\",T8=\"A\"),S8,IF(T4=T8,\"\",(IF(T4<T8,T4-T8+S4,T8-T4+S8)))))","v":""},null,null,null,null,null,null,null,null,null,null,null,null,null,null,null,"Billard 6"]
[null,null,null,null,null,null,null,"P5"]
[null,null,null,null,null,"Sortie de poule : 2eme et 3eme place",null,null,null,null,null,null,null,"Sortie de poule : 1ere place"]
[null,null,null,null,null,null,"P11",null,null,null,null,null,null,"G5"]
[null,null,null,null,null,null,{"$f":"IF(OR(AND(P24=\"F\",P28=\"F\"),AND(P24=\"A\",P28=\"A\")),N28,IF(OR(P24=\"F\",P24=\"A\"),N24,IF(OR(P28=\"F\",P28=\"A\"),N28,IF(P24=P28,\"\",(IF(P24<P28,N24,N28))))))","v":""},{"$f":"(IF(P24=P28,\"\",IF(P24>P28,P28-P24+P24,P24-P28+O24)))","v":""},null,null,null,null,null,{"$f":"IF(OR(T4=\"F\",T4=\"A\"),R8,IF(OR(T8=\"F\",T8=\"A\"),R4,IF(T4=T8,\"\",(IF(T4>T8,R4,R8)))))","v":""},{"$f":"IF(OR(T4=\"F\",T4=\"A\"),S8,IF(OR(T8=\"F\",T8=\"A\"),S4,IF(T4=T8,\"\",(IF(T4>T8,T4-T8+S4,T8-T4+S8)))))","v":""}]
[]
[null,null,null,null,null,null,"Match 13 - Billard num  :",null,null,"F",{"$f":"IF(I24=I28,\"\",IF(I24>I28,G24,G28))","v":""},{"$f":"IF(OR(I24=\"F\",I28=\"A\"),H24,IF(OR(I24=\"A\",I28=\"F\"),H28,IF(I24=I28,\"\",(IF(I24>I28,I24-I28+H24,I28-I24+H28)))))","v":""},null,"Match 11 - Billard num  :",null,null,"B",{"$f":"IF(OR(AND(P24=\"F\",P28=\"F\"),AND(P24=\"A\",P28=\"A\")),N24,IF(OR(P24=\"F\",P28=\"A\"),N28,IF(OR(P28=\"F\",P28=\"A\"),N24,IF(P24=P28,\"\",(IF(P24>P28,N24,N28))))))","v":""},{"$f":"IF(OR(P24=\"F\",P28=\"A\"),O24,IF(OR(P24=\"A\",P28=\"F\"),O28,IF(P24=P28,\"\",(IF(P24>P28,P24-P28+O24,P28-P24+O28)))))","v":""}]
[null,null,null,null,null,null,"G12",null,null,null,null,null,null,"G6"]
[null,null,null,null,null,null,{"$f":"B12","v":""},{"$f":"C12","v":""},null,null,null,null,null,{"$f":"IF(OR(T14=\"F\",T14=\"A\"),R18,IF(OR(T18=\"F\",T18=\"A\"),R14,IF(T14=T18,\"\",(IF(T14>T18,R14,R18)))))","v":""},{"$f":"IF(OR(T14=\"F\",T14=\"A\"),S18,IF(OR(T18=\"F\",T18=\"A\"),S14,IF(T14=T18,\"\",(IF(T14>T18,T14-T18+S14,T18-T14+S18)))))","v":""}]

{"sheet":"3","index":6,"n_rows":28,"n_cols":43,"rows_kept":28,"cut":false,"hidden":false,"merged":[[0,10,0,18],[21,5,21,9],[21,13,21,15],[10,9,10,12],[10,14,10,17],[20,10,20,18]]}
[]
[]
[null,null,null,null,null,null,null,null,null,null,null,"P1",null,{"$f":"P_C1","v":"CABANET FLORENCE  "},null,null,null,"G1",null,null,null,null,null,null,null,null,null,null,null,null,"G","P","G","P","G","P","G","P","G","P","G","P","Ga"]
[null,null,null,null,null,null,null,null,null,"F",{"$f":"IF(OR(AND(P3=\"F\",P5=\"F\"),AND(P3=\"A\",P5=\"A\")),N5,IF(OR(P3=\"F\",P3=\"A\"),N3,IF(OR(P5=\"F\",P5=\"A\"),N5,IF(P3=P5,\"\",(IF(P3<P5,N3,N5))))))","v":" "},{"$f":"IF(OR(AND(P3=\"F\",P5=\"F\"),AND(P3=\"A\",P5=\"A\")),O5,IF(OR(P3=\"F\",P3=\"A\"),O3,IF(OR(P5=\"F\",P5=\"A\"),O5,IF(P3=P5,\"\",(IF(P3<P5,P3-P5,P5-P3))))))","v":0},null,"Match 1 - Billard num  :",null,null,null,{"$f":"IF(OR(AND(P3=\"F\",P5=\"F\"),AND(P3=\"A\",P5=\"A\")),N3,IF(OR(P3=\"F\",P3=\"A\"),N5,IF(OR(P5=\"F\",P5=\"A\"),N3,IF(P3=P5,\"\",(IF(P3>P5,N3,N5))))))","v":"CABANET FLORENCE  "},{"$f":"IF(OR(AND(P3=\"F\",P5=\"F\"),AND(P3=\"A\",P5=\"A\")),O3,IF(OR(P3=\"F\",P3=\"A\"),O5,IF(OR(P5=\"F\",P5=\"A\"),O3,IF(P3=P5,\"\",(IF(P3>P5,P3-P5,P5-P3))))))","v":0},null,null,null,null,"Classement Poule 3",null,null,1,{"$f":"IF(N24=\"\",\"\",IF(N24=R4,R4,R8))","v":""},null,{"$f":"N3","v":"CABANET FLORENCE  "},{"$f":"IF(AD4=N3,IF(P5=\"F\",\"\",P3),0)","v":""},{"$f":"IF(AD4=N3,IF(P3=\"F\",\"\",P5),0)","v":"F"},{"$f":"IF(AD4=R4,IF(T8=\"F\",\"\",T4),0)","v":0},{"$f":"IF(AD4=R4,IF(T4=\"F\",\"\",T8),0)","v":0},{"$f":"IF(AD4=K4,IF(J8=\"F\",\"\",J4),0)","v":0},{"$f":"IF(AD4=K4,IF(J4=\"F\",\"\",J8),0)","v":0},{"$f":"IF(AD4=G6,IF(F10=\"F\",\"\",F6),0)","v":0},{"$f":"IF(AD4=G6,IF(F6=\"F\",\"\",F10),0)","v":0},{"$f":"IF(AD4=G20,IF(F16=\"F\",\"\",F20),0)","v":0},{"$f":"IF(AD4=G20,IF(F20=\"F\",\"\",F16),0)","v":0},{"$f":"SUM(AE4,AG4,AI4,AK4,AM4)","v":0},0,{"$f":"AO4-AP4","v":0}]
[null,null,null,null,null,null,null,"G7",null,null,null,null,null,{"$f":"P_C8","v":" "},null,"F",null,null,null,null,null,null,1,{"$f":"IF(OR(AND(P24=\"F\",P28=\"F\"),AND(P24=\"A\",P28=\"A\")),N24,IF(OR(P24=\"F\",P28=\"A\"),N28,IF(OR(P28=\"F\",P28=\"A\"),N24,IF(P24=P28,\"\",(IF(P24>P28,N24,N28))))))","v":""},{"$f":"QP1_AG","v":""},"C",3,{"$f":"IF(B8=\"\",\"\",IF(B8=G6,G6,G10))","v":""},null,{"$f":"N5","v":" "},{"$f":"IF(AD5=N5,IF(P3=\"F\",\"\",P5),0)","v":"F"},{"$f":"IF(AD5=N5,IF(P5=\"F\",\"\",P3),0)","v":""},{"$f":"IF(AD5=R4,IF(T8=\"F\",\"\",T4),0)","v":0},{"$f":"IF(AD5=R4,IF(T4=\"F\",\"\",T8),0)","v":0},{"$f":"IF(AD5=K4,IF(J8=\"F\",\"\",J4),0)","v":""},{"$f":"IF(AD5=K4,IF(J4=\"F\",\"\",J8),0)","v":""},{"$f":"IF(AD5=G6,IF(F10=\"F\",\"\",F6),0)","v":"F"},{"$f":"IF(AD5=G6,IF(F6=\"F\",\"\",F10),0)","v":""},{"$f":"IF(AD5=G20,IF(F16=\"F\",\"\",F20),0)","v":0},{"$f":"IF(AD5=G20,IF(F20=\"F\",\"\",F16),0)","v":0},0,0,{"$f":"AO5-AP5","v":0}]
[null,null,null,null,null,"F",{"$f":"IF(OR(J4=\"F\",J4=\"A\"),K8,IF(OR(J8=\"F\",J8=\"A\"),K4,IF(J4=J8,\"\",(IF(J4>J8,K4,K8)))))","v":" "},{"$f":"IF(OR(J4=\"F\",J4=\"A\"),L8,IF(OR(J8=\"F\",J8=\"A\"),L4,IF(J4=J8,\"\",(IF(J4>J8,J4-J8+L4,J8-J4+L8)))))","v":0},null,null,"Match 7 - Billard num :",null,null,null,null,null,null,"Match 5 - Billard num  :",null,null,null,null,2,{"$f":"IF(I24=I28,\"\",IF(I24>I28,G24,G28))","v":""},{"$f":"IF(OR(I24=\"F\",I28=\"A\"),H24,IF(OR(I24=\"A\",I28=\"F\"),H28,IF(I24=I28,\"\",(IF(I24>I28,I24-I28+H24,I28-I24+H28)))))","v":""},"G",5,{"$f":"IF(B8=\"\",\"\",IF(B8=G6,G10,G6))","v":""},null,{"$f":"N7","v":" "},{"$f":"IF(AD6=N7,IF(P9=\"F\",\"\",P7),0)","v":"F"},{"$f":"IF(AD6=N7,IF(P7=\"F\",\"\",P9),0)","v":""},{"$f":"IF(AD6=R8,IF(T4=\"F\",\"\",T8),0)","v":0},{"$f":"IF(AD6=R8,IF(T8=\"F\",\"\",T4),0)","v":0},{"$f":"IF(AD6=K8,IF(J4=\"F\",\"\",J8),0)","v":""},{"$f":"IF(AD6=K8,IF(J8=\"F\",\"\",J4),0)","v":""},{"$f":"IF(AD6=G6,IF(F10=\"F\",\"\",F6),0)","v":"F"},{"$f":"IF(AD6=G6,IF(F6=\"F\",\"\",F10),0)","v":""},{"$f":"IF(AD6=G20,IF(F16=\"F\",\"\",F20),0)","v":0},{"$f":"IF(AD6=G20,IF(F20=\"F\",\"\",F16),0)","v":0},0,0,{"$f":"AO6-AP6","v":0}]
[null,null,"G9",null,null,null,null,null,null,null,null,null,null,{"$f":"P_C5","v":" "},null,"F",null,null,null,null,null,null,3,{"$f":"IF(I24=I28,\"\",IF(I24<I28,G24,G28))","v":""},{"$f":"IF(OR(I24=\"F\",I28=\"A\"),H24,IF(OR(I24=\"A\",I28=\"F\"),H28,IF(I24=I28,\"\",(IF(I24<I28,I24-I28+H24,I28-I24+H28)))))","v":""},null,7,{"$f":"IF(G6=\"\",\"\",IF(G6=K4,K8,K4))","v":" "},null,{"$f":"N9","v":"HISIGER CHARLOTTE  "},{"$f":"IF(AD7=N9,IF(P7=\"F\",\"\",P9),0)","v":""},{"$f":"IF(AD7=N9,IF(P9=\"F\",\"\",P7),0)","v":"F"},{"$f":"IF(AD7=R8,IF(T4=\"F\",\"\",T8),0)","v":0},{"$f":"IF(AD7=R8,IF(T8=\"F\",\"\",T4),0)","v":0},{"$f":"IF(AD7=K8,IF(J4=\"F\",\"\",J8),0)","v":0},{"$f":"IF(AD7=K8,IF(J8=\"F\",\"\",J4),0)","v":0},{"$f":"IF(AD7=G6,IF(F10=\"F\",\"\",F6),0)","v":0},{"$f":"IF(AD7=G6,IF(F6=\"F\",\"\",F10),0)","v":0},{"$f":"IF(AD7=G20,IF(F16=\"F\",\"\",F20),0)","v":0},{"$f":"IF(AD7=G20,IF(F20=\"F\",\"\",F16),0)","v":0},0,0,{"$f":"AO7-AP7","v":0}]
[null,{"$f":"IF(OR(F6=\"F\",F6=\"A\"),G10,IF(OR(F10=\"F\",F10=\"A\"),G6,IF(F6=F10,\"\",(IF(F6>F10,G6,G10)))))","v":""},{"$f":"IF(OR(F6=\"F\",F6=\"A\"),H10,IF(OR(F10=\"F\",F10=\"A\"),H6,IF(F6=F10,\"\",(IF(F6>F10,F6-F10+H6,F10-F6+H10)))))","v":""},null,null,null,"Match 9 - Billard num  :",null,null,"F",{"$f":"IF(OR(AND(P7=\"F\",P9=\"F\"),AND(P7=\"A\",P9=\"A\")),N9,IF(OR(P7=\"F\",P7=\"A\"),N7,IF(OR(P9=\"F\",P9=\"A\"),N9,IF(P7=P9,\"\",(IF(P7<P9,N7,N9))))))","v":" "},{"$f":"IF(OR(AND(P7=\"F\",P9=\"F\"),AND(P7=\"A\",P9=\"A\")),O9,IF(OR(P7=\"F\",P7=\"A\"),O7,IF(OR(P9=\"F\",P9=\"A\"),O9,IF(P7=P9,\"\",(IF(P7<P9,P7-P9,P9-P7))))))","v":0},null,"Match 2 - Billard num  :",null,null,null,{"$f":"IF(OR(AND(P7=\"F\",P9=\"F\"),AND(P7=\"A\",P9=\"A\")),N7,IF(OR(P7=\"F\",P7=\"A\"),N9,IF(OR(P9=\"F\",P9=\"A\"),N7,IF(P7=P9,\"\",(IF(P7>P9,N7,N9))))))","v":"HISIGER CHARLOTTE  "},{"$f":"IF(OR(AND(P7=\"F\",P9=\"F\"),AND(P7=\"A\",P9=\"A\")),O7,IF(OR(P7=\"F\",P7=\"A\"),O9,IF(OR(P9=\"F\",P9=\"A\"),O7,IF(P7=P9,\"\",(IF(P7>P9,P7-P9,P9-P7))))))","v":0},null,null,null,4,{"$f":"IF(OR(D8=\"F\",D8=\"A\"),K18,IF(OR(D18=\"F\",D18=\"A\"),K8,IF(D8=D18,\"\",(IF(D8<D18,B8,B18)))))","v":""},{"$f":"IF(OR(D8=\"F\",D8=\"A\"),C18,IF(OR(D18=\"F\",D18=\"A\"),C8,IF(D8=D18,\"\",(IF(D8<D18,D8-D18+C8,D18-D8+C18)))))","v":""}]
[null,null,null,"  ",null,null,null,null,null,null,null,"P2",null,{"$f":"P_C4","v":"HISIGER CHARLOTTE  "},null,null,null,"G2",null,null,null,null,5,{"$f":"AB6","v":""},{"$f":"IF(X9=\"\",\"\",(VLOOKUP(X9,AD4:AQ17,14,FALSE)))","v":""}]
[null,null,null,null,null,null,{"$f":"IF(OR(T14=\"F\",T14=\"A\"),R14,IF(OR(T18=\"F\",T18=\"A\"),R18,IF(T14=T18,\"\",(IF(T14<T18,R14,R18)))))","v":""},{"$f":"IF(OR(T14=\"F\",T14=\"A\"),S14,IF(OR(T18=\"F\",T18=\"A\"),S18,IF(T14=T18,\"\",(IF(T14<T18,T14-T18+S14,T18-T14+S18)))))","v":""},null,null,null,null,null,null,null,null,null,null,null,null,null,null,6,{"$f":"AB16","v":""},{"$f":"IF(X10=\"\",\"\",(VLOOKUP(X10,AD4:AQ17,14,FALSE)))","v":""}]
[null,null,null,null,null,null,null,"P6",null,"ïMATCHS EN 2 PARTIES GAGNANTES",null,null,null,null,"MATCHS EN 3 PARTIES GAGNANTES ð",null,null,null,null,null,null,null,7,{"$f":"AB7","v":" "},{"$f":"IF(X11=\"\",\"\",(VLOOKUP(X11,AD4:AQ17,14,FALSE)))","v":0}]
[null,{"$f":"IF(OR(D8=\"F\",D8=\"A\"),K18,IF(OR(D18=\"F\",D18=\"A\"),K8,IF(D8=D18,\"\",(IF(D8>D18,B8,B18)))))","v":""},{"$f":"IF(OR(D8=\"F\",D8=\"A\"),C18,IF(OR(D18=\"F\",D18=\"A\"),C8,IF(D8=D18,\"\",(IF(D8>D18,D8-D18+C8,D18-D8+C18)))))","v":""},null,null,null,null,null,null,null,null,null,null,null,null,null,null,null,null,null,null,null,8,{"$f":"AB17","v":" "},{"$f":"IF(X12=\"\",\"\",(VLOOKUP(X12,AD4:AQ17,14,FALSE)))","v":0}]
[null,"Match 12 - Billard num  :",null,null,null,null,null,null,null,null,null,"P3",null,{"$f":"P_C3","v":"MIRTO EVELYNE  "},null,null,null,"G3",null,null,null,null,null,null,null,null,null,null,null,null,"G","P","G","P","G","P","G","P","G","P","G","P","Ga"]
[null,null,null,null,null,null,null,null,null,"F",{"$f":"IF(OR(AND(P13=\"F\",P15=\"F\"),AND(P13=\"A\",P15=\"A\")),N15,IF(OR(P13=\"F\",P13=\"A\"),N13,IF(OR(P15=\"F\",P15=\"A\"),N15,IF(P13=P15,\"\",(IF(P13<P15,N13,N15))))))","v":" "},{"$f":"IF(OR(AND(P13=\"F\",P15=\"F\"),AND(P13=\"A\",P15=\"A\")),O15,IF(OR(P13=\"F\",P13=\"A\"),O13,IF(OR(P15=\"F\",P15=\"A\"),O15,IF(P13=P15,\"\",(IF(P13<P15,P13-P15,P15-P13))))))","v":0},null,"Match 3 - Billard num  :",null,null,null,{"$f":"IF(OR(AND(P13=\"F\",P15=\"F\"),AND(P13=\"A\",P15=\"A\")),N13,IF(OR(P13=\"F\",P13=\"A\"),N15,IF(OR(P15=\"F\",P15=\"A\"),N13,IF(P13=P15,\"\",(IF(P13>P15,N13,N15))))))","v":"MIRTO EVELYNE  "},{"$f":"IF(OR(AND(P13=\"F\",P15=\"F\"),AND(P13=\"A\",P15=\"A\")),O13,IF(OR(P13=\"F\",P13=\"A\"),O15,IF(OR(P15=\"F\",P15=\"A\"),O13,IF(P13=P15,\"\",(IF(P13>P15,P13-P15,P15-P13))))))","v":0},null,null,null,null,"Billard Libre",null,null,2,{"$f":"IF(N28=\"\",\"\",IF(N28=R14,R14,R18))","v":""},null,{"$f":"N13","v":"MIRTO EVELYNE  "},{"$f":"IF(AD14=N13,IF(P15=\"F\",\"\",P13),0)","v":""},{"$f":"IF(AD14=N13,IF(P13=\"F\",\"\",P15),0)","v":"F"},{"$f":"IF(AD14=R14,IF(T18=\"F\",\"\",T14),0)","v":0},{"$f":"IF(AD14=R14,IF(T14=\"F\",\"\",T18),0)","v":0},{"$f":"IF(AD14=K14,IF(J18=\"F\",\"\",J14),0)","v":0},{"$f":"IF(AD14=K14,IF(J14=\"F\",\"\",J18),0)","v":0},{"$f":"IF(AD14=G16,IF(F20=\"F\",\"\",F16),0)","v":0},{"$f":"IF(AD14=G16,IF(F16=\"F\",\"\",F20),0)","v":0},{"$f":"IF(AD14=G10,IF(F6=\"F\",\"\",F10),0)","v":0},{"$f":"IF(AD14=G10,IF(F10=\"F\",\"\",F6),0)","v":0},{"$f":"SUM(AE14,AG14,AI14,AK14,AM14)","v":0},0,{"$f":"AO14-AP14","v":0}]
[null,null,null,null,null,null,null,"G8",null,null,null,null,null,{"$f":"P_C6","v":" "},null,"F",null,null,null,null,null,null,null,"Billard 1",null,null,4,{"$f":"IF(B18=\"\",\"\",IF(B18=G16,G16,G20))","v":""},null,{"$f":"N15","v":" "},{"$f":"IF(AD15=N15,IF(P13=\"F\",\"\",P15),0)","v":"F"},{"$f":"IF(AD15=N15,IF(P15=\"F\",\"\",P13),0)","v":""},{"$f":"IF(AD15=R14,IF(T18=\"F\",\"\",T14),0)","v":0},{"$f":"IF(AD15=R14,IF(T14=\"F\",\"\",T18),0)","v":0},{"$f":"IF(AD15=K14,IF(J18=\"F\",\"\",J14),0)","v":""},{"$f":"IF(AD15=K14,IF(J14=\"F\",\"\",J18),0)","v":""},{"$f":"IF(AD15=G16,IF(F20=\"F\",\"\",F16),0)","v":"F"},{"$f":"IF(AD15=G16,IF(F16=\"F\",\"\",F20),0)","v":""},{"$f":"IF(AD15=G10,IF(F6=\"F\",\"\",F10),0)","v":0},{"$f":"IF(AD15=G10,IF(F10=\"F\",\"\",F6),0)","v":0},0,0,{"$f":"AO15-AP15","v":0}]
[null,null,null,null,null,"F",{"$f":"IF(OR(J14=\"F\",J14=\"A\"),K18,IF(OR(J18=\"F\",J18=\"A\"),K14,IF(J14=J18,\"\",(IF(J14>J18,K14,K18)))))","v":" "},{"$f":"IF(OR(J14=\"F\",J14=\"A\"),L18,IF(OR(J18=\"F\",J18=\"A\"),L14,IF(J14=J18,\"\",(IF(J14>J18,J14-J18+L14,J18-J14+L18)))))","v":0},null,null,"Match 8 - Billard num  :",null,null,null,null,null,null,"Match 6 - Billard num  :",null,null,null,null,null,"Billard 2",null,null,6,{"$f":"IF(B18=\"\",\"\",IF(B18=G16,G20,G16))","v":""},null,{"$f":"N17","v":" "},{"$f":"IF(AD16=N17,IF(P19=\"F\",\"\",P17),0)","v":"F"},{"$f":"IF(AD16=N17,IF(P17=\"F\",\"\",P19),0)","v":""},{"$f":"IF(AD16=R18,IF(T14=\"F\",\"\",T18),0)","v":0},{"$f":"IF(AD16=R18,IF(T18=\"F\",\"\",T14),0)","v":0},{"$f":"IF(AD16=K18,IF(J14=\"F\",\"\",J18),0)","v":""},{"$f":"IF(AD16=K18,IF(J18=\"F\",\"\",J14),0)","v":""},{"$f":"IF(AD16=G16,IF(F20=\"F\",\"\",F16),0)","v":"F"},{"$f":"IF(AD16=G16,IF(F16=\"F\",\"\",F20),0)","v":""},{"$f":"IF(AD16=G10,IF(F6=\"F\",\"\",F10),0)","v":0},{"$f":"IF(AD16=G10,IF(F10=\"F\",\"\",F6),0)","v":0},0,0,{"$f":"AO16-AP16","v":0}]
[null,null,"G10",null,null,null,null,null,null,null,null,null,null,{"$f":"P_C7","v":" "},null,"F",null,null,null,null,null,null,null,"Billard 3",null,null,8,{"$f":"IF(G16=\"\",\"\",IF(G16=K14,K18,K14))","v":" "},null,{"$f":"N19","v":"BRUNET MAURICE  "},{"$f":"IF(AD17=N19,IF(P17=\"F\",\"\",P19),0)","v":""},{"$f":"IF(AD17=N19,IF(P19=\"F\",\"\",P17),0)","v":"F"},{"$f":"IF(AD17=R18,IF(T14=\"F\",\"\",T18),0)","v":0},{"$f":"IF(AD17=R18,IF(T18=\"F\",\"\",T14),0)","v":0},{"$f":"IF(AD17=K18,IF(J14=\"F\",\"\",J18),0)","v":0},{"$f":"IF(AD17=K18,IF(J18=\"F\",\"\",J14),0)","v":0},{"$f":"IF(AD17=G16,IF(F20=\"F\",\"\",F16),0)","v":0},{"$f":"IF(AD17=G16,IF(F16=\"F\",\"\",F20),0)","v":0},{"$f":"IF(AD17=G10,IF(F6=\"F\",\"\",F10),0)","v":0},{"$f":"IF(AD17=G10,IF(F10=\"F\",\"\",F6),0)","v":0},0,{"$f":"SUM(AF17,AH17,AJ17,AL17,AN17)","v":0},{"$f":"AO17-AP17","v":0}]
[null,{"$f":"IF(OR(F16=\"F\",F16=\"A\"),G20,IF(OR(F20=\"F\",F20=\"A\"),G16,IF(F16=F20,\"\",(IF(F16>F20,G16,G20)))))","v":""},{"$f":"IF(OR(F16=\"F\",F16=\"A\"),H20,IF(OR(F20=\"F\",F20=\"A\"),H16,IF(F16=F20,\"\",(IF(F16>F20,F16-F20+H16,F20-F16+H20)))))","v":""},null,null,null,"Match 10 - Billard num  :",null,null,"F",{"$f":"IF(OR(AND(P17=\"F\",P19=\"F\"),AND(P17=\"A\",P19=\"A\")),N19,IF(OR(P17=\"F\",P17=\"A\"),N17,IF(OR(P19=\"F\",P19=\"A\"),N19,IF(P17=P19,\"\",(IF(P17<P19,N17,N19))))))","v":" "},{"$f":"IF(OR(AND(P17=\"F\",P19=\"F\"),AND(P17=\"A\",P19=\"A\")),O19,IF(OR(P17=\"F\",P17=\"A\"),O17,IF(OR(P19=\"F\",P19=\"A\"),O19,IF(P17=P19,\"\",(IF(P17<P19,P17-P19,P19-P17))))))","v":0},null,"Match 4 - Billard num  :",null,null,null,{"$f":"IF(OR(AND(P17=\"F\",P19=\"F\"),AND(P17=\"A\",P19=\"A\")),N17,IF(OR(P17=\"F\",P17=\"A\"),N19,IF(OR(P19=\"F\",P19=\"A\"),N17,IF(P17=P19,\"\",(IF(P17>P19,N17,N19))))))","v":"BRUNET MAURICE  "},{"$f":"IF(OR(AND(P17=\"F\",P19=\"F\"),AND(P17=\"A\",P19=\"A\")),O17,IF(OR(P17=\"F\",P17=\"A\"),O19,IF(OR(P19=\"F\",P19=\"A\"),O17,IF(P17=P19,\"\",(IF(P17>P19,P17-P19,P19-P17))))))","v":0},null,null,null,null,"Billard 4"]
[null,null,null,null,null,null,null,null,null,null,null,"P4",null,{"$f":"P_C2","v":"BRUNET MAURICE  "},null,null,null,"G4",null,null,null,null,null,"Billard 5"]
[null,null,null,null,null,null,{"$f":"IF(OR(T4=\"F\",T4=\"A\"),R4,IF(OR(T8=\"F\",T8=\"A\"),R8,IF(T4=T8,\"\",(IF(T4<T8,R4,R8)))))","v":""},{"$f":"IF(OR(T4=\"F\",T4=\"A\"),S4,IF(OR(T8=\"F\",T8=\"A\"),S8,IF(T4=T8,\"\",(IF(T4<T8,T4-T8+S4,T8-T4+S8)))))","v":""},null,null,null,null,null,null,null,null,null,null,null,null,null,null,null,"Billard 6"]
[null,null,null,null,null,null,null,"P5"]
[null,null,null,null,null,"Sortie de poule : 2eme et 3eme place",null,null,null,null,null,null,null,"Sortie de poule : 1ere place"]
[null,null,null,null,null,null,"P11",null,null,null,null,null,null,"G5"]
[null,null,null,null,null,null,{"$f":"IF(OR(AND(P24=\"F\",P28=\"F\"),AND(P24=\"A\",P28=\"A\")),N28,IF(OR(P24=\"F\",P24=\"A\"),N24,IF(OR(P28=\"F\",P28=\"A\"),N28,IF(P24=P28,\"\",(IF(P24<P28,N24,N28))))))","v":""},{"$f":"(IF(P24=P28,\"\",IF(P24>P28,P28-P24+P24,P24-P28+O24)))","v":""},null,null,null,null,null,{"$f":"IF(OR(T4=\"F\",T4=\"A\"),R8,IF(OR(T8=\"F\",T8=\"A\"),R4,IF(T4=T8,\"\",(IF(T4>T8,R4,R8)))))","v":""},{"$f":"IF(OR(T4=\"F\",T4=\"A\"),S8,IF(OR(T8=\"F\",T8=\"A\"),S4,IF(T4=T8,\"\",(IF(T4>T8,T4-T8+S4,T8-T4+S8)))))","v":""}]
[]
[null,null,null,null,null,null,"Match 13 - Billard num  :",null,null,"G",{"$f":"IF(I24=I28,\"\",IF(I24>I28,G24,G28))","v":""},{"$f":"IF(OR(I24=\"F\",I28=\"A\"),H24,IF(OR(I24=\"A\",I28=\"F\"),H28,IF(I24=I28,\"\",(IF(I24>I28,I24-I28+H24,I28-I24+H28)))))","v":""},null,"Match 11 - Billard num  :",null,null,"C",{"$f":"IF(OR(AND(P24=\"F\",P28=\"F\"),AND(P24=\"A\",P28=\"A\")),N24,IF(OR(P24=\"F\",P28=\"A\"),N28,IF(OR(P28=\"F\",P28=\"A\"),N24,IF(P24=P28,\"\",(IF(P24>P28,N24,N28))))))","v":""},{"$f":"IF(OR(I24=\"F\",I28=\"A\"),H24,IF(OR(I24=\"A\",I28=\"F\"),H28,IF(I28=I24,\"\",(IF(I24>I28,I24-H28+L26,I28-I24+H28)))))","v":""}]
[null,null,null,null,null,null,"G12",null,null,null,null,null,null,"G6"]
[null,null,null,null,null,null,{"$f":"B12","v":""},{"$f":"C12","v":""},null,null,null,null,null,{"$f":"IF(OR(T14=\"F\",T14=\"A\"),R18,IF(OR(T18=\"F\",T18=\"A\"),R14,IF(T14=T18,\"\",(IF(T14>T18,R14,R18)))))","v":""},{"$f":"IF(OR(T14=\"F\",T14=\"A\"),S18,IF(OR(T18=\"F\",T18=\"A\"),S14,IF(T14=T18,\"\",(IF(T14>T18,T14-T18+S14,T18-T14+S18)))))","v":""}]

{"sheet":"4","index":7,"n_rows":28,"n_cols":43,"rows_kept":28,"cut":false,"hidden":false,"merged":[[21,5,21,9],[21,13,21,15],[10,14,10,17],[10,9,10,12],[20,10,20,18]]}
[]
[]
[null,null,null,null,null,null,null,null,null,null,null,"P1",null,{"$f":"P_D1","v":"LE GOFF THIERRY  "},null,null,null,"G1",null,null,null,null,null,null,null,null,null,null,null,null,"G","P","G","P","G","P","G","P","G","P","G","P","Ga"]
[null,null,null,null,null,null,null,null,null,"F",{"$f":"IF(OR(AND(P3=\"F\",P5=\"F\"),AND(P3=\"A\",P5=\"A\")),N5,IF(OR(P3=\"F\",P3=\"A\"),N3,IF(OR(P5=\"F\",P5=\"A\"),N5,IF(P3=P5,\"\",(IF(P3<P5,N3,N5))))))","v":" "},{"$f":"IF(OR(AND(P3=\"F\",P5=\"F\"),AND(P3=\"A\",P5=\"A\")),O5,IF(OR(P3=\"F\",P3=\"A\"),O3,IF(OR(P5=\"F\",P5=\"A\"),O5,IF(P3=P5,\"\",(IF(P3<P5,P3-P5,P5-P3))))))","v":0},null,"Match 1 - Billard num  :",null,null,null,{"$f":"IF(OR(AND(P3=\"F\",P5=\"F\"),AND(P3=\"A\",P5=\"A\")),N3,IF(OR(P3=\"F\",P3=\"A\"),N5,IF(OR(P5=\"F\",P5=\"A\"),N3,IF(P3=P5,\"\",(IF(P3>P5,N3,N5))))))","v":"LE GOFF THIERRY  "},{"$f":"IF(OR(AND(P3=\"F\",P5=\"F\"),AND(P3=\"A\",P5=\"A\")),O3,IF(OR(P3=\"F\",P3=\"A\"),O5,IF(OR(P5=\"F\",P5=\"A\"),O3,IF(P3=P5,\"\",(IF(P3>P5,P3-P5,P5-P3))))))","v":0},null,null,null,null,"Classement Poule 4",null,null,1,{"$f":"IF(N24=\"\",\"\",IF(N24=R4,R4,R8))","v":""},null,{"$f":"N3","v":"LE GOFF THIERRY  "},{"$f":"IF(AD4=N3,IF(P5=\"F\",\"\",P3),0)","v":""},{"$f":"IF(AD4=N3,IF(P3=\"F\",\"\",P5),0)","v":"F"},{"$f":"IF(AD4=R4,IF(T8=\"F\",\"\",T4),0)","v":0},{"$f":"IF(AD4=R4,IF(T4=\"F\",\"\",T8),0)","v":0},{"$f":"IF(AD4=K4,IF(J8=\"F\",\"\",J4),0)","v":0},{"$f":"IF(AD4=K4,IF(J4=\"F\",\"\",J8),0)","v":0},{"$f":"IF(AD4=G6,IF(F10=\"F\",\"\",F6),0)","v":0},{"$f":"IF(AD4=G6,IF(F6=\"F\",\"\",F10),0)","v":0},{"$f":"IF(AD4=G20,IF(F16=\"F\",\"\",F20),0)","v":0},{"$f":"IF(AD4=G20,IF(F20=\"F\",\"\",F16),0)","v":0},{"$f":"SUM(AE4,AG4,AI4,AK4,AM4)","v":0},0,{"$f":"AO4-AP4","v":0}]
[null,null,null,null,null,null,null,"G7",null,null,null,null,null,{"$f":"P_D8","v":" "},null,"F",null,null,null,null,null,null,1,{"$f":"IF(OR(AND(P24=\"F\",P28=\"F\"),AND(P24=\"A\",P28=\"A\")),N24,IF(OR(P24=\"F\",P28=\"A\"),N28,IF(OR(P28=\"F\",P28=\"A\"),N24,IF(P24=P28,\"\",(IF(P24>P28,N24,N28))))))","v":""},{"$f":"QP1_AG","v":""},"D",3,{"$f":"IF(B8=\"\",\"\",IF(B8=G6,G6,G10))","v":""},null,{"$f":"N5","v":" "},{"$f":"IF(AD5=N5,IF(P3=\"F\",\"\",P5),0)","v":"F"},{"$f":"IF(AD5=N5,IF(P5=\"F\",\"\",P3),0)","v":""},{"$f":"IF(AD5=R4,IF(T8=\"F\",\"\",T4),0)","v":0},{"$f":"IF(AD5=R4,IF(T4=\"F\",\"\",T8),0)","v":0},{"$f":"IF(AD5=K4,IF(J8=\"F\",\"\",J4),0)","v":""},{"$f":"IF(AD5=K4,IF(J4=\"F\",\"\",J8),0)","v":""},{"$f":"IF(AD5=G6,IF(F10=\"F\",\"\",F6),0)","v":"F"},{"$f":"IF(AD5=G6,IF(F6=\"F\",\"\",F10),0)","v":""},{"$f":"IF(AD5=G20,IF(F16=\"F\",\"\",F20),0)","v":0},{"$f":"IF(AD5=G20,IF(F20=\"F\",\"\",F16),0)","v":0},0,0,{"$f":"AO5-AP5","v":0}]
[null,null,null,null,null,"F",{"$f":"IF(OR(J4=\"F\",J4=\"A\"),K8,IF(OR(J8=\"F\",J8=\"A\"),K4,IF(J4=J8,\"\",(IF(J4>J8,K4,K8)))))","v":" "},{"$f":"IF(OR(J4=\"F\",J4=\"A\"),L8,IF(OR(J8=\"F\",J8=\"A\"),L4,IF(J4=J8,\"\",(IF(J4>J8,J4-J8+L4,J8-J4+L8)))))","v":0},null,null,"Match 7 - Billard num :",null,null,null,null,null,null,"Match 5 - Billard num  :",null,null,null,null,2,{"$f":"IF(I24=I28,\"\",IF(I24>I28,G24,G28))","v":""},{"$f":"IF(OR(I24=\"F\",I28=\"A\"),H24,IF(OR(I24=\"A\",I28=\"F\"),H28,IF(I24=I28,\"\",(IF(I24>I28,I24-I28+H24,I28-I24+H28)))))","v":""},"H",5,{"$f":"IF(B8=\"\",\"\",IF(B8=G6,G10,G6))","v":""},null,{"$f":"N7","v":" "},{"$f":"IF(AD6=N7,IF(P9=\"F\",\"\",P7),0)","v":"F"},{"$f":"IF(AD6=N7,IF(P7=\"F\",\"\",P9),0)","v":""},{"$f":"IF(AD6=R8,IF(T4=\"F\",\"\",T8),0)","v":0},{"$f":"IF(AD6=R8,IF(T8=\"F\",\"\",T4),0)","v":0},{"$f":"IF(AD6=K8,IF(J4=\"F\",\"\",J8),0)","v":""},{"$f":"IF(AD6=K8,IF(J8=\"F\",\"\",J4),0)","v":""},{"$f":"IF(AD6=G6,IF(F10=\"F\",\"\",F6),0)","v":"F"},{"$f":"IF(AD6=G6,IF(F6=\"F\",\"\",F10),0)","v":""},{"$f":"IF(AD6=G20,IF(F16=\"F\",\"\",F20),0)","v":0},{"$f":"IF(AD6=G20,IF(F20=\"F\",\"\",F16),0)","v":0},0,0,{"$f":"AO6-AP6","v":0}]
[null,null,"G9",null,null,null,null,null,null,null,null,null,null,{"$f":"P_D5","v":" "},null,"F",null,null,null,null,null,null,3,{"$f":"IF(I24=I28,\"\",IF(I24<I28,G24,G28))","v":""},{"$f":"IF(OR(I24=\"F\",I28=\"A\"),H24,IF(OR(I24=\"A\",I28=\"F\"),H28,IF(I24=I28,\"\",(IF(I24<I28,I24-I28+H24,I28-I24+H28)))))","v":""},null,7,{"$f":"IF(G6=\"\",\"\",IF(G6=K4,K8,K4))","v":" "},null,{"$f":"N9","v":"BACCAM HELENE  "},{"$f":"IF(AD7=N9,IF(P7=\"F\",\"\",P9),0)","v":""},{"$f":"IF(AD7=N9,IF(P9=\"F\",\"\",P7),0)","v":"F"},{"$f":"IF(AD7=R8,IF(T4=\"F\",\"\",T8),0)","v":0},{"$f":"IF(AD7=R8,IF(T8=\"F\",\"\",T4),0)","v":0},{"$f":"IF(AD7=K8,IF(J4=\"F\",\"\",J8),0)","v":0},{"$f":"IF(AD7=K8,IF(J8=\"F\",\"\",J4),0)","v":0},{"$f":"IF(AD7=G6,IF(F10=\"F\",\"\",F6),0)","v":0},{"$f":"IF(AD7=G6,IF(F6=\"F\",\"\",F10),0)","v":0},{"$f":"IF(AD7=G20,IF(F16=\"F\",\"\",F20),0)","v":0},{"$f":"IF(AD7=G20,IF(F20=\"F\",\"\",F16),0)","v":0},0,0,{"$f":"AO7-AP7","v":0}]
[null,{"$f":"IF(OR(F6=\"F\",F6=\"A\"),G10,IF(OR(F10=\"F\",F10=\"A\"),G6,IF(F6=F10,\"\",(IF(F6>F10,G6,G10)))))","v":""},{"$f":"IF(OR(F6=\"F\",F6=\"A\"),H10,IF(OR(F10=\"F\",F10=\"A\"),H6,IF(F6=F10,\"\",(IF(F6>F10,F6-F10+H6,F10-F6+H10)))))","v":""},null,null,null,"Match 9 - Billard num  :",null,null,"F",{"$f":"IF(OR(AND(P7=\"F\",P9=\"F\"),AND(P7=\"A\",P9=\"A\")),N9,IF(OR(P7=\"F\",P7=\"A\"),N7,IF(OR(P9=\"F\",P9=\"A\"),N9,IF(P7=P9,\"\",(IF(P7<P9,N7,N9))))))","v":" "},{"$f":"IF(OR(AND(P7=\"F\",P9=\"F\"),AND(P7=\"A\",P9=\"A\")),O9,IF(OR(P7=\"F\",P7=\"A\"),O7,IF(OR(P9=\"F\",P9=\"A\"),O9,IF(P7=P9,\"\",(IF(P7<P9,P7-P9,P9-P7))))))","v":0},null,"Match 2 - Billard num  :",null,null,null,{"$f":"IF(OR(AND(P7=\"F\",P9=\"F\"),AND(P7=\"A\",P9=\"A\")),N7,IF(OR(P7=\"F\",P7=\"A\"),N9,IF(OR(P9=\"F\",P9=\"A\"),N7,IF(P7=P9,\"\",(IF(P7>P9,N7,N9))))))","v":"BACCAM HELENE  "},{"$f":"IF(OR(AND(P7=\"F\",P9=\"F\"),AND(P7=\"A\",P9=\"A\")),O7,IF(OR(P7=\"F\",P7=\"A\"),O9,IF(OR(P9=\"F\",P9=\"A\"),O7,IF(P7=P9,\"\",(IF(P7>P9,P7-P9,P9-P7))))))","v":0},null,null,null,4,{"$f":"IF(OR(D8=\"F\",D8=\"A\"),K18,IF(OR(D18=\"F\",D18=\"A\"),K8,IF(D8=D18,\"\",(IF(D8<D18,B8,B18)))))","v":""},{"$f":"IF(OR(D8=\"F\",D8=\"A\"),C18,IF(OR(D18=\"F\",D18=\"A\"),C8,IF(D8=D18,\"\",(IF(D8<D18,D8-D18+C8,D18-D8+C18)))))","v":""}]
[null,null,null,"  ",null,null,null,null,null,null,null,"P2",null,{"$f":"P_D4","v":"BACCAM HELENE  "},null,null,null,"G2",null,null,null,null,5,{"$f":"AB6","v":""},{"$f":"IF(X9=\"\",\"\",(VLOOKUP(X9,AD4:AQ17,14,FALSE)))","v":""}]
[null,null,null,null,null,null,{"$f":"IF(OR(T14=\"F\",T14=\"A\"),R14,IF(OR(T18=\"F\",T18=\"A\"),R18,IF(T14=T18,\"\",(IF(T14<T18,R14,R18)))))","v":""},{"$f":"IF(OR(T14=\"F\",T14=\"A\"),S14,IF(OR(T18=\"F\",T18=\"A\"),S18,IF(T14=T18,\"\",(IF(T14<T18,T14-T18+S14,T18-T14+S18)))))","v":""},null,null,null,null,null,null,null,null,null,null,null,null,null,null,6,{"$f":"AB16","v":""},{"$f":"IF(X10=\"\",\"\",(VLOOKUP(X10,AD4:AQ17,14,FALSE)))","v":""}]
[null,null,null,null,null,null,null,"P6",null,"ïMATCHS EN 2 PARTIES GAGNANTES",null,null,null,null,"MATCHS EN 3 PARTIES GAGNANTES ð",null,null,null,null,null,null,null,7,{"$f":"AB7","v":" "},{"$f":"IF(X11=\"\",\"\",(VLOOKUP(X11,AD4:AQ17,14,FALSE)))","v":0}]
[null,{"$f":"IF(OR(D8=\"F\",D8=\"A\"),K18,IF(OR(D18=\"F\",D18=\"A\"),K8,IF(D8=D18,\"\",(IF(D8>D18,B8,B18)))))","v":""},{"$f":"IF(OR(D8=\"F\",D8=\"A\"),C18,IF(OR(D18=\"F\",D18=\"A\"),C8,IF(D8=D18,\"\",(IF(D8>D18,D8-D18+C8,D18-D8+C18)))))","v":""},null,null,null,null,null,null,null,null,null,null,null,null,null,null,null,null,null,null,null,8,{"$f":"AB17","v":" "},{"$f":"IF(X12=\"\",\"\",(VLOOKUP(X12,AD4:AQ17,14,FALSE)))","v":0}]
[null,"Match 12 - Billard num  :",null,null,null,null,null,null,null,null,null,"P3",null,{"$f":"P_D3","v":"ROZIER MYRIAM  "},null,null,null,"G3",null,null,null,null,null,null,null,null,null,null,null,null,"G","P","G","P","G","P","G","P","G","P","G","P","Ga"]
[null,null,null,null,null,null,null,null,null,"F",{"$f":"IF(OR(AND(P13=\"F\",P15=\"F\"),AND(P13=\"A\",P15=\"A\")),N15,IF(OR(P13=\"F\",P13=\"A\"),N13,IF(OR(P15=\"F\",P15=\"A\"),N15,IF(P13=P15,\"\",(IF(P13<P15,N13,N15))))))","v":" "},{"$f":"IF(OR(AND(P13=\"F\",P15=\"F\"),AND(P13=\"A\",P15=\"A\")),O15,IF(OR(P13=\"F\",P13=\"A\"),O13,IF(OR(P15=\"F\",P15=\"A\"),O15,IF(P13=P15,\"\",(IF(P13<P15,P13-P15,P15-P13))))))","v":0},null,"Match 3 - Billard num  :",null,null,null,{"$f":"IF(OR(AND(P13=\"F\",P15=\"F\"),AND(P13=\"A\",P15=\"A\")),N13,IF(OR(P13=\"F\",P13=\"A\"),N15,IF(OR(P15=\"F\",P15=\"A\"),N13,IF(P13=P15,\"\",(IF(P13>P15,N13,N15))))))","v":"ROZIER MYRIAM  "},{"$f":"IF(OR(AND(P13=\"F\",P15=\"F\"),AND(P13=\"A\",P15=\"A\")),O13,IF(OR(P13=\"F\",P13=\"A\"),O15,IF(OR(P15=\"F\",P15=\"A\"),O13,IF(P13=P15,\"\",(IF(P13>P15,P13-P15,P15-P13))))))","v":0},null,null,null,null,"Billard Libre",null,null,2,{"$f":"IF(N28=\"\",\"\",IF(N28=R14,R14,R18))","v":""},null,{"$f":"N13","v":"ROZIER MYRIAM  "},{"$f":"IF(AD14=N13,IF(P15=\"F\",\"\",P13),0)","v":""},{"$f":"IF(AD14=N13,IF(P13=\"F\",\"\",P15),0)","v":"F"},{"$f":"IF(AD14=R14,IF(T18=\"F\",\"\",T14),0)","v":0},{"$f":"IF(AD14=R14,IF(T14=\"F\",\"\",T18),0)","v":0},{"$f":"IF(AD14=K14,IF(J18=\"F\",\"\",J14),0)","v":0},{"$f":"IF(AD14=K14,IF(J14=\"F\",\"\",J18),0)","v":0},{"$f":"IF(AD14=G16,IF(F20=\"F\",\"\",F16),0)","v":0},{"$f":"IF(AD14=G16,IF(F16=\"F\",\"\",F20),0)","v":0},{"$f":"IF(AD14=G10,IF(F6=\"F\",\"\",F10),0)","v":0},{"$f":"IF(AD14=G10,IF(F10=\"F\",\"\",F6),0)","v":0},{"$f":"SUM(AE14,AG14,AI14,AK14,AM14)","v":0},0,{"$f":"AO14-AP14","v":0}]
[null,null,null,null,null,null,null,"G8",null,null,null,null,null,{"$f":"P_D6","v":" "},null,"F",null,null,null,null,null,null,1,"Billard 1",null,null,4,{"$f":"IF(B18=\"\",\"\",IF(B18=G16,G16,G20))","v":""},null,{"$f":"N15","v":" "},{"$f":"IF(AD15=N15,IF(P13=\"F\",\"\",P15),0)","v":"F"},{"$f":"IF(AD15=N15,IF(P15=\"F\",\"\",P13),0)","v":""},{"$f":"IF(AD15=R14,IF(T18=\"F\",\"\",T14),0)","v":0},{"$f":"IF(AD15=R14,IF(T14=\"F\",\"\",T18),0)","v":0},{"$f":"IF(AD15=K14,IF(J18=\"F\",\"\",J14),0)","v":""},{"$f":"IF(AD15=K14,IF(J14=\"F\",\"\",J18),0)","v":""},{"$f":"IF(AD15=G16,IF(F20=\"F\",\"\",F16),0)","v":"F"},{"$f":"IF(AD15=G16,IF(F16=\"F\",\"\",F20),0)","v":""},{"$f":"IF(AD15=G10,IF(F6=\"F\",\"\",F10),0)","v":0},{"$f":"IF(AD15=G10,IF(F10=\"F\",\"\",F6),0)","v":0},0,0,{"$f":"AO15-AP15","v":0}]
[null,null,null,null,null,"F",{"$f":"IF(OR(J14=\"F\",J14=\"A\"),K18,IF(OR(J18=\"F\",J18=\"A\"),K14,IF(J14=J18,\"\",(IF(J14>J18,K14,K18)))))","v":" "},{"$f":"IF(OR(J14=\"F\",J14=\"A\"),L18,IF(OR(J18=\"F\",J18=\"A\"),L14,IF(J14=J18,\"\",(IF(J14>J18,J14-J18+L14,J18-J14+L18)))))","v":0},null,null,"Match 8 - Billard num  :",null,null,null,null,null,null,"Match 6 - Billard num  :",null,null,null,null,2,"Billard 2",null,null,6,{"$f":"IF(B18=\"\",\"\",IF(B18=G16,G20,G16))","v":""},null,{"$f":"N17","v":" "},{"$f":"IF(AD16=N17,IF(P19=\"F\",\"\",P17),0)","v":"F"},{"$f":"IF(AD16=N17,IF(P17=\"F\",\"\",P19),0)","v":""},{"$f":"IF(AD16=R18,IF(T14=\"F\",\"\",T18),0)","v":0},{"$f":"IF(AD16=R18,IF(T18=\"F\",\"\",T14),0)","v":0},{"$f":"IF(AD16=K18,IF(J14=\"F\",\"\",J18),0)","v":""},{"$f":"IF(AD16=K18,IF(J18=\"F\",\"\",J14),0)","v":""},{"$f":"IF(AD16=G16,IF(F20=\"F\",\"\",F16),0)","v":"F"},{"$f":"IF(AD16=G16,IF(F16=\"F\",\"\",F20),0)","v":""},{"$f":"IF(AD16=G10,IF(F6=\"F\",\"\",F10),0)","v":0},{"$f":"IF(AD16=G10,IF(F10=\"F\",\"\",F6),0)","v":0},0,0,{"$f":"AO16-AP16","v":0}]
[null,null,"G10",null,null,null,null,null,null,null,null,null,null,{"$f":"P_D7","v":" "},null,"F",null,null,null,null,null,null,3,"Billard 3",null,null,8,{"$f":"IF(G16=\"\",\"\",IF(G16=K14,K18,K14))","v":" "},null,{"$f":"N19","v":"VALLOT ROMAIN  "},{"$f":"IF(AD17=N19,IF(P17=\"F\",\"\",P19),0)","v":""},{"$f":"IF(AD17=N19,IF(P19=\"F\",\"\",P17),0)","v":"F"},{"$f":"IF(AD17=R18,IF(T14=\"F\",\"\",T18),0)","v":0},{"$f":"IF(AD17=R18,IF(T18=\"F\",\"\",T14),0)","v":0},{"$f":"IF(AD17=K18,IF(J14=\"F\",\"\",J18),0)","v":0},{"$f":"IF(AD17=K18,IF(J18=\"F\",\"\",J14),0)","v":0},{"$f":"IF(AD17=G16,IF(F20=\"F\",\"\",F16),0)","v":0},{"$f":"IF(AD17=G16,IF(F16=\"F\",\"\",F20),0)","v":0},{"$f":"IF(AD17=G10,IF(F6=\"F\",\"\",F10),0)","v":0},{"$f":"IF(AD17=G10,IF(F10=\"F\",\"\",F6),0)","v":0},0,{"$f":"SUM(AF17,AH17,AJ17,AL17,AN17)","v":0},{"$f":"AO17-AP17","v":0}]
[null,{"$f":"IF(OR(F16=\"F\",F16=\"A\"),G20,IF(OR(F20=\"F\",F20=\"A\"),G16,IF(F16=F20,\"\",(IF(F16>F20,G16,G20)))))","v":""},{"$f":"IF(OR(F16=\"F\",F16=\"A\"),H20,IF(OR(F20=\"F\",F20=\"A\"),H16,IF(F16=F20,\"\",(IF(F16>F20,F16-F20+H16,F20-F16+H20)))))","v":""},null,null,null,"Match 10 - Billard num  :",null,null,"F",{"$f":"IF(OR(AND(P17=\"F\",P19=\"F\"),AND(P17=\"A\",P19=\"A\")),N19,IF(OR(P17=\"F\",P17=\"A\"),N17,IF(OR(P19=\"F\",P19=\"A\"),N19,IF(P17=P19,\"\",(IF(P17<P19,N17,N19))))))","v":" "},{"$f":"IF(OR(AND(P17=\"F\",P19=\"F\"),AND(P17=\"A\",P19=\"A\")),O19,IF(OR(P17=\"F\",P17=\"A\"),O17,IF(OR(P19=\"F\",P19=\"A\"),O19,IF(P17=P19,\"\",(IF(P17<P19,P17-P19,P19-P17))))))","v":0},null,"Match 4 - Billard num  :",null,null,null,{"$f":"IF(OR(AND(P17=\"F\",P19=\"F\"),AND(P17=\"A\",P19=\"A\")),N17,IF(OR(P17=\"F\",P17=\"A\"),N19,IF(OR(P19=\"F\",P19=\"A\"),N17,IF(P17=P19,\"\",(IF(P17>P19,N17,N19))))))","v":"VALLOT ROMAIN  "},{"$f":"IF(OR(AND(P17=\"F\",P19=\"F\"),AND(P17=\"A\",P19=\"A\")),O17,IF(OR(P17=\"F\",P17=\"A\"),O19,IF(OR(P19=\"F\",P19=\"A\"),O17,IF(P17=P19,\"\",(IF(P17>P19,P17-P19,P19-P17))))))","v":0},null,null,null,4,"Billard 4"]
[null,null,null,null,null,null,null,null,null,null,null,"P4",null,{"$f":"P_D2","v":"VALLOT ROMAIN  "},null,null,null,"G4",null,null,null,null,5,"Billard 5"]
[null,null,null,null,null,null,{"$f":"IF(OR(T4=\"F\",T4=\"A\"),R4,IF(OR(T8=\"F\",T8=\"A\"),R8,IF(T4=T8,\"\",(IF(T4<T8,R4,R8)))))","v":""},{"$f":"IF(OR(T4=\"F\",T4=\"A\"),S4,IF(OR(T8=\"F\",T8=\"A\"),S8,IF(T4=T8,\"\",(IF(T4<T8,T4-T8+S4,T8-T4+S8)))))","v":""},null,null,null,null,null,null,null,null,null,null,null,null,null,null,6,"Billard 6"]
[null,null,null,null,null,null,null,"P5"]
[null,null,null,null,null,"Sortie de poule : 2eme et 3eme place",null,null,null,null,null,null,null,"Sortie de poule : 1ere place"]
[null,null,null,null,null,null,"P11",null,null,null,null,null,null,"G5"]
[null,null,null,null,null,null,{"$f":"IF(OR(AND(P24=\"F\",P28=\"F\"),AND(P24=\"A\",P28=\"A\")),N28,IF(OR(P24=\"F\",P24=\"A\"),N24,IF(OR(P28=\"F\",P28=\"A\"),N28,IF(P24=P28,\"\",(IF(P24<P28,N24,N28))))))","v":""},{"$f":"(IF(P24=P28,\"\",IF(P24>P28,P28-P24+P24,P24-P28+O24)))","v":""},null,null,null,null,null,{"$f":"IF(OR(T4=\"F\",T4=\"A\"),R8,IF(OR(T8=\"F\",T8=\"A\"),R4,IF(T4=T8,\"\",(IF(T4>T8,R4,R8)))))","v":""},{"$f":"IF(OR(T4=\"F\",T4=\"A\"),S8,IF(OR(T8=\"F\",T8=\"A\"),S4,IF(T4=T8,\"\",(IF(T4>T8,T4-T8+S4,T8-T4+S8)))))","v":""}]
[]
[null,null,null,null,null,null,"Match 13 - Billard num  :",4,null,"H",{"$f":"IF(I24=I28,\"\",IF(I24>I28,G24,G28))","v":""},{"$f":"IF(OR(I24=\"F\",I28=\"A\"),H24,IF(OR(I24=\"A\",I28=\"F\"),H28,IF(I24=I28,\"\",(IF(I24>I28,I24-I28+H24,I28-I24+H28)))))","v":""},null,"Match 11 - Billard num  :",6,null,"D",{"$f":"IF(OR(AND(P24=\"F\",P28=\"F\"),AND(P24=\"A\",P28=\"A\")),N24,IF(OR(P24=\"F\",P28=\"A\"),N28,IF(OR(P28=\"F\",P28=\"A\"),N24,IF(P24=P28,\"\",(IF(P24>P28,N24,N28))))))","v":""},{"$f":"IF(OR(P24=\"F\",P28=\"A\"),O24,IF(OR(P24=\"A\",P28=\"F\"),O28,IF(P24=P28,\"\",(IF(P24>P28,P24-P28+O24,P28-P24+O28)))))","v":""}]
[null,null,null,null,null,null,"G12",null,null,null,null,null,null,"G6"]
[null,null,null,null,null,null,{"$f":"B12","v":""},{"$f":"C12","v":""},null,null,null,null,null,{"$f":"IF(OR(T14=\"F\",T14=\"A\"),R18,IF(OR(T18=\"F\",T18=\"A\"),R14,IF(T14=T18,\"\",(IF(T14>T18,R14,R18)))))","v":""},{"$f":"IF(OR(T14=\"F\",T14=\"A\"),S18,IF(OR(T18=\"F\",T18=\"A\"),S14,IF(T14=T18,\"\",(IF(T14>T18,T14-T18+S14,T18-T14+S18)))))","v":""}]

{"sheet":"Final","index":8,"n_rows":69,"n_cols":56,"rows_kept":69,"cut":false,"hidden":false,"merged":[[2,11,2,13],[2,3,2,5],[30,16,30,17],[0,3,0,5],[1,3,1,5],[1,18,1,20],[1,24,1,26],[1,30,1,32],[0,11,0,13],[1,11,1,13],[0,30,0,32],[0,24,0,26],[0,18,0,20]]}
[null,null,null,"1/16 de finale",null,null,null,null,null,null,null,"1/8 de finale",null,null,null,null,null,null,"1/4 de finale",null,null,null,null,null,"1/2 finale",null,null,null,null,null,"Finale"]
[null,null,null,"(4 manches)",null,null,null,null,null,null,null,"(4 manches)",null,null,null,null,null,null,"(4 manches)",null,null,null,null,null,"(4 manches)",null,null,null,null,null,"(5 manches)"]
[null,null,null,"Entrée des TSB",null,null,null,null,null,null,null,"Entrée des TSA"]
[]
[]
[null,null,null,null,null,"GA","CF","RF","N°",null,null,null,null,"GA","CF","RF","N°"]
[null,null,"TSB (16)",{"$f":"TSB_8","v":"HERRY MIREILLE  "},null,null,null,null,null,null,"TSA (1)",{"$f":"TSA_1","v":"DUDIT FABIEN  "},null,null,null,null,null,null,null,null,"GA","CF","RF"]
[null,null,"A",{"$f":"P1_1","v":""},{"$f":"P1_1G","v":""},null,null,null,null,null,null,{"$f":"IF(OR(AND(F7=\"F\",F8=\"F\"),AND(F7=\"A\",F8=\"A\")),D7,IF(OR(F7=\"F\",F7=\"A\"),D8,IF(OR(F8=\"F\",F8=\"A\"),D7,IF(F7=F8,\"\",(IF(F7>F8,D7,D8))))))","v":""},{"$f":"IF(OR(AND(F7=\"F\",F8=\"F\"),AND(F7=\"A\",F8=\"A\")),E7,IF(OR(F7=\"F\",F7=\"A\"),E8,IF(OR(F8=\"F\",F8=\"A\"),E7,IF(F7=F8,\"\",(IF(F7>F8,F7-F8,F8-F7+E8))))))","v":""},null,null,null,null,null,{"$f":"IF(AND(N7=\"A\",N8=\"A\"),L7,IF(N7=\"A\",L8,IF(N8=\"A\",L7,IF(N7=N8,\"\",(IF(N7>N8,L7,L8))))))","v":""},{"$f":"IF(OR(AND(N7=\"F\",N8=\"F\"),AND(N7=\"A\",N8=\"A\")),M8,IF(OR(N7=\"F\",N7=\"A\"),M8,IF(OR(N8=\"F\",N8=\"A\"),M7,IF(N7=N8,\"\",(IF(N7>N8,N7-N8+M7,N8-N7+M8))))))","v":""},null,null,null,null,null,null,"GA","CF","RF"]
[null,null,null,null,null,null,null,null,null,null,null,null,null,null,null,null,null,null,"Billard N°",null,null,null,null,null,{"$f":"IF(AND(U8=\"A\",U10=\"A\"),S8,IF(U8=\"A\",S10,IF(U10=\"A\",S8,IF(U8=U10,\"\",(IF(U8>U10,S8,S10))))))","v":""},{"$f":"IF(OR(AND(U8=\"F\",U10=\"F\"),AND(U8=\"A\",U10=\"A\")),T10,IF(OR(U8=\"F\",U8=\"A\"),T10,IF(OR(U10=\"F\",U10=\"A\"),T8,IF(U8=U10,\"\",(IF(U8>U10,U8-U10+T8,U10-U8+T10))))))","v":""}]
[null,null,"TSB (9)",{"$f":"TSB_1","v":"SOPIC NICOLAS  "},null,null,null,null,null,null,"TSA (8)",{"$f":"TSA_8","v":"LETOURNEUR SEBASTIEN  "},null,null,null,null,null,null,{"$f":"IF(OR(AND(N10=\"F\",N11=\"F\"),AND(N10=\"A\",N11=\"A\")),L10,IF(OR(N10=\"F\",N10=\"A\"),L11,IF(OR(N11=\"F\",N11=\"A\"),L10,IF(N10=N11,\"\",(IF(N10>N11,L10,L11))))))","v":""},{"$f":"IF(OR(AND(N10=\"F\",N11=\"F\"),AND(N10=\"A\",N11=\"A\")),M10,IF(OR(N10=\"A\",N10=\"F\"),M11,IF(OR(N11=\"F\",N11=\"A\"),M10,IF(N10=N11,\"\",(IF(N10>N11,N10-N11,N11-N10+M11))))))","v":""}]
[null,null,"H",{"$f":"P4_2","v":0},{"$f":"P4_2G","v":0},null,null,null,null,null,null,{"$f":"IF(OR(AND(F10=\"F\",F11=\"F\"),AND(F10=\"A\",F11=\"A\")),D10,IF(OR(F10=\"F\",F10=\"A\"),D11,IF(OR(F11=\"F\",F11=\"A\"),D10,IF(F10=F11,\"\",(IF(F10>F11,D10,D11))))))","v":""},{"$f":"IF(OR(AND(F10=\"F\",F11=\"F\"),AND(F10=\"A\",F11=\"A\")),E10,IF(OR(F10=\"F\",F10=\"A\"),E11,IF(OR(F11=\"F\",F11=\"A\"),E10,IF(F10=F11,\"\",(IF(F10>F11,F10-F11,F11-F10+E11))))))","v":""},null,null,null,null,null,null,null,null,null,null,null,null,"N°",null,null,null,null,null,null,"GA","CF","RF"]
[null,null,null,null,null,null,null,null,null,null,null,null,null,null,null,null,null,null,null,null,null,null,null,null,"Billard N°",null,null,null,null,null,{"$f":"IF(AND(AA9=\"A\",AA15=\"A\"),Y9,IF(AA9=\"A\",Y15,IF(AA15=\"A\",Y9,IF(AA9=AA15,\"\",(IF(AA9>AA15,Y9,Y15))))))","v":""},{"$f":"IF(OR(AND(AA9=\"F\",AA15=\"F\"),AND(AA9=\"A\",AA15=\"A\")),Z15,IF(OR(AA9=\"F\",AA9=\"A\"),Z15,IF(OR(AA15=\"F\",AA15=\"A\"),Z9,IF(AA9=AA15,\"\",(IF(AA9>AA15,AA9-AA15+Z9,AA15-AA9+Z15))))))","v":""}]
[null,null,"TSB (12)",{"$f":"TSB_4","v":"PARDO RAMON  "},null,null,null,null,null,null,"TSA n°5",{"$f":"TSA_5","v":"BACCAM BOUNLIENG  "},null,null,null,null,null,null,null,null,"GA","CF","RF"]
[null,null,"F",{"$f":"P2_2","v":0},{"$f":"P2_2G","v":""},null,null,null,null,null,null,{"$f":"IF(OR(AND(F13=\"F\",F14=\"F\"),AND(F13=\"A\",F14=\"A\")),D13,IF(OR(F13=\"F\",F13=\"A\"),D14,IF(OR(F14=\"F\",F14=\"A\"),D13,IF(F13=F14,\"\",(IF(F13>F14,D13,D14))))))","v":""},{"$f":"IF(OR(AND(F13=\"F\",F14=\"F\"),AND(F13=\"A\",F14=\"A\")),E13,IF(OR(F13=\"F\",F13=\"A\"),E14,IF(OR(F14=\"F\",F14=\"A\"),E13,IF(F13=F14,\"\",(IF(F13>F14,F13-F14,F14-F13+E14))))))","v":""},null,null,null,null,null,{"$f":"IF(AND(N13=\"A\",N14=\"A\"),L13,IF(N13=\"A\",L14,IF(N14=\"A\",L13,IF(N13=N14,\"\",(IF(N13>N14,L13,L14))))))","v":""},{"$f":"IF(OR(AND(N13=\"F\",N14=\"F\"),AND(N13=\"A\",N14=\"A\")),M14,IF(OR(N13=\"F\",N13=\"A\"),M14,IF(OR(N14=\"F\",N14=\"A\"),M13,IF(N13=N14,\"\",(IF(N13>N14,N13-N14+M13,N14-N13+M14))))))","v":""},null,null,null,null,null,null,null,null,null,null,null,null,null,null,null,null,null,null,null,null,null,"JOUEURS","1/8","1/4","1/2","Finale","GA Final",null,"JOUEURS","GA Poules",null,"JOUEURS","GA Poules","GA Final","GA TOTAL"]
[null,null,null,null,null,null,null,null,null,null,null,null,null,null,null,null,null,null,"Billard N°",null,null,null,null,null,{"$f":"IF(AND(U14=\"A\",U16=\"A\"),S14,IF(U14=\"A\",S16,IF(U16=\"A\",S14,IF(U14=U16,\"\",(IF(U14>U16,S14,S16))))))","v":""},{"$f":"IF(OR(AND(U14=\"F\",U16=\"F\"),AND(U14=\"A\",U16=\"A\")),T16,IF(OR(U14=\"F\",U14=\"A\"),T16,IF(OR(U16=\"F\",U16=\"A\"),T14,IF(U14=U16,\"\",(IF(U14>U16,U14-U16+T14,U16-U14+T16))))))","v":""},null,null,1,null,null,null,null,null,null,null,null,null,null,null,null,null,{"$f":"L7","v":"DUDIT FABIEN  "},{"$f":"IF(AND(N7=\"A\",N8=\"A\"),0,IF(N7=\"A\",-N8,IF(N8=\"A\",N7,N7-N8)))","v":0},{"$f":"IF(S8=AQ15,IF(AND(U8=\"A\",U10=\"A\"),0,IF(OR(AR15>0,N8=\"A\"),IF(U8=\"A\",-U10,IF(U10=\"A\",U8,U8-U10)),0)),0)","v":0},{"$f":"IF(Y9=AQ15,IF(AND(AA9=\"A\",AA15=\"A\"),0,IF(OR(AS15>0,U10=\"A\"),IF(AA9=\"A\",-AA15,IF(AA15=\"A\",AA9,AA9-AA15)),0)),0)","v":0},{"$f":"IF(AE12=AQ15,IF(AND(AG12=\"A\",AG24=\"A\"),0,IF(OR(AT15>0,AA15=\"A\"),IF(AG12=\"A\",-AG24,IF(AG24=\"A\",AG12,AG12-AG24)),0)),0)","v":0},{"$f":"SUM(AR15:AU15)","v":0},null,{"$f":"#REF!","v":{"$error":"#REF!"}},{"$f":"#REF!","v":{"$error":"#REF!"}},null,{"$f":"IF(#REF!=0,\"\",#REF!)","v":{"$error":"#REF!"}},{"$f":"VLOOKUP(BA15,$AX$15:$AY$43,2,FALSE)","v":{"$error":"#REF!"}},{"$f":"VLOOKUP(BA15,$AQ$15:$AV$43,6,FALSE)","v":{"$error":"#REF!"}},{"$f":"BB15+BC15","v":{"$error":"#REF!"}}]
[null,null,"TSB (13)",{"$f":"TSB_5","v":"CHAIR MOURAD  "},null,null,null,null,null,null,"TSA (4)",{"$f":"TSA_4","v":"ROBEZ FLORENT  "},null,null,null,null,null,null,{"$f":"IF(OR(AND(N16=\"F\",N17=\"F\"),AND(N16=\"A\",N17=\"A\")),L16,IF(OR(N16=\"F\",N16=\"A\"),L17,IF(OR(N17=\"F\",N17=\"A\"),L16,IF(N16=N17,\"\",(IF(N16>N17,L16,L17))))))","v":""},{"$f":"IF(OR(AND(N16=\"F\",N17=\"F\"),AND(N16=\"A\",N17=\"A\")),M16,IF(OR(N16=\"A\",N16=\"F\"),M17,IF(OR(N17=\"F\",N17=\"A\"),M16,IF(N16=N17,\"\",(IF(N16>N17,N16-N17,N17-N16+M17))))))","v":""},null,null,1,null,null,null,null,null,null,null,null,null,null,null,null,null,null,null,null,null,null,null,{"$f":"L8","v":""},{"$f":"IF(AND(N7=\"A\",N8=\"A\"),0,IF(N8=\"A\",-N7,IF(N7=\"A\",N8,N8-N7)))","v":0},{"$f":"IF(S8=AQ16,IF(AND(U8=\"A\",U10=\"A\"),0,IF(OR(AR16>0,N7=\"A\"),IF(U8=\"A\",-U10,IF(U10=\"A\",U8,U8-U10)),0)),0)","v":0},{"$f":"IF(Y9=AQ16,IF(AND(AA9=\"A\",AA15=\"A\"),0,IF(OR(AS16>0,U10=\"A\"),IF(AA9=\"A\",-AA15,IF(AA15=\"A\",AA9,AA9-AA15)),0)),0)","v":0},{"$f":"IF(AE12=AQ16,IF(AND(AG12=\"A\",AG24=\"A\"),0,IF(OR(AT16>0,AA15=\"A\"),IF(AG12=\"A\",-AG24,IF(AG24=\"A\",AG12,AG12-AG24)),0)),0)","v":0},{"$f":"SUM(AR16:AU16)","v":0},null,{"$f":"#REF!","v":{"$error":"#REF!"}},{"$f":"#REF!","v":{"$error":"#REF!"}},null,{"$f":"IF(#REF!=0,\"\",#REF!)","v":{"$error":"#REF!"}},{"$error":"#REF!"},{"$error":"#REF!"},{"$error":"#REF!"}]
[null,null,"D",{"$f":"P4_1","v":0},{"$f":"P4_1G","v":0},null,null,null,null,null,null,{"$f":"IF(OR(AND(F16=\"F\",F17=\"F\"),AND(F16=\"A\",F17=\"A\")),D16,IF(OR(F16=\"F\",F16=\"A\"),D17,IF(OR(F17=\"F\",F17=\"A\"),D16,IF(F16=F17,\"\",(IF(F16>F17,D16,D17))))))","v":""},{"$f":"IF(OR(AND(F16=\"F\",F17=\"F\"),AND(F16=\"A\",F17=\"A\")),E16,IF(OR(F16=\"F\",F16=\"A\"),E17,IF(OR(F17=\"F\",F17=\"A\"),E16,IF(F16=F17,\"\",(IF(F16>F17,F16-F17,F17-F16+E17))))))","v":""},null,null,null,null,null,null,null,null,null,null,null,null,null,null,null,null,null,null,"N°",null,null,null,null,null,null,"CF","RF",null,null,{"$f":"L10","v":"LETOURNEUR SEBASTIEN  "},{"$f":"IF(AND(N10=\"A\",N11=\"A\"),0,IF(N10=\"A\",-N11,IF(N11=\"A\",N10,N10-N11)))","v":0},{"$f":"IF(S10=AQ17,IF(AND(U8=\"A\",U10=\"A\"),0,IF(OR(AR17>0,N11=\"A\"),IF(U10=\"A\",-U8,IF(U8=\"A\",U10,U10-U8)),0)),0)","v":0},{"$f":"IF(Y9=AQ17,IF(AND(AA9=\"A\",AA15=\"A\"),0,IF(OR(AS17>0,U8=\"A\"),IF(AA9=\"A\",-AA15,IF(AA15=\"A\",AA9,AA9-AA15)),0)),0)","v":0},{"$f":"IF(AE12=AQ17,IF(AND(AG12=\"A\",AG24=\"A\"),0,IF(OR(AT17>0,AA15=\"A\"),IF(AG12=\"A\",-AG24,IF(AG24=\"A\",AG12,AG12-AG24)),0)),0)","v":0},0,null,{"$f":"#REF!","v":{"$error":"#REF!"}},{"$f":"#REF!","v":{"$error":"#REF!"}},null,{"$f":"IF(#REF!=0,\"\",#REF!)","v":{"$error":"#REF!"}},{"$error":"#REF!"},{"$error":"#REF!"},{"$error":"#REF!"}]
[null,null,null,null,null,null,null,null,null,null,null,null,null,null,null,null,null,null,null,null,null,null,null,null,null,null,null,null,null,null,"Billard N°",null,null,null,null,null,{"$f":"IF(AND(AG12=\"A\",AG24=\"A\"),AE12,IF(AG12=\"A\",AE24,IF(AG24=\"A\",AE12,IF(AG12=AG24,\"\",(IF(AG12>AG24,AE12,AE24))))))","v":""},{"$f":"IF(OR(AND(AG12=\"F\",AG24=\"F\"),AND(AG12=\"A\",AG24=\"A\")),AF24,IF(OR(AG12=\"F\",AG12=\"A\"),AF24,IF(OR(AG24=\"F\",AG24=\"A\"),AF12,IF(AG12=AG24,\"\",(IF(AG12>AG24,AG12-AG24+AF12,AG24-AG12+AF24))))))","v":""},null,null,null,null,{"$f":"L11","v":""},{"$f":"IF(AND(N10=\"A\",N11=\"A\"),0,IF(N11=\"A\",-N10,IF(N10=\"A\",N11,N11-N10)))","v":0},{"$f":"IF(S10=AQ18,IF(AND(U8=\"A\",U10=\"A\"),0,IF(OR(AR18>0,N10=\"A\"),IF(U10=\"A\",-U8,IF(U8=\"A\",U10,U10-U8)),0)),0)","v":0},{"$f":"IF(Y9=AQ18,IF(AND(AA9=\"A\",AA15=\"A\"),0,IF(OR(AS18>0,U8=\"A\"),IF(AA9=\"A\",-AA15,IF(AA15=\"A\",AA9,AA9-AA15)),0)),0)","v":0},{"$f":"IF(AE12=AQ18,IF(AND(AG12=\"A\",AG24=\"A\"),0,IF(OR(AT18>0,AA15=\"A\"),IF(AG12=\"A\",-AG24,IF(AG24=\"A\",AG12,AG12-AG24)),0)),0)","v":0},0,null,{"$f":"#REF!","v":{"$error":"#REF!"}},{"$f":"#REF!","v":{"$error":"#REF!"}},null,{"$f":"IF(#REF!=0,\"\",#REF!)","v":{"$error":"#REF!"}},{"$error":"#REF!"},{"$error":"#REF!"},{"$error":"#REF!"}]
[null,null,"TSB (14)",{"$f":"TSB_6","v":"TEBBANI AZIZ  "},null,null,null,null,null,null,"TSA (3)",{"$f":"TSA_3","v":"LACROIX DYLAN  "},null,null,null,null,null,null,null,null,"GA","CF","RF",null,null,null,null,null,null,null,null,null,null,null,null,null,null,null,null,null,null,null,{"$f":"L13","v":"BACCAM BOUNLIENG  "},{"$f":"IF(AND(N13=\"A\",N14=\"A\"),0,IF(N13=\"A\",-N14,IF(N14=\"A\",N13,N13-N14)))","v":0},{"$f":"IF(S14=AQ19,IF(AND(U14=\"A\",U16=\"A\"),0,IF(OR(AR19>0,N14=\"A\"),IF(U14=\"A\",-U16,IF(U16=\"A\",U14,U14-U16)),0)),0)","v":0},{"$f":"IF(Y15=AQ19,IF(AND(AA9=\"A\",AA15=\"A\"),0,IF(OR(AS19>0,U16=\"A\"),IF(AA15=\"A\",-AA9,IF(AA9=\"A\",AA15,AA15-AA9)),0)),0)","v":0},{"$f":"IF(AE12=AQ19,IF(AND(AG12=\"A\",AG24=\"A\"),0,IF(OR(AT19>0,AA9=\"A\"),IF(AG12=\"A\",-AG24,IF(AG24=\"A\",AG12,AG12-AG24)),0)),0)","v":0},0,null,{"$f":"#REF!","v":{"$error":"#REF!"}},{"$f":"#REF!","v":{"$error":"#REF!"}},null,{"$f":"IF(#REF!=0,\"\",#REF!)","v":{"$error":"#REF!"}},{"$error":"#REF!"},{"$error":"#REF!"},{"$error":"#REF!"}]
[null,null,"C",{"$f":"P3_1","v":0},{"$f":"P3_1G","v":0},null,null,null,null,null,null,{"$f":"IF(OR(AND(F19=\"F\",F20=\"F\"),AND(F19=\"A\",F20=\"A\")),D19,IF(OR(F19=\"F\",F19=\"A\"),D20,IF(OR(F20=\"F\",F20=\"A\"),D19,IF(F19=F20,\"\",(IF(F19>F20,D19,D20))))))","v":""},{"$f":"IF(OR(AND(F19=\"F\",F20=\"F\"),AND(F19=\"A\",F20=\"A\")),E19,IF(OR(F19=\"F\",F19=\"A\"),E20,IF(OR(F20=\"F\",F20=\"A\"),E19,IF(F19=F20,\"\",(IF(F19>F20,F19-F20,F20-F19+E20))))))","v":""},null,null,null,null,null,{"$f":"IF(AND(N19=\"A\",N20=\"A\"),L19,IF(N19=\"A\",L20,IF(N20=\"A\",L19,IF(N19=N20,\"\",(IF(N19>N20,L19,L20))))))","v":""},{"$f":"IF(OR(AND(N19=\"F\",N20=\"F\"),AND(N19=\"A\",N20=\"A\")),M20,IF(OR(N19=\"F\",N19=\"A\"),M20,IF(OR(N20=\"F\",N20=\"A\"),M19,IF(N19=N20,\"\",(IF(N19>N20,N19-N20+M19,N20-N19+M20))))))","v":""},null,null,null,null,null,null,null,null,null,null,null,null,null,null,null,null,null,null,null,null,null,null,{"$f":"L14","v":""},{"$f":"IF(AND(N13=\"A\",N14=\"A\"),0,IF(N14=\"A\",-N13,IF(N13=\"A\",N14,N14-N13)))","v":0},{"$f":"IF(S14=AQ20,IF(AND(U14=\"A\",U16=\"A\"),0,IF(OR(AR20>0,N13=\"A\"),IF(U14=\"A\",-U16,IF(U16=\"A\",U14,U14-U16)),0)),0)","v":0},{"$f":"IF(Y15=AQ20,IF(AND(AA9=\"A\",AA15=\"A\"),0,IF(OR(AS20>0,U16=\"A\"),IF(AA15=\"A\",-AA9,IF(AA9=\"A\",AA15,AA15-AA9)),0)),0)","v":0},{"$f":"IF(AE12=AQ20,IF(AND(AG12=\"A\",AG24=\"A\"),0,IF(OR(AT20>0,AA9=\"A\"),IF(AG12=\"A\",-AG24,IF(AG24=\"A\",AG12,AG12-AG24)),0)),0)","v":0},0,null,{"$f":"#REF!","v":{"$error":"#REF!"}},{"$f":"#REF!","v":{"$error":"#REF!"}},null,{"$f":"IF(#REF!=0,\"\",#REF!)","v":{"$error":"#REF!"}},{"$error":"#REF!"},{"$error":"#REF!"},{"$error":"#REF!"}]
[null,null,null,null,null,null,null,null,null,null,null,null,null,null,null,null,null,null,"Billard N°",null,null,null,null,null,{"$f":"IF(AND(U20=\"A\",U22=\"A\"),S20,IF(U20=\"A\",S22,IF(U22=\"A\",S20,IF(U20=U22,\"\",(IF(U20>U22,S20,S22))))))","v":""},{"$f":"IF(OR(AND(U20=\"F\",U22=\"F\"),AND(U20=\"A\",U22=\"A\")),T22,IF(OR(U20=\"F\",U20=\"A\"),T22,IF(OR(U22=\"F\",U22=\"A\"),T20,IF(U20=U22,\"\",(IF(U20>U22,U20-U22+T20,U22-U20+T22))))))","v":""},null,null,null,null,null,null,null,null,null,null,null,null,null,null,null,null,{"$f":"L16","v":"ROBEZ FLORENT  "},{"$f":"IF(AND(N16=\"A\",N17=\"A\"),0,IF(N16=\"A\",-N17,IF(N17=\"A\",N16,N16-N17)))","v":0},{"$f":"IF(S16=AQ21,IF(AND(U14=\"A\",U16=\"A\"),0,IF(OR(AR21>0,N17=\"A\"),IF(U16=\"A\",-U14,IF(U14=\"A\",U16,U16-U14)),0)),0)","v":0},{"$f":"IF(Y15=AQ21,IF(AND(AA9=\"A\",AA15=\"A\"),0,IF(OR(AS21>0,U14=\"A\"),IF(AA15=\"A\",-AA9,IF(AA9=\"A\",AA15,AA15-AA9)),0)),0)","v":0},{"$f":"IF(AE12=AQ21,IF(AND(AG12=\"A\",AG24=\"A\"),0,IF(OR(AT21>0,AA9=\"A\"),IF(AG12=\"A\",-AG24,IF(AG24=\"A\",AG12,AG12-AG24)),0)),0)","v":0},0,null,{"$f":"#REF!","v":{"$error":"#REF!"}},{"$f":"#REF!","v":{"$error":"#REF!"}},null,{"$f":"IF(#REF!=0,\"\",#REF!)","v":{"$error":"#REF!"}},{"$error":"#REF!"},{"$error":"#REF!"},{"$error":"#REF!"}]
[null,null,"TSB (11)",{"$f":"TSB_3","v":"NGUYEN MICHEL  "},null,null,null,null,null,null,"TSA (6)",{"$f":"TSA_6","v":"URAY JIMMY  "},null,null," ",null,null,null,{"$f":"IF(OR(AND(N22=\"F\",N23=\"F\"),AND(N22=\"A\",N23=\"A\")),L22,IF(OR(N22=\"F\",N22=\"A\"),L23,IF(OR(N23=\"F\",N23=\"A\"),L22,IF(N22=N23,\"\",(IF(N22>N23,L22,L23))))))","v":""},{"$f":"IF(OR(AND(N22=\"F\",N23=\"F\"),AND(N22=\"A\",N23=\"A\")),M22,IF(OR(N22=\"A\",N22=\"F\"),M23,IF(OR(N23=\"F\",N23=\"A\"),M22,IF(N22=N23,\"\",(IF(N22>N23,N22-N23,N23-N22+M23))))))","v":""},null,null,null,null,null,null,null,null,null,null,null,null,null,null,null,null,null,null,null,null,null,null,{"$f":"L17","v":""},{"$f":"IF(AND(N16=\"A\",N17=\"A\"),0,IF(N17=\"A\",-N16,IF(N16=\"A\",N17,N17-N16)))","v":0},{"$f":"IF(S16=AQ22,IF(AND(U14=\"A\",U16=\"A\"),0,IF(OR(AR22>0,N16=\"A\"),IF(U16=\"A\",-U14,IF(U14=\"A\",U16,U16-U14)),0)),0)","v":0},{"$f":"IF(Y15=AQ22,IF(AND(AA9=\"A\",AA15=\"A\"),0,IF(OR(AS22>0,U14=\"A\"),IF(AA15=\"A\",-AA9,IF(AA9=\"A\",AA15,AA15-AA9)),0)),0)","v":0},{"$f":"IF(AE12=AQ22,IF(AND(AG12=\"A\",AG24=\"A\"),0,IF(OR(AT22>0,AA9=\"A\"),IF(AG12=\"A\",-AG24,IF(AG24=\"A\",AG12,AG12-AG24)),0)),0)","v":0},0,null,{"$f":"#REF!","v":{"$error":"#REF!"}},{"$f":"#REF!","v":{"$error":"#REF!"}},null,{"$f":"IF(#REF!=0,\"\",#REF!)","v":{"$error":"#REF!"}},{"$error":"#REF!"},{"$error":"#REF!"},{"$error":"#REF!"}]
[null,null,"E",{"$f":"P1_2","v":""},{"$f":"P1_2G","v":""},null,null,null,null,null,null,{"$f":"IF(OR(AND(F22=\"F\",F23=\"F\"),AND(F22=\"A\",F23=\"A\")),D22,IF(OR(F22=\"F\",F22=\"A\"),D23,IF(OR(F23=\"F\",F23=\"A\"),D22,IF(F22=F23,\"\",(IF(F22>F23,D22,D23))))))","v":""},{"$f":"IF(OR(AND(F22=\"F\",F23=\"F\"),AND(F22=\"A\",F23=\"A\")),E22,IF(OR(F22=\"F\",F22=\"A\"),E23,IF(OR(F23=\"F\",F23=\"A\"),E22,IF(F22=F23,\"\",(IF(F22>F23,F22-F23,F23-F22+E23))))))","v":""},null,null,null,null,null,null,null,null,null,null,null,null,"N°",null,null,null,null,null,null,null,null,null,null,null,null,null,null,null,null,{"$f":"L19","v":"LACROIX DYLAN  "},{"$f":"IF(AND(N19=\"A\",N20=\"A\"),0,IF(N19=\"A\",-N20,IF(N20=\"A\",N19,N19-N20)))","v":0},{"$f":"IF(S20=AQ23,IF(AND(U20=\"A\",U22=\"A\"),0,IF(OR(AR23>0,N20=\"A\"),IF(U20=\"A\",-U22,IF(U22=\"A\",U20,U20-U22)),0)),0)","v":0},{"$f":"IF(Y21=AQ23,IF(AND(AA21=\"A\",AA27=\"A\"),0,IF(OR(AS23>0,U22=\"A\"),IF(AA21=\"A\",-AA27,IF(AA27=\"A\",AA21,AA21-AA27)),0)),0)","v":0},{"$f":"IF(AE24=AQ23,IF(AND(AG12=\"A\",AG24=\"A\"),0,IF(OR(AT23>0,AA27=\"A\"),IF(AG24=\"A\",-AG12,IF(AG12=\"A\",AG24,AG24-AG12)),0)),0)","v":0},0,null,{"$f":"#REF!","v":{"$error":"#REF!"}},{"$f":"#REF!","v":{"$error":"#REF!"}},null,{"$f":"IF(#REF!=0,\"\",#REF!)","v":{"$error":"#REF!"}},{"$error":"#REF!"},{"$error":"#REF!"},{"$error":"#REF!"}]
[null,null,null,null,null,null,null,null,null,null,null,null,null,null,null,null,null,null,null,null,null,null,null,null,"Billard N°",null,null,null,null,null,{"$f":"IF(AND(AA21=\"A\",AA27=\"A\"),Y21,IF(AA21=\"A\",Y27,IF(AA27=\"A\",Y21,IF(AA21=AA27,\"\",(IF(AA21>AA27,Y21,Y27))))))","v":""},{"$f":"IF(OR(AND(AA21=\"F\",AA27=\"F\"),AND(AA21=\"A\",AA27=\"A\")),Z27,IF(OR(AA21=\"F\",AA21=\"A\"),Z27,IF(OR(AA27=\"F\",AA27=\"A\"),Z21,IF(AA21=AA27,\"\",(IF(AA21>AA27,AA21-AA27+Z21,AA27-AA21+Z27))))))","v":""},null,null,null,null,null,null,null,null,null,null,{"$f":"L20","v":""},{"$f":"IF(AND(N19=\"A\",N20=\"A\"),0,IF(N20=\"A\",-N19,IF(N19=\"A\",N20,N20-N19)))","v":0},{"$f":"IF(S20=AQ24,IF(AND(U20=\"A\",U22=\"A\"),0,IF(OR(AR24>0,N19=\"A\"),IF(U20=\"A\",-U22,IF(U22=\"A\",U20,U20-U22)),0)),0)","v":0},{"$f":"IF(Y21=AQ24,IF(AND(AA21=\"A\",AA27=\"A\"),0,IF(OR(AS24>0,U22=\"A\"),IF(AA21=\"A\",-AA27,IF(AA27=\"A\",AA21,AA21-AA27)),0)),0)","v":0},{"$f":"IF(AE24=AQ24,IF(AND(AG12=\"A\",AG24=\"A\"),0,IF(OR(AT24>0,AA27=\"A\"),IF(AG24=\"A\",-AG12,IF(AG12=\"A\",AG24,AG24-AG12)),0)),0)","v":0},0,null,{"$f":"#REF!","v":{"$error":"#REF!"}},{"$f":"#REF!","v":{"$error":"#REF!"}},null,{"$f":"IF(#REF!=0,\"\",#REF!)","v":{"$error":"#REF!"}},{"$error":"#REF!"},{"$error":"#REF!"},{"$error":"#REF!"}]
[null,null,"TSB (10)",{"$f":"TSB_2","v":"KLEIN STEPHANE  "},null,null,null,null,null,null,"TSA (7)",{"$f":"TSA_7","v":"POTIQUET SEBASTIEN  "},null,null,null,null,null,null,null,null,"GA","CF","RF",null,null,null,null,null,null,null,null,null,null,null,null,null,null,null,null,null,null,null,{"$f":"L22","v":"URAY JIMMY  "},{"$f":"IF(AND(N22=\"A\",N23=\"A\"),0,IF(N22=\"A\",-N23,IF(N23=\"A\",N22,N22-N23)))","v":0},{"$f":"IF(S22=AQ25,IF(AND(U20=\"A\",U22=\"A\"),0,IF(OR(AR25>0,N23=\"A\"),IF(U22=\"A\",-U20,IF(U20=\"A\",U22,U22-U20)),0)),0)","v":0},{"$f":"IF(Y21=AQ25,IF(AND(AA21=\"A\",AA27=\"A\"),0,IF(OR(AS25>0,U20=\"A\"),IF(AA21=\"A\",-AA27,IF(AA27=\"A\",AA21,AA21-AA27)),0)),0)","v":0},{"$f":"IF(AE24=AQ25,IF(AND(AG12=\"A\",AG24=\"A\"),0,IF(OR(AT25>0,AA27=\"A\"),IF(AG24=\"A\",-AG12,IF(AG12=\"A\",AG24,AG24-AG12)),0)),0)","v":0},0,null,{"$f":"#REF!","v":{"$error":"#REF!"}},{"$f":"#REF!","v":{"$error":"#REF!"}},null,{"$f":"IF(#REF!=0,\"\",#REF!)","v":{"$error":"#REF!"}},{"$error":"#REF!"},{"$error":"#REF!"},{"$error":"#REF!"}]
[null,null,"G",{"$f":"P3_2","v":0},{"$f":"P3_2G","v":0},null,null,null,null,null,null,{"$f":"IF(OR(AND(F25=\"F\",F26=\"F\"),AND(F25=\"A\",F26=\"A\")),D25,IF(OR(F25=\"F\",F25=\"A\"),D26,IF(OR(F26=\"F\",F26=\"A\"),D25,IF(F25=F26,\"\",(IF(F25>F26,D25,D26))))))","v":""},{"$f":"IF(OR(AND(F25=\"F\",F26=\"F\"),AND(F25=\"A\",F26=\"A\")),E25,IF(OR(F25=\"F\",F25=\"A\"),E26,IF(OR(F26=\"F\",F26=\"A\"),E25,IF(F25=F26,\"\",(IF(F25>F26,F25-F26,F26-F25+E26))))))","v":""},null,null,null,null,null,{"$f":"IF(AND(N25=\"A\",N26=\"A\"),L25,IF(N25=\"A\",L26,IF(N26=\"A\",L25,IF(N25=N26,\"\",(IF(N25>N26,L25,L26))))))","v":""},{"$f":"IF(OR(AND(N25=\"F\",N26=\"F\"),AND(N25=\"A\",N26=\"A\")),M26,IF(OR(N25=\"F\",N25=\"A\"),M26,IF(OR(N26=\"F\",N26=\"A\"),M25,IF(N25=N26,\"\",(IF(N25>N26,N25-N26+M25,N26-N25+M26))))))","v":""},null,null,null,null,null,null,null,null,null,null,null,null,null,null,null,null,null,null,null,null,null,null,{"$f":"L23","v":""},{"$f":"IF(AND(N22=\"A\",N23=\"A\"),0,IF(N23=\"A\",-N22,IF(N22=\"A\",N23,N23-N22)))","v":0},{"$f":"IF(S22=AQ26,IF(AND(U20=\"A\",U22=\"A\"),0,IF(OR(AR26>0,N22=\"A\"),IF(U22=\"A\",-U20,IF(U20=\"A\",U22,U22-U20)),0)),0)","v":0},{"$f":"IF(Y21=AQ26,IF(AND(AA21=\"A\",AA27=\"A\"),0,IF(OR(AS26>0,U20=\"A\"),IF(AA21=\"A\",-AA27,IF(AA27=\"A\",AA21,AA21-AA27)),0)),0)","v":0},{"$f":"IF(AE24=AQ26,IF(AND(AG12=\"A\",AG24=\"A\"),0,IF(OR(AT26>0,AA27=\"A\"),IF(AG24=\"A\",-AG12,IF(AG12=\"A\",AG24,AG24-AG12)),0)),0)","v":0},0,null,{"$f":"#REF!","v":{"$error":"#REF!"}},{"$f":"#REF!","v":{"$error":"#REF!"}},null,{"$f":"IF(#REF!=0,\"\",#REF!)","v":{"$error":"#REF!"}},{"$error":"#REF!"},{"$error":"#REF!"},{"$error":"#REF!"}]
[null,null,null,null,null,null,null,null,null,null,null,null,null,null,null,null,null,null,"Billard N°",null,null,null,null,null,{"$f":"IF(AND(U26=\"A\",U28=\"A\"),S26,IF(U26=\"A\",S28,IF(U28=\"A\",S26,IF(U26=U28,\"\",(IF(U26>U28,S26,S28))))))","v":""},{"$f":"IF(OR(AND(U26=\"F\",U28=\"F\"),AND(U26=\"A\",U28=\"A\")),T28,IF(OR(U26=\"F\",U26=\"A\"),T28,IF(OR(U28=\"F\",U28=\"A\"),T26,IF(U26=U28,\"\",(IF(U26>U28,U26-U28+T26,U28-U26+T28))))))","v":""},null,null,null,null,null,null,null,null,null,null,null,null,null,null,null,null,{"$f":"L25","v":"POTIQUET SEBASTIEN  "},{"$f":"IF(AND(N25=\"A\",N26=\"A\"),0,IF(N25=\"A\",-N26,IF(N26=\"A\",N25,N25-N26)))","v":0},{"$f":"IF(S26=AQ27,IF(AND(U26=\"A\",U28=\"A\"),0,IF(OR(AR27>0,N26=\"A\"),IF(U26=\"A\",-U28,IF(U28=\"A\",U26,U26-U28)),0)),0)","v":0},{"$f":"IF(Y27=AQ27,IF(AND(AA21=\"A\",AA27=\"A\"),0,IF(OR(AS27>0,U28=\"A\"),IF(AA27=\"A\",-AA21,IF(AA21=\"A\",AA27,AA27-AA21)),0)),0)","v":0},{"$f":"IF(AE24=AQ27,IF(AND(AG12=\"A\",AG24=\"A\"),0,IF(OR(AT27>0,AA21=\"A\"),IF(AG24=\"A\",-AG12,IF(AG12=\"A\",AG24,AG24-AG12)),0)),0)","v":0},0,null,{"$f":"#REF!","v":{"$error":"#REF!"}},{"$f":"#REF!","v":{"$error":"#REF!"}},null,{"$f":"IF(#REF!=0,\"\",#REF!)","v":{"$error":"#REF!"}},{"$error":"#REF!"},{"$error":"#REF!"},{"$error":"#REF!"}]
[null,null,"TSB (15)",{"$f":"TSB_7","v":"VAPILLON DANIEL  "},null,null,null,null,null,null,"TSA (2)",{"$f":"TSA_2","v":"GARNIER NICOLAS  "},null,null,null,null,null,null,{"$f":"IF(OR(AND(N28=\"F\",N29=\"F\"),AND(N28=\"A\",N29=\"A\")),L28,IF(OR(N28=\"F\",N28=\"A\"),L29,IF(OR(N29=\"F\",N29=\"A\"),L28,IF(N28=N29,\"\",(IF(N28>N29,L28,L29))))))","v":""},{"$f":"IF(OR(AND(N28=\"F\",N29=\"F\"),AND(N28=\"A\",N29=\"A\")),M28,IF(OR(N28=\"A\",N28=\"F\"),M29,IF(OR(N29=\"F\",N29=\"A\"),M28,IF(N28=N29,\"\",(IF(N28>N29,N28-N29,N29-N28+M29))))))","v":""},null,null,null,null,null,null,null,null,null,null,null,null,null,null,null,null,null,null,null,null,null,null,{"$f":"L26","v":""},{"$f":"IF(AND(N25=\"A\",N26=\"A\"),0,IF(N26=\"A\",-N25,IF(N25=\"A\",N26,N26-N25)))","v":0},{"$f":"IF(S26=AQ28,IF(AND(U26=\"A\",U28=\"A\"),0,IF(OR(AR28>0,N25=\"A\"),IF(U26=\"A\",-U28,IF(U28=\"A\",U26,U26-U28)),0)),0)","v":0},{"$f":"IF(Y27=AQ28,IF(AND(AA21=\"A\",AA27=\"A\"),0,IF(OR(AS28>0,U28=\"A\"),IF(AA27=\"A\",-AA21,IF(AA21=\"A\",AA27,AA27-AA21)),0)),0)","v":0},{"$f":"IF(AE24=AQ28,IF(AND(AG12=\"A\",AG24=\"A\"),0,IF(OR(AT28>0,AA21=\"A\"),IF(AG24=\"A\",-AG12,IF(AG12=\"A\",AG24,AG24-AG12)),0)),0)","v":0},0,null,{"$f":"#REF!","v":{"$error":"#REF!"}},{"$f":"#REF!","v":{"$error":"#REF!"}},null,{"$f":"IF(#REF!=0,\"\",#REF!)","v":{"$error":"#REF!"}},{"$error":"#REF!"},{"$error":"#REF!"},{"$error":"#REF!"}]
[null,null,"B",{"$f":"P2_1","v":0},{"$f":"P2_1G","v":0},null,null,null,null,null,null,{"$f":"IF(OR(AND(F28=\"F\",F29=\"F\"),AND(F28=\"A\",F29=\"A\")),D28,IF(OR(F28=\"F\",F28=\"A\"),D29,IF(OR(F29=\"F\",F29=\"A\"),D28,IF(F28=F29,\"\",(IF(F28>F29,D28,D29))))))","v":""},{"$f":"IF(OR(AND(F28=\"F\",F29=\"F\"),AND(F28=\"A\",F29=\"A\")),E28,IF(OR(F28=\"F\",F28=\"A\"),E29,IF(OR(F29=\"F\",F29=\"A\"),E28,IF(F28=F29,\"\",(IF(F28>F29,F28-F29,F29-F28+E29))))))","v":""},null,null,null,null,null,null,null,null,null,null,null,null,null,null,null,null,null,null,null,null,null,null,null,null,null,null,null,null,null,{"$f":"L28","v":"GARNIER NICOLAS  "},{"$f":"IF(AND(N28=\"A\",N29=\"A\"),0,IF(N28=\"A\",-N29,IF(N29=\"A\",N28,N28-N29)))","v":0},{"$f":"IF(S28=AQ29,IF(AND(U26=\"A\",U28=\"A\"),0,IF(OR(AR29>0,N29=\"A\"),IF(U28=\"A\",-U26,IF(U26=\"A\",U28,U28-U26)),0)),0)","v":0},{"$f":"IF(Y27=AQ29,IF(AND(AA21=\"A\",AA27=\"A\"),0,IF(OR(AS29>0,U26=\"A\"),IF(AA27=\"A\",-AA21,IF(AA21=\"A\",AA27,AA27-AA21)),0)),0)","v":0},{"$f":"IF(AE24=AQ29,IF(AND(AG12=\"A\",AG24=\"A\"),0,IF(OR(AT29>0,AA21=\"A\"),IF(AG24=\"A\",-AG12,IF(AG12=\"A\",AG24,AG24-AG12)),0)),0)","v":0},0,null,{"$f":"#REF!","v":{"$error":"#REF!"}},{"$f":"#REF!","v":{"$error":"#REF!"}},null,{"$f":"IF(#REF!=0,\"\",#REF!)","v":{"$error":"#REF!"}},{"$error":"#REF!"},{"$error":"#REF!"},{"$error":"#REF!"}]
[null,null,null,null,null,null,null,null,null,null,null,null,null,null,null,null,null,null,null,null,null,null,null,null,null,null,null,null,null,181,null,null,null,null,null,null,null,null,null,null,null,null,{"$f":"L29","v":""},{"$f":"IF(AND(N28=\"A\",N29=\"A\"),0,IF(N29=\"A\",-N28,IF(N28=\"A\",N29,N29-N28)))","v":0},{"$f":"IF(S28=AQ30,IF(AND(U26=\"A\",U28=\"A\"),0,IF(OR(AR30>0,N28=\"A\"),IF(U28=\"A\",-U26,IF(U26=\"A\",U28,U28-U26)),0)),0)","v":0},{"$f":"IF(Y27=AQ30,IF(AND(AA21=\"A\",AA27=\"A\"),0,IF(OR(AS30>0,U26=\"A\"),IF(AA27=\"A\",-AA21,IF(AA21=\"A\",AA27,AA27-AA21)),0)),0)","v":0},{"$f":"IF(AE24=AQ30,IF(AND(AG12=\"A\",AG24=\"A\"),0,IF(OR(AT30>0,AA21=\"A\"),IF(AG24=\"A\",-AG12,IF(AG12=\"A\",AG24,AG24-AG12)),0)),0)","v":0},0,null,{"$f":"#REF!","v":{"$error":"#REF!"}},{"$f":"#REF!","v":{"$error":"#REF!"}},null,{"$f":"IF(#REF!=0,\"\",#REF!)","v":{"$error":"#REF!"}},{"$error":"#REF!"},{"$error":"#REF!"},{"$error":"#REF!"}]
[null,null,118,null,null,null,null,null,null,null,126,null,null,null,null,null,143,null,null,null,null,null,null,161,null,null,null,null,null,180,null,null,null,null,null,200,null,null,null,null,null,null,{"$f":"#REF!","v":{"$error":"#REF!"}},null,null,null,null,0,null,{"$f":"#REF!","v":{"$error":"#REF!"}},{"$f":"#REF!","v":{"$error":"#REF!"}},null,{"$f":"IF(#REF!=0,\"\",#REF!)","v":{"$error":"#REF!"}},{"$error":"#REF!"},{"$error":"#REF!"},{"$error":"#REF!"}]
[null,null,1,{"$f":"IF(OR(AND(F7=\"F\",F8=\"F\"),AND(F7=\"A\",F8=\"A\")),D7,IF(OR(F7=\"F\",F7=\"A\"),D8,IF(OR(F8=\"F\",F8=\"A\"),D7,IF(F7=F8,\"\",(IF(F7<F8,D7,D8))))))","v":""},{"$f":"IF(OR(AND(F7=\"F\",F8=\"F\"),AND(F7=\"A\",F8=\"A\")),E7,IF(OR(F7=\"F\",F7=\"A\"),E8,IF(OR(F8=\"F\",F8=\"A\"),E7,IF(F7=F8,\"\",(IF(F7<F8,F7-F8,F8-F7+E8))))))","v":""},{"$f":"VLOOKUP(D32,D2:H24,4,FALSE)","v":0},{"$f":"VLOOKUP(D32,D2:H24,5,FALSE)","v":0},null,null,null,1,{"$f":"IF(AND(N7=\"A\",N8=\"A\"),L7,IF(N7=\"A\",L8,IF(N8=\"A\",L7,IF(N7=N8,\"\",(IF(N7<N8,L7,L8))))))","v":""},{"$f":"IF(OR(AND(N7=\"F\",N8=\"F\"),AND(N7=\"A\",N8=\"A\")),M8,IF(OR(N7=\"F\",N7=\"A\"),M8,IF(OR(N8=\"F\",N8=\"A\"),M7,IF(N7=N8,\"\",(IF(N7<N8,N7-N8+M7,N8-N7+M8))))))","v":""},{"$f":"VLOOKUP(L32,L2:P24,4,FALSE)","v":0},{"$f":"VLOOKUP(L32,L2:P24,5,FALSE)","v":0},null,null,1,{"$f":"IF(AND(U8=\"A\",U10=\"A\"),S8,IF(U8=\"A\",S10,IF(U10=\"A\",S8,IF(U8=U10,\"\",(IF(U8<U10,S8,S10))))))","v":""},{"$f":"IF(OR(AND(U8=\"F\",U10=\"F\"),AND(U8=\"A\",U10=\"A\")),T10,IF(OR(U8=\"F\",U8=\"A\"),T10,IF(OR(U10=\"F\",U10=\"A\"),T8,IF(U8=U10,\"\",(IF(U8<U10,U8-U10+T8,U10-U8+T10))))))","v":""},{"$f":"VLOOKUP(S32,S2:W24,4,FALSE)","v":0},{"$f":"VLOOKUP(S32,S2:W24,5,FALSE)","v":0},null,1,{"$f":"IF(AND(AA9=\"A\",AA15=\"A\"),Y9,IF(AA9=\"A\",Y15,IF(AA15=\"A\",Y9,IF(AA9=AA15,\"\",(IF(AA9<AA15,Y9,Y15))))))","v":""},{"$f":"IF(OR(AND(AA9=\"F\",AA15=\"F\"),AND(AA9=\"A\",AA15=\"A\")),Z15,IF(OR(AA9=\"F\",AA9=\"A\"),Z15,IF(OR(AA15=\"F\",AA15=\"A\"),Z9,IF(AA9=AA15,\"\",(IF(AA9<AA15,AA9-AA15+Z9,AA15-AA9+Z15))))))","v":""},{"$f":"VLOOKUP(Y32,Y2:AC24,4,FALSE)","v":0},{"$f":"VLOOKUP(Y32,Y2:AC24,5,FALSE)","v":0},null,null,null,null,null,null,null,null,null,null,null,null,null,null,{"$f":"#REF!","v":{"$error":"#REF!"}},null,null,null,null,0,null,{"$f":"#REF!","v":{"$error":"#REF!"}},{"$f":"#REF!","v":{"$error":"#REF!"}},null,{"$f":"IF(#REF!=0,\"\",#REF!)","v":{"$error":"#REF!"}},{"$error":"#REF!"},{"$error":"#REF!"},{"$error":"#REF!"}]
[null,null,2,{"$f":"IF(OR(AND(F10=\"F\",F11=\"F\"),AND(F10=\"A\",F11=\"A\")),D10,IF(OR(F10=\"F\",F10=\"A\"),D11,IF(OR(F11=\"F\",F11=\"A\"),D10,IF(F10=F11,\"\",(IF(F10<F11,D10,D11))))))","v":""},{"$f":"IF(OR(AND(F10=\"F\",F11=\"F\"),AND(F10=\"A\",F11=\"A\")),E10,IF(OR(F10=\"F\",F10=\"A\"),E11,IF(OR(F11=\"F\",F11=\"A\"),E10,IF(F10=F11,\"\",(IF(F10<F11,F10-F11,F11-F10+E11))))))","v":""},0,0,null,null,null,2,{"$f":"IF(AND(N10=\"A\",N11=\"A\"),L10,IF(N10=\"A\",L11,IF(N11=\"A\",L10,IF(N10=N11,\"\",(IF(N10<N11,L10,L11))))))","v":""},{"$f":"IF(OR(AND(N10=\"F\",N11=\"F\"),AND(N10=\"A\",N11=\"A\")),M11,IF(OR(N10=\"F\",N10=\"A\"),M11,IF(OR(N11=\"F\",N11=\"A\"),M10,IF(N10=N11,\"\",(IF(N10<N11,N10-N11,N11-N10+M11))))))","v":""},0,0,null,null,2,{"$f":"IF(AND(U14=\"A\",U16=\"A\"),S14,IF(U14=\"A\",S16,IF(U16=\"A\",S14,IF(U14=U16,\"\",(IF(U14<U16,S14,S16))))))","v":""},{"$f":"IF(OR(AND(U14=\"F\",U16=\"F\"),AND(U14=\"A\",U16=\"A\")),T16,IF(OR(U14=\"F\",U14=\"A\"),T16,IF(OR(U16=\"F\",U16=\"A\"),T14,IF(U14=U16,\"\",(IF(U14<U16,U14-U16+T14,U16-U14+T16))))))","v":""},{"$f":"VLOOKUP(S33,S3:W25,4,FALSE)","v":0},{"$f":"VLOOKUP(S33,S3:W25,5,FALSE)","v":0},null,2,{"$f":"IF(AND(AA21=\"A\",AA27=\"A\"),Y21,IF(AA21=\"A\",Y27,IF(AA27=\"A\",Y21,IF(AA21=AA27,\"\",(IF(AA21<AA27,Y21,Y27))))))","v":""},{"$f":"IF(OR(AND(AA21=\"F\",AA27=\"F\"),AND(AA21=\"A\",AA27=\"A\")),Z27,IF(OR(AA21=\"F\",AA21=\"A\"),Z27,IF(OR(AA27=\"F\",AA27=\"A\"),Z21,IF(AA21=AA27,\"\",(IF(AA21<AA27,AA21-AA27+Z21,AA27-AA21+Z27))))))","v":""},{"$f":"VLOOKUP(Y33,Y3:AC25,4,FALSE)","v":0},{"$f":"VLOOKUP(Y33,Y3:AC25,5,FALSE)","v":0},null,null,null,null,null,null,null,null,null,null,null,null,null,null,{"$f":"#REF!","v":{"$error":"#REF!"}},null,null,null,null,0,null,{"$f":"#REF!","v":{"$error":"#REF!"}},{"$f":"#REF!","v":{"$error":"#REF!"}},null,{"$f":"IF(#REF!=0,\"\",#REF!)","v":{"$error":"#REF!"}},{"$error":"#REF!"},{"$error":"#REF!"},{"$error":"#REF!"}]
[null,null,3,{"$f":"IF(OR(AND(F13=\"F\",F14=\"F\"),AND(F13=\"A\",F14=\"A\")),D13,IF(OR(F13=\"F\",F13=\"A\"),D14,IF(OR(F14=\"F\",F14=\"A\"),D13,IF(F13=F14,\"\",(IF(F13<F14,D13,D14))))))","v":""},{"$f":"IF(OR(AND(F13=\"F\",F14=\"F\"),AND(F13=\"A\",F14=\"A\")),E13,IF(OR(F13=\"F\",F13=\"A\"),E14,IF(OR(F14=\"F\",F14=\"A\"),E13,IF(F13=F14,\"\",(IF(F13<F14,F13-F14,F14-F13+E14))))))","v":""},0,0,null,null,null,3,{"$f":"IF(AND(N13=\"A\",N14=\"A\"),L13,IF(N13=\"A\",L14,IF(N14=\"A\",L13,IF(N13=N14,\"\",(IF(N13<N14,L13,L14))))))","v":""},{"$f":"IF(OR(AND(N13=\"F\",N14=\"F\"),AND(N13=\"A\",N14=\"A\")),M14,IF(OR(N13=\"F\",N13=\"A\"),M14,IF(OR(N14=\"F\",N14=\"A\"),M13,IF(N13=N14,\"\",(IF(N13<N14,N13-N14+M13,N14-N13+M14))))))","v":""},0,0,null,null,3,{"$f":"IF(AND(U20=\"A\",U22=\"A\"),S20,IF(U20=\"A\",S22,IF(U22=\"A\",S20,IF(U20=U22,\"\",(IF(U20<U22,S20,S22))))))","v":""},{"$f":"IF(OR(AND(U20=\"F\",U22=\"F\"),AND(U20=\"A\",U22=\"A\")),T22,IF(OR(U20=\"F\",U20=\"A\"),T22,IF(OR(U22=\"F\",U22=\"A\"),T20,IF(U20=U22,\"\",(IF(U20<U22,U20-U22+T20,U22-U20+T22))))))","v":""},{"$f":"VLOOKUP(S34,S4:W26,4,FALSE)","v":0},{"$f":"VLOOKUP(S34,S4:W26,5,FALSE)","v":0},null,null,null,null,null,null,null,null,null,null,null,null,null,null,null,null,null,null,null,null,{"$f":"#REF!","v":{"$error":"#REF!"}},null,null,null,null,0,null,{"$f":"#REF!","v":{"$error":"#REF!"}},{"$f":"#REF!","v":{"$error":"#REF!"}},null,{"$f":"IF(#REF!=0,\"\",#REF!)","v":{"$error":"#REF!"}},{"$error":"#REF!"},{"$error":"#REF!"},{"$error":"#REF!"}]
[null,null,4,{"$f":"IF(OR(AND(F16=\"F\",F17=\"F\"),AND(F16=\"A\",F17=\"A\")),D16,IF(OR(F16=\"F\",F16=\"A\"),D17,IF(OR(F17=\"F\",F17=\"A\"),D16,IF(F16=F17,\"\",(IF(F16<F17,D16,D17))))))","v":""},{"$f":"IF(OR(AND(F16=\"F\",F17=\"F\"),AND(F16=\"A\",F17=\"A\")),E16,IF(OR(F16=\"F\",F16=\"A\"),E17,IF(OR(F17=\"F\",F17=\"A\"),E16,IF(F16=F17,\"\",(IF(F16<F17,F16-F17,F17-F16+E17))))))","v":""},0,0,null,null,null,4,{"$f":"IF(AND(N16=\"A\",N17=\"A\"),L16,IF(N16=\"A\",L17,IF(N17=\"A\",L16,IF(N16=N17,\"\",(IF(N16<N17,L16,L17))))))","v":""},{"$f":"IF(OR(AND(N16=\"F\",N17=\"F\"),AND(N16=\"A\",N17=\"A\")),M17,IF(OR(N16=\"F\",N16=\"A\"),M17,IF(OR(N17=\"F\",N17=\"A\"),M16,IF(N16=N17,\"\",(IF(N16<N17,N16-N17,N17-N16+M17))))))","v":""},0,0,null,null,4,{"$f":"IF(AND(U26=\"A\",U28=\"A\"),S26,IF(U26=\"A\",S28,IF(U28=\"A\",S26,IF(U26=U28,\"\",(IF(U26<U28,S26,S28))))))","v":""},{"$f":"IF(OR(AND(U26=\"F\",U28=\"F\"),AND(U26=\"A\",U28=\"A\")),T28,IF(OR(U26=\"F\",U26=\"A\"),T28,IF(OR(U28=\"F\",U28=\"A\"),T26,IF(U26=U28,\"\",(IF(U26<U28,U26-U28+T26,U28-U26+T28))))))","v":""},{"$f":"VLOOKUP(S35,S5:W27,4,FALSE)","v":0},{"$f":"VLOOKUP(S35,S5:W27,5,FALSE)","v":0},null,null,null,null,null,null,null,null,null,null,null,null,null,null,null,null,null,null,null,null,{"$f":"#REF!","v":{"$error":"#REF!"}},null,null,null,null,0,null,{"$f":"#REF!","v":{"$error":"#REF!"}},{"$f":"#REF!","v":{"$error":"#REF!"}},null,{"$f":"IF(#REF!=0,\"\",#REF!)","v":{"$error":"#REF!"}},{"$error":"#REF!"},{"$error":"#REF!"},{"$error":"#REF!"}]
[null,null,5,{"$f":"IF(OR(AND(F19=\"F\",F20=\"F\"),AND(F19=\"A\",F20=\"A\")),D20,IF(OR(F19=\"F\",F19=\"A\"),D19,IF(OR(F20=\"F\",F20=\"A\"),D20,IF(F19=F20,\"\",(IF(F19<F20,D19,D20))))))","v":""},{"$f":"IF(OR(AND(F19=\"F\",F20=\"F\"),AND(F19=\"A\",F20=\"A\")),E20,IF(OR(F19=\"F\",F19=\"A\"),E19,IF(OR(F20=\"F\",F20=\"A\"),E20,IF(F19=F20,\"\",(IF(F19>KF20,F19-F20,F20-F19+E20))))))","v":""},0,0,null,null,null,5,{"$f":"IF(AND(N19=\"A\",N20=\"A\"),L19,IF(N19=\"A\",L20,IF(N20=\"A\",L19,IF(N19=N20,\"\",(IF(N19<N20,L19,L20))))))","v":""},{"$f":"IF(OR(AND(N19=\"F\",N20=\"F\"),AND(N19=\"A\",N20=\"A\")),M20,IF(OR(N19=\"F\",N19=\"A\"),M20,IF(OR(N20=\"F\",N20=\"A\"),M19,IF(N19=N20,\"\",(IF(N19<N20,N19-N20+M19,N20-N19+M20))))))","v":""},0,0,null,null,null,null,null,null,null,null,null,null,null,null,null,null,null,null,null,null,null,null,null,null,null,null,null,null,null,{"$f":"#REF!","v":{"$error":"#REF!"}},null,null,null,null,0,null,{"$f":"#REF!","v":{"$error":"#REF!"}},{"$f":"#REF!","v":{"$error":"#REF!"}},null,{"$f":"IF(#REF!=0,\"\",#REF!)","v":{"$error":"#REF!"}},{"$error":"#REF!"},{"$error":"#REF!"},{"$error":"#REF!"}]
[null,null,6,{"$f":"IF(OR(AND(F22=\"F\",F23=\"F\"),AND(F22=\"A\",F23=\"A\")),D22,IF(OR(F22=\"F\",F22=\"A\"),D23,IF(OR(F23=\"F\",F23=\"A\"),D22,IF(F22=F23,\"\",(IF(F22<F23,D22,D23))))))","v":""},{"$f":"IF(OR(AND(F22=\"F\",F23=\"F\"),AND(F22=\"A\",F23=\"A\")),E22,IF(OR(F22=\"F\",F22=\"A\"),E23,IF(OR(F23=\"F\",F23=\"A\"),E22,IF(F22=F23,\"\",(IF(F22<F23,F22-F23,F23-F22+E23))))))","v":""},0,0,null,null,null,6,{"$f":"IF(OR(AND(N22=\"F\",N23=\"F\"),AND(N22=\"A\",N23=\"A\")),L23,IF(OR(N22=\"F\",N22=\"A\"),L22,IF(OR(N23=\"F\",N23=\"A\"),L23,IF(N22=N23,\"\",(IF(N22<N23,L22,L23))))))","v":""},{"$f":"IF(OR(AND(N22=\"F\",N23=\"F\"),AND(N22=\"A\",N23=\"A\")),N23,IF(OR(N22=\"A\",N22=\"F\"),N22,IF(OR(N23=\"F\",N23=\"A\"),N23,IF(N22=N23,\"\",(IF(N22<N23,N22-N23,N23-N22+M23))))))","v":""},0,0,null,null,null,null,null,null,null,null,null,null,null,null,null,null,null,null,null,null,null,null,null,null,null,null,null,null,null,{"$f":"#REF!","v":{"$error":"#REF!"}},null,null,null,null,0,null,{"$f":"#REF!","v":{"$error":"#REF!"}},{"$f":"#REF!","v":{"$error":"#REF!"}},null,{"$f":"IF(#REF!=0,\"\",#REF!)","v":{"$error":"#REF!"}},{"$error":"#REF!"},{"$error":"#REF!"},{"$error":"#REF!"}]
[null,null,7,{"$f":"IF(OR(AND(F25=\"F\",F26=\"F\"),AND(F25=\"A\",F26=\"A\")),D25,IF(OR(F25=\"F\",F25=\"A\"),D26,IF(OR(F26=\"F\",F26=\"A\"),D25,IF(F25=F26,\"\",(IF(F25<F26,D25,D26))))))","v":""},{"$f":"IF(OR(AND(F25=\"F\",F26=\"F\"),AND(F25=\"A\",F26=\"A\")),E25,IF(OR(F25=\"F\",F25=\"A\"),E26,IF(OR(F26=\"F\",F26=\"A\"),E25,IF(F25=F26,\"\",(IF(F25<F26,F25-F26,F26-F25+E26))))))","v":""},0,0,null,null,null,7,{"$f":"IF(AND(N25=\"A\",N26=\"A\"),L25,IF(N25=\"A\",L26,IF(N26=\"A\",L25,IF(N25=N26,\"\",(IF(N25<N26,L25,L26))))))","v":""},{"$f":"IF(OR(AND(N25=\"F\",N26=\"F\"),AND(N25=\"A\",N26=\"A\")),M26,IF(OR(N25=\"F\",N25=\"A\"),M26,IF(OR(N26=\"F\",N26=\"A\"),M25,IF(N25=N26,\"\",(IF(N25<N26,N25-N26+M25,N26-N25+M26))))))","v":""},0,0,null,null,null,null,null,null,null,null,null,null,null,null,null,null,null,null,null,null,null,null,null,null,null,null,null,null,null,{"$f":"#REF!","v":{"$error":"#REF!"}},null,null,null,null,0,null,{"$f":"#REF!","v":{"$error":"#REF!"}},{"$f":"#REF!","v":{"$error":"#REF!"}},null,{"$f":"IF(#REF!=0,\"\",#REF!)","v":{"$error":"#REF!"}},{"$error":"#REF!"},{"$error":"#REF!"},{"$error":"#REF!"}]
[null,null,8,{"$f":"IF(OR(AND(F28=\"F\",F29=\"F\"),AND(F28=\"A\",F29=\"A\")),D28,IF(OR(F28=\"F\",F28=\"A\"),D29,IF(OR(F29=\"F\",F29=\"A\"),D28,IF(F28=F29,\"\",(IF(F28<F29,D28,D29))))))","v":""},{"$f":"IF(OR(AND(F28=\"F\",F29=\"F\"),AND(F28=\"A\",F29=\"A\")),E28,IF(OR(F28=\"F\",F28=\"A\"),E29,IF(OR(F29=\"F\",F29=\"A\"),E28,IF(F28=F29,\"\",(IF(F28<F29,F28-F29,F29-F28+E29))))))","v":""},0,0,null,null,null,8,{"$f":"IF(N28=\"A\",L29,IF(N29=\"A\",L28,IF(N28=N29,\"\",(IF(N28<N29,L28,L29)))))","v":""},{"$f":"IF(OR(AND(N28=\"F\",N29=\"F\"),AND(N28=\"A\",N29=\"A\")),M29,IF(OR(N28=\"F\",N28=\"A\"),M29,IF(OR(N29=\"F\",N29=\"A\"),M28,IF(N28=N29,\"\",(IF(N28<N29,N28-N29,N29-N28+M29))))))","v":""},0,0,null,null,null,null,null,null,null,null,null,null,null,null,null,null,null,null,null,null,null,null,null,null,null,null,null,null,null,{"$f":"#REF!","v":{"$error":"#REF!"}},null,null,null,null,0,null,{"$f":"#REF!","v":{"$error":"#REF!"}},{"$f":"#REF!","v":{"$error":"#REF!"}},null,{"$f":"IF(#REF!=0,\"\",#REF!)","v":{"$error":"#REF!"}},{"$error":"#REF!"},{"$error":"#REF!"},{"$error":"#REF!"}]
[null,null,null,null,null,null,null,null,null,null,null,null,null,null,null,null,null,null,null,null,null,null,null,null,null,null,null,null,null,null,null,null,null,null,null,null,null,null,null,null,null,null,{"$f":"#REF!","v":{"$error":"#REF!"}},null,null,null,null,0,null,{"$f":"#REF!","v":{"$error":"#REF!"}},{"$f":"#REF!","v":{"$error":"#REF!"}},null,{"$f":"IF(#REF!=0,\"\",#REF!)","v":{"$error":"#REF!"}},{"$error":"#REF!"},{"$error":"#REF!"},{"$error":"#REF!"}]
[null,null,null,"Nom","GA","CF","RF",null,null,null,null,"Nom","GA","CF","RF",null,null,null,"Nom","GA","CF","RF",null,null,"Nom","GA","CF","RF",null,null,null,null,null,null,null,null,null,null,null,null,null,null,{"$f":"#REF!","v":{"$error":"#REF!"}},null,null,null,null,0,null,{"$f":"#REF!","v":{"$error":"#REF!"}},{"$f":"#REF!","v":{"$error":"#REF!"}},null,{"$f":"IF(#REF!=0,\"\",#REF!)","v":{"$error":"#REF!"}},{"$error":"#REF!"},{"$error":"#REF!"},{"$error":"#REF!"}]
[null,null,17,null,null,null,null,null,null,null,9,null,null,null,null,null,null,5,null,null,null,null,null,3,null,null,null,null,null,null,null,null,null,null,null,null,null,null,null,null,null,null,{"$f":"#REF!","v":{"$error":"#REF!"}},null,null,null,null,0,null,{"$f":"#REF!","v":{"$error":"#REF!"}},{"$f":"#REF!","v":{"$error":"#REF!"}},null,{"$f":"IF(#REF!=0,\"\",#REF!)","v":{"$error":"#REF!"}},{"$error":"#REF!"},{"$error":"#REF!"},{"$error":"#REF!"}]
[null,null,18,null,null,null,null,null,null,null,10,null,null,null,null,null,null,6,null,null,null,null,null,4,null,null,null,null,null,null,null,null,null,null,null,null,null,null,null,null,null,null,{"$f":"#REF!","v":{"$error":"#REF!"}},null,null,null,null,0,null,{"$f":"#REF!","v":{"$error":"#REF!"}},{"$f":"#REF!","v":{"$error":"#REF!"}},null,{"$f":"IF(#REF!=0,\"\",#REF!)","v":{"$error":"#REF!"}},{"$error":"#REF!"},{"$error":"#REF!"},{"$error":"#REF!"}]
[null,null,19,null,null,null,null,null,null,null,11,null,null,null,null,null,null,7]
[null,null,20,null,null,null,null,null,null,null,12,null,null,null,null,null,null,8]
[null,null,21,null,null,null,null,null,null,null,13]
[null,null,22,null,null,null,null,null,null,null,14]
[null,null,23,null,null,null,null,null,null,null,15]
[null,null,24,null,null,null,null,null,null,null,16]
[]
[]
[]
[null,null,null,"Nom","GA","CF","RF",null,null,null,null,"Nom","GA","CF","RF"]
[null,null,25,null,null,null,null,null,null,null,33]
[null,null,26,null,null,null,null,null,null,null,35]
[null,null,27,null,null,null,null,null,null,null,37]
[null,null,28,null,null,null,null,null,null,null,34]
[null,null,29,null,null,null,null,null,null,null,36]
[null,null,30,null,null,null,null,null,null,null,38]
[null,null,31,null,null,null,null,null,null,null,39]
[null,null,32,null,null,null,null,null,null,null,40]
[null,null,null,null,null,null,null,null,null,null,41]
[null,null,null,null,null,null,null,null,null,null,42]
[null,null,null,null,null,null,null,null,null,null,43]
[null,null,null,null,null,null,null,null,null,null,44]
[null,null,null,null,null,null,null,null,null,null,45]
[null,null,null,null,null,null,null,null,null,null,46]
[null,null,null,null,null,null,null,null,null,null,47]
[null,null,null,null,null,null,null,null,null,null,48]

{"sheet":"Billards","index":9,"n_rows":53,"n_cols":21,"rows_kept":53,"cut":false,"hidden":true,"merged":[[0,1,0,3],[0,4,0,6],[0,7,0,9],[0,10,0,12],[0,18,0,20]]}
[null,"Poule1",null,null,"Poule 2",null,null,"Poule3",null,null,"Poule4",null,null,null,null,null,null,null,"Concatenation"]
[null,"Billard","Score A","Score B","Billard","Score A","Score B","Billard","Score A","Score B","Billard","Score A","Score B",null,1,"O4","P3","P5",{"$f":"\"=\"&\"'\"&O2&\"'\"&\"!\"&P2","v":"='1'!O4"},{"$f":"\"=\"&\"'\"&O2&\"'\"&\"!\"&Q2","v":"='1'!P3"},{"$f":"\"=\"&\"'\"&O2&\"'\"&\"!\"&R2","v":"='1'!P5"}]
["Match 1",{"$f":"J23","v":0},{"$f":"'1'!P3","v":0},{"$f":"'1'!P5","v":"F"},{"$f":"'2'!O4","v":0},{"$f":"'2'!P3","v":0},{"$f":"'2'!P5","v":"F"},{"$f":"'3'!O4","v":0},{"$f":"'3'!P3","v":0},{"$f":"'3'!P5","v":"F"},{"$f":"'4'!O4","v":0},{"$f":"'4'!P3","v":0},{"$f":"'4'!P5","v":"F"},null,1,"O8","P7","P9","='1'!O8","='1'!P7","='1'!P9"]
["Match 2",{"$f":"'1'!O8","v":0},{"$f":"'1'!P7","v":0},{"$f":"'1'!P9","v":0},{"$f":"'2'!O8","v":0},{"$f":"'2'!P7","v":0},{"$f":"'2'!P9","v":0},{"$f":"'3'!O8","v":0},{"$f":"'3'!P7","v":"F"},{"$f":"'3'!P9","v":0},{"$f":"'4'!O8","v":0},{"$f":"'4'!P7","v":"F"},{"$f":"'4'!P9","v":0},null,1,"O14","P13","P15","='1'!O14","='1'!P13","='1'!P15"]
["Match 3",{"$f":"'1'!O14","v":0},{"$f":"'1'!P13","v":0},{"$f":"'1'!P15","v":"F"},{"$f":"'2'!O14","v":0},{"$f":"'2'!P13","v":0},{"$f":"'2'!P15","v":"F"},{"$f":"'3'!O14","v":0},{"$f":"'3'!P13","v":0},{"$f":"'3'!P15","v":"F"},{"$f":"'4'!O14","v":0},{"$f":"'4'!P13","v":0},{"$f":"'4'!P15","v":"F"},null,1,"O18","P17","P19","='1'!O18","='1'!P17","='1'!P19"]
["Match 4",{"$f":"'1'!O18","v":0},{"$f":"'1'!P17","v":"F"},{"$f":"'1'!P19","v":0},{"$f":"'2'!O18","v":0},{"$f":"'2'!P17","v":"F"},{"$f":"'2'!P19","v":0},{"$f":"'3'!O18","v":0},{"$f":"'3'!P17","v":"F"},{"$f":"'3'!P19","v":0},{"$f":"'4'!O18","v":0},{"$f":"'4'!P17","v":"F"},{"$f":"'4'!P19","v":0},null,1,"S6","T4","T8","='1'!S6","='1'!T4","='1'!T8"]
["Match 5",{"$f":"'1'!S6","v":0},{"$f":"'1'!T4","v":0},{"$f":"'1'!T8","v":0},{"$f":"'2'!S6","v":0},{"$f":"'2'!T4","v":0},{"$f":"'2'!T8","v":0},{"$f":"'3'!S6","v":0},{"$f":"'3'!T4","v":0},{"$f":"'3'!T8","v":0},{"$f":"'4'!S6","v":0},{"$f":"'4'!T4","v":0},{"$f":"'4'!T8","v":0},null,1,"S16","T14","T18","='1'!S16","='1'!T14","='1'!T18"]
["Match 6",{"$f":"'1'!S16","v":0},{"$f":"'1'!T14","v":0},{"$f":"'1'!T18","v":0},{"$f":"'2'!T18","v":0},{"$f":"'2'!T14","v":0},{"$f":"'2'!T18","v":0},{"$f":"'3'!S16","v":0},{"$f":"'3'!T14","v":0},{"$f":"'3'!T18","v":0},{"$f":"'4'!S16","v":0},{"$f":"'4'!T14","v":0},{"$f":"'4'!T18","v":0},null,1,"L6","J4","J8","='1'!L6","='1'!J4","='1'!J8"]
["Match 7",{"$f":"'1'!L6","v":0},{"$f":"'1'!J4","v":"F"},{"$f":"'1'!J8","v":0},{"$f":"'2'!L6","v":0},{"$f":"'2'!J4","v":"F"},{"$f":"'2'!J8","v":0},{"$f":"'3'!L6","v":0},{"$f":"'3'!J4","v":"F"},{"$f":"'3'!J8","v":"F"},{"$f":"'4'!L6","v":0},{"$f":"'4'!J4","v":"F"},{"$f":"'4'!J8","v":"F"},null,1,"L16","J14","J18","='1'!L16","='1'!J14","='1'!J18"]
["Match 8",{"$f":"'1'!L16","v":0},{"$f":"'1'!J14","v":"F"},{"$f":"'1'!J18","v":"F"},{"$f":"'2'!L16","v":0},{"$f":"'2'!J14","v":"F"},{"$f":"'2'!J18","v":"F"},{"$f":"'3'!L16","v":0},{"$f":"'3'!J14","v":"F"},{"$f":"'3'!J18","v":"F"},{"$f":"'4'!L16","v":0},{"$f":"'4'!J14","v":"F"},{"$f":"'4'!J18","v":"F"},null,1,"H8","F6","F10","='1'!H8","='1'!F6","='1'!F10"]
["Match 9",{"$f":"'1'!H8","v":0},{"$f":"'1'!F6","v":0},{"$f":"'1'!F10","v":0},{"$f":"'2'!H8","v":0},{"$f":"'2'!F6","v":0},{"$f":"'2'!F10","v":0},{"$f":"'3'!H8","v":0},{"$f":"'3'!F6","v":"F"},{"$f":"'3'!F10","v":0},{"$f":"'4'!H8","v":0},{"$f":"'4'!F6","v":"F"},{"$f":"'4'!F10","v":0},null,1,"H18","F16","F20","='1'!H18","='1'!F16","='1'!F20"]
["Match 10",{"$f":"'1'!H18","v":0},{"$f":"'1'!F16","v":"F"},{"$f":"'1'!F20","v":0},{"$f":"'2'!H18","v":0},{"$f":"'2'!F16","v":"F"},{"$f":"'2'!F20","v":0},{"$f":"'3'!H18","v":0},{"$f":"'3'!F16","v":"F"},{"$f":"'3'!F20","v":0},{"$f":"'4'!H18","v":0},{"$f":"'4'!F16","v":"F"},{"$f":"'4'!F20","v":0},null,1,"O26","P24","P26","='1'!O26","='1'!P24","='1'!P26"]
["Match 11",{"$f":"'1'!O26","v":4},{"$f":"'1'!P24","v":0},{"$f":"'1'!P26","v":0},{"$f":"'2'!O26","v":0},{"$f":"'2'!P24","v":0},{"$f":"'2'!P26","v":0},{"$f":"'3'!O26","v":0},{"$f":"'3'!P24","v":0},{"$f":"'3'!P26","v":0},{"$f":"'4'!O26","v":6},{"$f":"'4'!P24","v":0},{"$f":"'4'!P26","v":0},null,1,"C13","D8","D18","='1'!C13","='1'!D8","='1'!D18"]
["Match 12",{"$f":"'1'!C13","v":0},{"$f":"'1'!D8","v":0},{"$f":"'1'!D18","v":0},{"$f":"'2'!C13","v":0},{"$f":"'2'!D8","v":0},{"$f":"'2'!D18","v":0},{"$f":"'3'!C13","v":0},{"$f":"'3'!D8","v":0},{"$f":"'3'!D18","v":0},{"$f":"'4'!C13","v":0},{"$f":"'4'!D8","v":0},{"$f":"'4'!D18","v":0},null,1,"H26","I24","I28","='1'!H26","='1'!I24","='1'!I28"]
["Match 13",{"$f":"'1'!H26","v":0},{"$f":"'1'!I24","v":0},{"$f":"'1'!I28","v":0},{"$f":"'2'!H26","v":0},{"$f":"'2'!I24","v":0},{"$f":"'2'!I28","v":0},{"$f":"'3'!H26","v":0},{"$f":"'3'!I24","v":0},{"$f":"'3'!I28","v":0},{"$f":"'4'!H26","v":4},{"$f":"'4'!I24","v":0},{"$f":"'4'!I28","v":0},null,2,"O4","P3","P5","='2'!O4","='2'!P3","='2'!P5"]
[null,null,null,null,null,null,null,null,null,null,null,null,null,null,2,"O8","P7","P9","='2'!O8","='2'!P7","='2'!P9"]
[null,null,null,null,null,null,null,null,null,null,null,null,null,null,2,"O14","P13","P15","='2'!O14","='2'!P13","='2'!P15"]
[null,null,null,null,null,null,null,null,null,null,null,null,null,null,2,"O18","P17","P19","='2'!O18","='2'!P17","='2'!P19"]
[null,null,null,null,null,null,null,null,null,null,null,null,null,null,2,"S6","T4","T8","='2'!S6","='2'!T4","='2'!T8"]
[null,null,null,null,null,null,null,null,null,null,null,null,null,null,2,"S16","T14","T18","='2'!S16","='2'!T14","='2'!T18"]
[null,null,null,null,null,null,null,null,null,null,null,null,null,null,2,"L6","J4","J8","='2'!L6","='2'!J4","='2'!J8"]
[null,null,null,null,null,null,null,null,null,null,null,null,null,null,2,"L16","J14","J18","='2'!L16","='2'!J14","='2'!J18"]
[null,null,null,null,null,null,null,null,null,null,null,null,null,null,2,"H8","F6","F10","='2'!H8","='2'!F6","='2'!F10"]
[null,null,null,null,null,null,null,null,null,null,null,null,null,null,2,"H18","F16","F20","='2'!H18","='2'!F16","='2'!F20"]
[null,null,null,null,null,null,null,null,null,null,null,null,null,null,2,"O26","P24","P26","='2'!O26","='2'!P24","='2'!P26"]
[null,null,null,null,null,null,null,null,null,null,null,null,null,null,2,"C13","D8","D18","='2'!C13","='2'!D8","='2'!D18"]
[null,null,null,null,null,null,null,null,null,null,null,null,null,null,2,"H26","I24","I28","='2'!H26","='2'!I24","='2'!I28"]
[null,null,null,null,null,null,null,null,null,null,null,null,null,null,3,"O4","P3","P5","='3'!O4","='3'!P3","='3'!P5"]
[null,null,null,null,null,null,null,null,null,null,null,null,null,null,3,"O8","P7","P9","='3'!O8","='3'!P7","='3'!P9"]
[null,null,null,null,null,null,null,null,null,null,null,null,null,null,3,"O14","P13","P15","='3'!O14","='3'!P13","='3'!P15"]
[null,null,null,null,null,null,null,null,null,null,null,null,null,null,3,"O18","P17","P19","='3'!O18","='3'!P17","='3'!P19"]
[null,null,null,null,null,null,null,null,null,null,null,null,null,null,3,"S6","T4","T8","='3'!S6","='3'!T4","='3'!T8"]
[null,null,null,null,null,null,null,null,null,null,null,null,null,null,3,"S16","T14","T18","='3'!S16","='3'!T14","='3'!T18"]
[null,null,null,null,null,null,null,null,null,null,null,null,null,null,3,"L6","J4","J8",{"$f":"\"=\"&\"'\"&O34&\"'\"&\"!\"&P34","v":"='3'!L6"},{"$f":"\"=\"&\"'\"&O34&\"'\"&\"!\"&Q34","v":"='3'!J4"},{"$f":"\"=\"&\"'\"&O34&\"'\"&\"!\"&R34","v":"='3'!J8"}]
[null,null,null,null,null,null,null,null,null,null,null,null,null,null,3,"L16","J14","J18","='3'!L16","='3'!J14","='3'!J18"]
[null,null,null,null,null,null,null,null,null,null,null,null,null,null,3,"H8","F6","F10","='3'!H8","='3'!F6","='3'!F10"]
[null,null,null,null,null,null,null,null,null,null,null,null,null,null,3,"H18","F16","F20","='3'!H18","='3'!F16","='3'!F20"]
[null,null,null,null,null,null,null,null,null,null,null,null,null,null,3,"O26","P24","P26","='3'!O26","='3'!P24","='3'!P26"]
[null,null,null,null,null,null,null,null,null,null,null,null,null,null,3,"C13","D8","D18","='3'!C13","='3'!D8","='3'!D18"]
[null,null,null,null,null,null,null,null,null,null,null,null,null,null,3,"H26","I24","I28","='3'!H26","='3'!I24","='3'!I28"]
[null,null,null,null,null,null,null,null,null,null,null,null,null,null,4,"O4","P3","P5","='4'!O4","='4'!P3","='4'!P5"]
[null,null,null,null,null,null,null,null,null,null,null,null,null,null,4,"O8","P7","P9","='4'!O8","='4'!P7","='4'!P9"]
[null,null,null,null,null,null,null,null,null,null,null,null,null,null,4,"O14","P13","P15","='4'!O14","='4'!P13","='4'!P15"]
[null,null,null,null,null,null,null,null,null,null,null,null,null,null,4,"O18","P17","P19","='4'!O18","='4'!P17","='4'!P19"]
[null,null,null,null,null,null,null,null,null,null,null,null,null,null,4,"S6","T4","T8","='4'!S6","='4'!T4","='4'!T8"]
[null,null,null,null,null,null,null,null,null,null,null,null,null,null,4,"S16","T14","T18","='4'!S16","='4'!T14","='4'!T18"]
[null,null,null,null,null,null,null,null,null,null,null,null,null,null,4,"L6","J4","J8","='4'!L6","='4'!J4","='4'!J8"]
[null,null,null,null,null,null,null,null,null,null,null,null,null,null,4,"L16","J14","J18","='4'!L16","='4'!J14","='4'!J18"]
[null,null,null,null,null,null,null,null,null,null,null,null,null,null,4,"H8","F6","F10","='4'!H8","='4'!F6","='4'!F10"]
[null,null,null,null,null,null,null,null,null,null,null,null,null,null,4,"H18","F16","F20","='4'!H18","='4'!F16","='4'!F20"]
[null,null,null,null,null,null,null,null,null,null,null,null,null,null,4,"O26","P24","P26","='4'!O26","='4'!P24","='4'!P26"]
[null,null,null,null,null,null,null,null,null,null,null,null,null,null,4,"C13","D8","D18","='4'!C13","='4'!D8","='4'!D18"]
[null,null,null,null,null,null,null,null,null,null,null,null,null,null,4,"H26","I24","I28","='4'!H26","='4'!I24","='4'!I28"]

{"sheet":"Classement","index":10,"n_rows":70,"n_cols":15,"rows_kept":70,"cut":false,"hidden":true,"merged":[[33,14,48,14],[5,14,8,14],[3,14,4,14],[9,14,16,14],[17,14,24,14],[25,14,32,14]]}
[null,null,"Formules Initiales","Nom & Prénom","Place","Points","GA","CF","RF","Club","Ville","Licence","Division"]
[null,null,1,{"$f":"Vainqueur","v":""},1,200,{"$f":"Final!AL18","v":""},0,0,{"$f":"VLOOKUP(D2,'Listing joueurs'!B:E,2,TRUE)","v":{"$error":"#N/A"}},{"$f":"VLOOKUP(D2,'Listing joueurs'!B:E,3,TRUE)","v":{"$error":"#N/A"}},{"$f":"VLOOKUP(D2,'Listing joueurs'!B:E,4,TRUE)","v":{"$error":"#N/A"}},"R1",null,"Vainqueur"]
[null,null,2,{"$f":"IF(Final!AG12>Final!AG24,Final!AE24,Final!AE12)","v":""},2,180,{"$f":"IF(Final!AG12<Final!AG24,Final!AG12-Final!AG24+Final!AF12,Final!AG24-Final!AG12+Final!AF24)","v":{"$error":"#VALUE!"}},1,0,{"$f":"VLOOKUP(D3,'Listing joueurs'!B:E,2,TRUE)","v":{"$error":"#N/A"}},{"$f":"VLOOKUP(D3,'Listing joueurs'!B:E,3,TRUE)","v":{"$error":"#N/A"}},{"$f":"VLOOKUP(D3,'Listing joueurs'!B:E,4,TRUE)","v":{"$error":"#N/A"}},"R1",null,"Finaliste"]
[null,null,3,{"$f":"Clst_3","v":0},3,161,{"$f":"Clst_GA_3","v":0},{"$f":"Clst_CF_03","v":0},{"$f":"Clst_RF_03","v":0},{"$f":"VLOOKUP(D4,'Listing joueurs'!B:E,2,TRUE)","v":{"$error":"#N/A"}},{"$f":"VLOOKUP(D4,'Listing joueurs'!B:E,3,TRUE)","v":{"$error":"#N/A"}},{"$f":"VLOOKUP(D4,'Listing joueurs'!B:E,4,TRUE)","v":{"$error":"#N/A"}},"R1",null,"Perdants en 1/2 Finale"]
[null,null,4,{"$f":"Clst_4","v":0},4,161,{"$f":"Clst_GA_4","v":0},{"$f":"Clst_CF_04","v":0},{"$f":"Clst_RF_04","v":0},{"$f":"VLOOKUP(D5,'Listing joueurs'!B:E,2,TRUE)","v":{"$error":"#N/A"}},{"$f":"VLOOKUP(D5,'Listing joueurs'!B:E,3,TRUE)","v":{"$error":"#N/A"}},{"$f":"VLOOKUP(D5,'Listing joueurs'!B:E,4,TRUE)","v":{"$error":"#N/A"}},"R1"]
[null,null,5,{"$f":"Clst_5","v":0},5,143,{"$f":"Clst_5_GA","v":0},{"$f":"Clst_5_CF","v":0},{"$f":"Clst_5_RF","v":0},{"$f":"VLOOKUP(D6,'Listing joueurs'!B:E,2,TRUE)","v":{"$error":"#N/A"}},{"$f":"VLOOKUP(D6,'Listing joueurs'!B:E,3,TRUE)","v":{"$error":"#N/A"}},{"$f":"VLOOKUP(D6,'Listing joueurs'!B:E,4,TRUE)","v":{"$error":"#N/A"}},"R1",null,"Perdants en 1/4\nde Finale"]
[null,null,6,{"$f":"Clst_6","v":0},6,143,{"$f":"Clst_6_GA","v":0},{"$f":"Clst_6_CF","v":0},{"$f":"Clst_6_RF","v":0},{"$f":"VLOOKUP(D7,'Listing joueurs'!B:E,2,TRUE)","v":{"$error":"#N/A"}},{"$f":"VLOOKUP(D7,'Listing joueurs'!B:E,3,TRUE)","v":{"$error":"#N/A"}},{"$f":"VLOOKUP(D7,'Listing joueurs'!B:E,4,TRUE)","v":{"$error":"#N/A"}},"R1"]
[null,null,7,{"$f":"Clst_7","v":0},7,143,{"$f":"Clst_7_GA","v":0},{"$f":"Clst_7_CF","v":0},{"$f":"Clst_7_RF","v":0},{"$f":"VLOOKUP(D8,'Listing joueurs'!B:E,2,TRUE)","v":{"$error":"#N/A"}},{"$f":"VLOOKUP(D8,'Listing joueurs'!B:E,3,TRUE)","v":{"$error":"#N/A"}},{"$f":"VLOOKUP(D8,'Listing joueurs'!B:E,4,TRUE)","v":{"$error":"#N/A"}},"R1"]
[null,null,8,{"$f":"Clst_8","v":0},8,143,{"$f":"Clst_8_GA","v":0},{"$f":"Clst_8_CF","v":0},{"$f":"Clst_8_RF","v":0},{"$f":"VLOOKUP(D9,'Listing joueurs'!B:E,2,TRUE)","v":{"$error":"#N/A"}},{"$f":"VLOOKUP(D9,'Listing joueurs'!B:E,3,TRUE)","v":{"$error":"#N/A"}},{"$f":"VLOOKUP(D9,'Listing joueurs'!B:E,4,TRUE)","v":{"$error":"#N/A"}},"R1"]
[null,null,11,{"$f":"Clst_9","v":0},9,126,{"$f":"Clst_GA_9","v":0},{"$f":"Clst_CF_9","v":0},{"$f":"Clst_RF_9","v":0},{"$f":"VLOOKUP(D10,'Listing joueurs'!B:E,2,TRUE)","v":{"$error":"#N/A"}},{"$f":"VLOOKUP(D10,'Listing joueurs'!B:E,3,TRUE)","v":{"$error":"#N/A"}},{"$f":"VLOOKUP(D10,'Listing joueurs'!B:E,4,TRUE)","v":{"$error":"#N/A"}},"R2",null,"Perdants en 8ème"]
[null,null,16,{"$f":"Clst_10","v":0},10,126,{"$f":"Clst_GA_10","v":0},{"$f":"Clst_CF_10","v":0},{"$f":"Clst_RF_10","v":0},{"$f":"VLOOKUP(D11,'Listing joueurs'!B:E,2,TRUE)","v":{"$error":"#N/A"}},{"$f":"VLOOKUP(D11,'Listing joueurs'!B:E,3,TRUE)","v":{"$error":"#N/A"}},{"$f":"VLOOKUP(D11,'Listing joueurs'!B:E,4,TRUE)","v":{"$error":"#N/A"}},"R2"]
[null,null,9,{"$f":"Clst_11","v":0},11,126,{"$f":"Clst_GA_11","v":0},{"$f":"Clst_CF_11","v":0},{"$f":"Clst_RF_11","v":0},{"$f":"VLOOKUP(D12,'Listing joueurs'!B:E,2,TRUE)","v":{"$error":"#N/A"}},{"$f":"VLOOKUP(D12,'Listing joueurs'!B:E,3,TRUE)","v":{"$error":"#N/A"}},{"$f":"VLOOKUP(D12,'Listing joueurs'!B:E,4,TRUE)","v":{"$error":"#N/A"}},"R2"]
[null,null,12,{"$f":"Clst_12","v":0},12,126,{"$f":"Clst_GA_12","v":0},{"$f":"Clst_CF_12","v":0},{"$f":"Clst_RF_12","v":0},{"$f":"VLOOKUP(D13,'Listing joueurs'!B:E,2,TRUE)","v":{"$error":"#N/A"}},{"$f":"VLOOKUP(D13,'Listing joueurs'!B:E,3,TRUE)","v":{"$error":"#N/A"}},{"$f":"VLOOKUP(D13,'Listing joueurs'!B:E,4,TRUE)","v":{"$error":"#N/A"}},"R2"]
[null,null,14,{"$f":"Clst_13","v":0},13,126,{"$f":"Clst_GA_13","v":0},{"$f":"Clst_CF_13","v":0},{"$f":"Clst_RF_13","v":0},{"$f":"VLOOKUP(D14,'Listing joueurs'!B:E,2,TRUE)","v":{"$error":"#N/A"}},{"$f":"VLOOKUP(D14,'Listing joueurs'!B:E,3,TRUE)","v":{"$error":"#N/A"}},{"$f":"VLOOKUP(D14,'Listing joueurs'!B:E,4,TRUE)","v":{"$error":"#N/A"}},"R2"]
[null,null,15,{"$f":"Clst_14","v":0},14,126,{"$f":"Clst_GA_14","v":0},{"$f":"Clst_CF_14","v":0},{"$f":"Clst_RF_14","v":0},{"$f":"VLOOKUP(D15,'Listing joueurs'!B:E,2,TRUE)","v":{"$error":"#N/A"}},{"$f":"VLOOKUP(D15,'Listing joueurs'!B:E,3,TRUE)","v":{"$error":"#N/A"}},{"$f":"VLOOKUP(D15,'Listing joueurs'!B:E,4,TRUE)","v":{"$error":"#N/A"}},"R2"]
[null,null,13,{"$f":"Clst_15","v":0},15,126,{"$f":"Clst_GA_15","v":0},{"$f":"Clst_CF_15","v":0},{"$f":"Clst_RF_15","v":0},{"$f":"VLOOKUP(D16,'Listing joueurs'!B:E,2,TRUE)","v":{"$error":"#N/A"}},{"$f":"VLOOKUP(D16,'Listing joueurs'!B:E,3,TRUE)","v":{"$error":"#N/A"}},{"$f":"VLOOKUP(D16,'Listing joueurs'!B:E,4,TRUE)","v":{"$error":"#N/A"}},"R2"]
[null,null,10,{"$f":"Clst_16","v":0},16,126,{"$f":"Clst_GA_16","v":0},{"$f":"Clst_CF_16","v":0},{"$f":"Clst_CF_16","v":0},{"$f":"VLOOKUP(D17,'Listing joueurs'!B:E,2,TRUE)","v":{"$error":"#N/A"}},{"$f":"VLOOKUP(D17,'Listing joueurs'!B:E,3,TRUE)","v":{"$error":"#N/A"}},{"$f":"VLOOKUP(D17,'Listing joueurs'!B:E,4,TRUE)","v":{"$error":"#N/A"}},"R2"]
[null,null,18,{"$f":"Clst_17","v":0},17,118,{"$f":"Clst_GA_17","v":0},{"$f":"Clst_CF_17","v":0},{"$f":"Clst_RF_17","v":0},{"$f":"VLOOKUP(D18,'Listing joueurs'!B:E,2,TRUE)","v":{"$error":"#N/A"}},{"$f":"VLOOKUP(D18,'Listing joueurs'!B:E,3,TRUE)","v":{"$error":"#N/A"}},{"$f":"VLOOKUP(D18,'Listing joueurs'!B:E,4,TRUE)","v":{"$error":"#N/A"}},"R2",null,"Perdants en 16ème"]
[null,null,27,{"$f":"Clst_18","v":0},18,118,{"$f":"Clst_GA_18","v":0},{"$f":"Clst_CF_18","v":0},{"$f":"Clst_RF_18","v":0},{"$f":"VLOOKUP(D19,'Listing joueurs'!B:E,2,TRUE)","v":{"$error":"#N/A"}},{"$f":"VLOOKUP(D19,'Listing joueurs'!B:E,3,TRUE)","v":{"$error":"#N/A"}},{"$f":"VLOOKUP(D19,'Listing joueurs'!B:E,4,TRUE)","v":{"$error":"#N/A"}},"Relégué(e)"]
[null,null,28,{"$f":"Clst_19","v":0},19,118,{"$f":"Clst_GA_19","v":0},{"$f":"Clst_CF_19","v":0},{"$f":"Clst_RF_19","v":0},{"$f":"VLOOKUP(D20,'Listing joueurs'!B:E,2,TRUE)","v":{"$error":"#N/A"}},{"$f":"VLOOKUP(D20,'Listing joueurs'!B:E,3,TRUE)","v":{"$error":"#N/A"}},{"$f":"VLOOKUP(D20,'Listing joueurs'!B:E,4,TRUE)","v":{"$error":"#N/A"}},"Relégué(e)"]
[null,null,22,{"$f":"Clst_20","v":0},20,118,{"$f":"Clst_GA_20","v":0},{"$f":"Clst_CF_20","v":0},{"$f":"Clst_RF_20","v":0},{"$f":"VLOOKUP(D21,'Listing joueurs'!B:E,2,TRUE)","v":{"$error":"#N/A"}},{"$f":"VLOOKUP(D21,'Listing joueurs'!B:E,3,TRUE)","v":{"$error":"#N/A"}},{"$f":"VLOOKUP(D21,'Listing joueurs'!B:E,4,TRUE)","v":{"$error":"#N/A"}},"R2"]
[null,null,32,{"$f":"Clst_21","v":0},21,118,{"$f":"Clst_GA_21","v":0},{"$f":"Clst_CF_21","v":0},{"$f":"Clst_RF_21","v":0},{"$f":"VLOOKUP(D22,'Listing joueurs'!B:E,2,TRUE)","v":{"$error":"#N/A"}},{"$f":"VLOOKUP(D22,'Listing joueurs'!B:E,3,TRUE)","v":{"$error":"#N/A"}},{"$f":"VLOOKUP(D22,'Listing joueurs'!B:E,4,TRUE)","v":{"$error":"#N/A"}},"Relégué(e)"]
[null,null,21,{"$f":"Clst_22","v":0},22,118,{"$f":"Clst_GA_22","v":0},{"$f":"Clst_CF_22","v":0},{"$f":"Clst_RF_22","v":0},{"$f":"VLOOKUP(D23,'Listing joueurs'!B:E,2,TRUE)","v":{"$error":"#N/A"}},{"$f":"VLOOKUP(D23,'Listing joueurs'!B:E,3,TRUE)","v":{"$error":"#N/A"}},{"$f":"VLOOKUP(D23,'Listing joueurs'!B:E,4,TRUE)","v":{"$error":"#N/A"}},"R2"]
[null,null,23,{"$f":"Clst_23","v":0},23,118,{"$f":"Clst_GA_23","v":0},{"$f":"Clst_CF_23","v":0},{"$f":"Clst_RF_23","v":0},{"$f":"VLOOKUP(D24,'Listing joueurs'!B:E,2,TRUE)","v":{"$error":"#N/A"}},{"$f":"VLOOKUP(D24,'Listing joueurs'!B:E,3,TRUE)","v":{"$error":"#N/A"}},{"$f":"VLOOKUP(D24,'Listing joueurs'!B:E,4,TRUE)","v":{"$error":"#N/A"}},"R2"]
[null,null,24,{"$f":"Clst_24","v":0},24,118,{"$f":"Clst_GA_24","v":0},{"$f":"Clst_CF_24","v":0},{"$f":"Clst_CF_24","v":0},{"$f":"VLOOKUP(D25,'Listing joueurs'!B:E,2,TRUE)","v":{"$error":"#N/A"}},{"$f":"VLOOKUP(D25,'Listing joueurs'!B:E,3,TRUE)","v":{"$error":"#N/A"}},{"$f":"VLOOKUP(D25,'Listing joueurs'!B:E,4,TRUE)","v":{"$error":"#N/A"}},"R2"]
[null,null,25,{"$f":"Clst_25","v":0},25,110,{"$f":"Clst_GA_25","v":0},{"$f":"Clst_CF_25","v":0},{"$f":"Clst_RF_25","v":0},{"$f":"VLOOKUP(D26,'Listing joueurs'!B:E,2,TRUE)","v":{"$error":"#N/A"}},{"$f":"VLOOKUP(D26,'Listing joueurs'!B:E,3,TRUE)","v":{"$error":"#N/A"}},{"$f":"VLOOKUP(D26,'Listing joueurs'!B:E,4,TRUE)","v":{"$error":"#N/A"}},"Relégué(e)",null,"3eme et 4eme de Poule"]
[null,null,20,{"$f":"Clst_26","v":0},26,110,{"$f":"Clst_GA_26","v":0},{"$f":"Clst_CF_26","v":0},{"$f":"Clst_RF_26","v":0},{"$f":"VLOOKUP(D27,'Listing joueurs'!B:E,2,TRUE)","v":{"$error":"#N/A"}},{"$f":"VLOOKUP(D27,'Listing joueurs'!B:E,3,TRUE)","v":{"$error":"#N/A"}},{"$f":"VLOOKUP(D27,'Listing joueurs'!B:E,4,TRUE)","v":{"$error":"#N/A"}},"R2"]
[null,null,26,{"$f":"Clst_27","v":0},27,110,{"$f":"Clst_GA_27","v":0},{"$f":"Clst_CF_27","v":0},{"$f":"Clst_RF_27","v":0},{"$f":"VLOOKUP(D28,'Listing joueurs'!B:E,2,TRUE)","v":{"$error":"#N/A"}},{"$f":"VLOOKUP(D28,'Listing joueurs'!B:E,3,TRUE)","v":{"$error":"#N/A"}},{"$f":"VLOOKUP(D28,'Listing joueurs'!B:E,4,TRUE)","v":{"$error":"#N/A"}},"Relégué(e)"]
[null,null,29,{"$f":"Clst_28","v":0},28,110,{"$f":"Clst_GA_28","v":0},{"$f":"Clst_CF_28","v":0},{"$f":"Clst_RF_28","v":0},{"$f":"VLOOKUP(D29,'Listing joueurs'!B:E,2,TRUE)","v":{"$error":"#N/A"}},{"$f":"VLOOKUP(D29,'Listing joueurs'!B:E,3,TRUE)","v":{"$error":"#N/A"}},{"$f":"VLOOKUP(D29,'Listing joueurs'!B:E,4,TRUE)","v":{"$error":"#N/A"}},"Relégué(e)"]
[null,null,30,{"$f":"Clst_29","v":0},29,110,{"$f":"Clst_GA_29","v":0},{"$f":"Clst_CF_29","v":0},{"$f":"Clst_RF_29","v":0},{"$f":"VLOOKUP(D30,'Listing joueurs'!B:E,2,TRUE)","v":{"$error":"#N/A"}},{"$f":"VLOOKUP(D30,'Listing joueurs'!B:E,3,TRUE)","v":{"$error":"#N/A"}},{"$f":"VLOOKUP(D30,'Listing joueurs'!B:E,4,TRUE)","v":{"$error":"#N/A"}},"Relégué(e)"]
[null,null,31,{"$f":"Clst_30","v":0},30,110,{"$f":"Clst_GA_30","v":0},{"$f":"Clst_CF_30","v":0},{"$f":"Clst_RF_30","v":0},{"$f":"VLOOKUP(D31,'Listing joueurs'!B:E,2,TRUE)","v":{"$error":"#N/A"}},{"$f":"VLOOKUP(D31,'Listing joueurs'!B:E,3,TRUE)","v":{"$error":"#N/A"}},{"$f":"VLOOKUP(D31,'Listing joueurs'!B:E,4,TRUE)","v":{"$error":"#N/A"}},"Relégué(e)"]
[null,null,17,{"$f":"Clst_31","v":0},31,110,{"$f":"Clst_GA_31","v":0},{"$f":"Clst_CF_31","v":0},{"$f":"Clst_RF_31","v":0},{"$f":"VLOOKUP(D32,'Listing joueurs'!B:E,2,TRUE)","v":{"$error":"#N/A"}},{"$f":"VLOOKUP(D32,'Listing joueurs'!B:E,3,TRUE)","v":{"$error":"#N/A"}},{"$f":"VLOOKUP(D32,'Listing joueurs'!B:E,4,TRUE)","v":{"$error":"#N/A"}},"R2"]
[null,null,19,{"$f":"Clst_32","v":0},32,110,{"$f":"Clst_GA_32","v":0},{"$f":"Clst_CF_32","v":0},{"$f":"Clst_RF_32","v":0},{"$f":"VLOOKUP(D33,'Listing joueurs'!B:E,2,TRUE)","v":{"$error":"#N/A"}},{"$f":"VLOOKUP(D33,'Listing joueurs'!B:E,3,TRUE)","v":{"$error":"#N/A"}},{"$f":"VLOOKUP(D33,'Listing joueurs'!B:E,4,TRUE)","v":{"$error":"#N/A"}},"R2"]
[null,null,null,"BACCAM HELENE  ",33,95,-5,0,0,{"$f":"VLOOKUP(D34,'Listing joueurs'!B:E,2,TRUE)","v":"NIGHT BILLARD CLUB"},{"$f":"VLOOKUP(D34,'Listing joueurs'!B:E,3,TRUE)","v":"BEAUREGARD"},{"$f":"VLOOKUP(D34,'Listing joueurs'!B:E,4,TRUE)","v":"146104K"},"Relégué(e)",null,"5eme, 6eme, 7eme et 8eme de poule"]
[null,null,null,"BOBROSKY BERNARD ",34,0,"A",0,0,{"$f":"VLOOKUP(D35,'Listing joueurs'!B:E,2,TRUE)","v":"NIGHT BILLARD CLUB"},{"$f":"VLOOKUP(D35,'Listing joueurs'!B:E,3,TRUE)","v":"BEAUREGARD"},{"$f":"VLOOKUP(D35,'Listing joueurs'!B:E,4,TRUE)","v":"156618M"},"Relégué(e)"]
[null,null,null,"LACROIX VALERIE ",35,0,"A",0,0,{"$f":"VLOOKUP(D36,'Listing joueurs'!B:E,2,TRUE)","v":"NIGHT BILLARD CLUB"},{"$f":"VLOOKUP(D36,'Listing joueurs'!B:E,3,TRUE)","v":"BEAUREGARD"},{"$f":"VLOOKUP(D36,'Listing joueurs'!B:E,4,TRUE)","v":"152915M"},"Relégué(e)"]
[null,null,null,"MOREL SYLVAIN  ",36,0,"A",0,0,{"$f":"VLOOKUP(D37,'Listing joueurs'!B:E,2,TRUE)","v":"NIGHT BILLARD CLUB"},{"$f":"VLOOKUP(D37,'Listing joueurs'!B:E,3,TRUE)","v":"BEAUREGARD"},{"$f":"VLOOKUP(D37,'Listing joueurs'!B:E,4,TRUE)","v":"152633F"},"Relégué(e)"]
[null,null,null,"VALLOT PATRICE  ",37,0,"A",0,0,{"$f":"VLOOKUP(D38,'Listing joueurs'!B:E,2,TRUE)","v":"BILLARD CLUB DE BOURG EN BRESSE"},{"$f":"VLOOKUP(D38,'Listing joueurs'!B:E,3,TRUE)","v":"BOURG EN BRESSE"},{"$f":"VLOOKUP(D38,'Listing joueurs'!B:E,4,TRUE)","v":"156333C"},"Relégué(e)"]
[null,null,null,null,38,95,null,null,null,{"$f":"VLOOKUP(D39,'Listing joueurs'!B:E,2,TRUE)","v":{"$error":"#N/A"}},{"$f":"VLOOKUP(D39,'Listing joueurs'!B:E,3,TRUE)","v":{"$error":"#N/A"}},{"$f":"VLOOKUP(D39,'Listing joueurs'!B:E,4,TRUE)","v":{"$error":"#N/A"}},"Relégué(e)"]
[null,null,null,null,39,95,null,null,null,{"$f":"VLOOKUP(D40,'Listing joueurs'!B:E,2,TRUE)","v":{"$error":"#N/A"}},{"$f":"VLOOKUP(D40,'Listing joueurs'!B:E,3,TRUE)","v":{"$error":"#N/A"}},{"$f":"VLOOKUP(D40,'Listing joueurs'!B:E,4,TRUE)","v":{"$error":"#N/A"}},"Relégué(e)"]
[null,null,null,null,40,95,null,null,null,{"$f":"VLOOKUP(D41,'Listing joueurs'!B:E,2,TRUE)","v":{"$error":"#N/A"}},{"$f":"VLOOKUP(D41,'Listing joueurs'!B:E,3,TRUE)","v":{"$error":"#N/A"}},{"$f":"VLOOKUP(D41,'Listing joueurs'!B:E,4,TRUE)","v":{"$error":"#N/A"}},"Relégué(e)"]
[null,null,null,null,41,95,null,null,null,{"$f":"VLOOKUP(D42,'Listing joueurs'!B:E,2,TRUE)","v":{"$error":"#N/A"}},{"$f":"VLOOKUP(D42,'Listing joueurs'!B:E,3,TRUE)","v":{"$error":"#N/A"}},{"$f":"VLOOKUP(D42,'Listing joueurs'!B:E,4,TRUE)","v":{"$error":"#N/A"}},"Relégué(e)"]
[null,null,null,null,42,95,null,null,null,{"$f":"VLOOKUP(D43,'Listing joueurs'!B:E,2,TRUE)","v":{"$error":"#N/A"}},{"$f":"VLOOKUP(D43,'Listing joueurs'!B:E,3,TRUE)","v":{"$error":"#N/A"}},{"$f":"VLOOKUP(D43,'Listing joueurs'!B:E,4,TRUE)","v":{"$error":"#N/A"}},"Relégué(e)"]
[null,null,null,null,43,95,null,null,null,{"$f":"VLOOKUP(D44,'Listing joueurs'!B:E,2,TRUE)","v":{"$error":"#N/A"}},{"$f":"VLOOKUP(D44,'Listing joueurs'!B:E,3,TRUE)","v":{"$error":"#N/A"}},{"$f":"VLOOKUP(D44,'Listing joueurs'!B:E,4,TRUE)","v":{"$error":"#N/A"}},"Relégué(e)"]
[null,null,null,null,44,95,null,null,null,{"$f":"VLOOKUP(D45,'Listing joueurs'!B:E,2,TRUE)","v":{"$error":"#N/A"}},{"$f":"VLOOKUP(D45,'Listing joueurs'!B:E,3,TRUE)","v":{"$error":"#N/A"}},{"$f":"VLOOKUP(D45,'Listing joueurs'!B:E,4,TRUE)","v":{"$error":"#N/A"}},"Relégué(e)"]
[null,null,null,null,45,95,null,null,null,{"$f":"VLOOKUP(D46,'Listing joueurs'!B:E,2,TRUE)","v":{"$error":"#N/A"}},{"$f":"VLOOKUP(D46,'Listing joueurs'!B:E,3,TRUE)","v":{"$error":"#N/A"}},{"$f":"VLOOKUP(D46,'Listing joueurs'!B:E,4,TRUE)","v":{"$error":"#N/A"}},"Relégué(e)"]
[null,null,null,null,46,95,null,null,null,{"$f":"VLOOKUP(D47,'Listing joueurs'!B:E,2,TRUE)","v":{"$error":"#N/A"}},{"$f":"VLOOKUP(D47,'Listing joueurs'!B:E,3,TRUE)","v":{"$error":"#N/A"}},{"$f":"VLOOKUP(D47,'Listing joueurs'!B:E,4,TRUE)","v":{"$error":"#N/A"}},"Relégué(e)"]
[null,null,null,null,47,95,null,null,null,{"$f":"VLOOKUP(D48,'Listing joueurs'!B:E,2,TRUE)","v":{"$error":"#N/A"}},{"$f":"VLOOKUP(D48,'Listing joueurs'!B:E,3,TRUE)","v":{"$error":"#N/A"}},{"$f":"VLOOKUP(D48,'Listing joueurs'!B:E,4,TRUE)","v":{"$error":"#N/A"}},"Relégué(e)"]
[null,null,null,null,48,95,null,null,null,{"$f":"VLOOKUP(D49,'Listing joueurs'!B:E,2,TRUE)","v":{"$error":"#N/A"}},{"$f":"VLOOKUP(D49,'Listing joueurs'!B:E,3,TRUE)","v":{"$error":"#N/A"}},{"$f":"VLOOKUP(D49,'Listing joueurs'!B:E,4,TRUE)","v":{"$error":"#N/A"}},"Relégué(e)"]
[null,null,null,null,49,null,null,null,null,{"$f":"IF(ISNA(VLOOKUP(D50,#REF!,2,FALSE)),\"\",VLOOKUP(D50,#REF!,2,FALSE))","v":{"$error":"#REF!"}},{"$f":"IF(ISNA(VLOOKUP(D50,#REF!,3,FALSE)),\"\",VLOOKUP(D50,#REF!,3,FALSE))","v":{"$error":"#REF!"}},{"$f":"IF(ISNA(VLOOKUP(D50,#REF!,4,FALSE)),\"\",VLOOKUP(D50,#REF!,4,FALSE))","v":{"$error":"#REF!"}},"Relégué(e)"]
[null,null,null,null,50,null,null,null,null,{"$f":"IF(ISNA(VLOOKUP(D51,#REF!,2,FALSE)),\"\",VLOOKUP(D51,#REF!,2,FALSE))","v":{"$error":"#REF!"}},{"$f":"IF(ISNA(VLOOKUP(D51,#REF!,3,FALSE)),\"\",VLOOKUP(D51,#REF!,3,FALSE))","v":{"$error":"#REF!"}},{"$f":"IF(ISNA(VLOOKUP(D51,#REF!,4,FALSE)),\"\",VLOOKUP(D51,#REF!,4,FALSE))","v":{"$error":"#REF!"}},"Relégué(e)"]
[null,null,null,null,51,null,null,null,null,{"$f":"IF(ISNA(VLOOKUP(D52,#REF!,2,FALSE)),\"\",VLOOKUP(D52,#REF!,2,FALSE))","v":{"$error":"#REF!"}},{"$f":"IF(ISNA(VLOOKUP(D52,#REF!,3,FALSE)),\"\",VLOOKUP(D52,#REF!,3,FALSE))","v":{"$error":"#REF!"}},{"$f":"IF(ISNA(VLOOKUP(D52,#REF!,4,FALSE)),\"\",VLOOKUP(D52,#REF!,4,FALSE))","v":{"$error":"#REF!"}},"Relégué(e)"]
[null,null,null,null,52,null,null,null,null,{"$f":"IF(ISNA(VLOOKUP(D53,#REF!,2,FALSE)),\"\",VLOOKUP(D53,#REF!,2,FALSE))","v":{"$error":"#REF!"}},{"$f":"IF(ISNA(VLOOKUP(D53,#REF!,3,FALSE)),\"\",VLOOKUP(D53,#REF!,3,FALSE))","v":{"$error":"#REF!"}},{"$f":"IF(ISNA(VLOOKUP(D53,#REF!,4,FALSE)),\"\",VLOOKUP(D53,#REF!,4,FALSE))","v":{"$error":"#REF!"}},"Relégué(e)"]
[null,null,null,null,53,null,null,null,null,{"$f":"IF(ISNA(VLOOKUP(D54,#REF!,2,FALSE)),\"\",VLOOKUP(D54,#REF!,2,FALSE))","v":{"$error":"#REF!"}},{"$f":"IF(ISNA(VLOOKUP(D54,#REF!,3,FALSE)),\"\",VLOOKUP(D54,#REF!,3,FALSE))","v":{"$error":"#REF!"}},{"$f":"IF(ISNA(VLOOKUP(D54,#REF!,4,FALSE)),\"\",VLOOKUP(D54,#REF!,4,FALSE))","v":{"$error":"#REF!"}},"Relégué(e)"]
[null,null,null,null,54,null,null,null,null,{"$f":"IF(ISNA(VLOOKUP(D55,#REF!,2,FALSE)),\"\",VLOOKUP(D55,#REF!,2,FALSE))","v":{"$error":"#REF!"}},{"$f":"IF(ISNA(VLOOKUP(D55,#REF!,3,FALSE)),\"\",VLOOKUP(D55,#REF!,3,FALSE))","v":{"$error":"#REF!"}},{"$f":"IF(ISNA(VLOOKUP(D55,#REF!,4,FALSE)),\"\",VLOOKUP(D55,#REF!,4,FALSE))","v":{"$error":"#REF!"}},"Relégué(e)"]
[null,null,null,null,55,null,null,null,null,{"$f":"IF(ISNA(VLOOKUP(D59,#REF!,2,FALSE)),\"\",VLOOKUP(D59,#REF!,2,FALSE))","v":{"$error":"#REF!"}},{"$f":"IF(ISNA(VLOOKUP(D56,#REF!,3,FALSE)),\"\",VLOOKUP(D56,#REF!,3,FALSE))","v":{"$error":"#REF!"}},{"$f":"IF(ISNA(VLOOKUP(D59,#REF!,4,FALSE)),\"\",VLOOKUP(D59,#REF!,4,FALSE))","v":{"$error":"#REF!"}},"Relégué(e)"]
[null,null,null,null,56,null,null,null,null,{"$f":"IF(ISNA(VLOOKUP(D60,#REF!,2,FALSE)),\"\",VLOOKUP(D60,#REF!,2,FALSE))","v":{"$error":"#REF!"}},{"$f":"IF(ISNA(VLOOKUP(D57,#REF!,3,FALSE)),\"\",VLOOKUP(D57,#REF!,3,FALSE))","v":{"$error":"#REF!"}},{"$f":"IF(ISNA(VLOOKUP(D60,#REF!,4,FALSE)),\"\",VLOOKUP(D60,#REF!,4,FALSE))","v":{"$error":"#REF!"}},"Relégué(e)"]
[null,null,null,null,57,null,null,null,null,{"$f":"IF(ISNA(VLOOKUP(D61,#REF!,2,FALSE)),\"\",VLOOKUP(D61,#REF!,2,FALSE))","v":{"$error":"#REF!"}},{"$f":"IF(ISNA(VLOOKUP(D58,#REF!,3,FALSE)),\"\",VLOOKUP(D58,#REF!,3,FALSE))","v":{"$error":"#REF!"}},{"$f":"IF(ISNA(VLOOKUP(D61,#REF!,4,FALSE)),\"\",VLOOKUP(D61,#REF!,4,FALSE))","v":{"$error":"#REF!"}},"Relégué(e)"]
[null,null,null,null,58,null,null,null,null,{"$f":"IF(ISNA(VLOOKUP(D62,#REF!,2,FALSE)),\"\",VLOOKUP(D62,#REF!,2,FALSE))","v":{"$error":"#REF!"}},{"$f":"IF(ISNA(VLOOKUP(D59,#REF!,3,FALSE)),\"\",VLOOKUP(D59,#REF!,3,FALSE))","v":{"$error":"#REF!"}},{"$f":"IF(ISNA(VLOOKUP(D62,#REF!,4,FALSE)),\"\",VLOOKUP(D62,#REF!,4,FALSE))","v":{"$error":"#REF!"}},"Relégué(e)"]
[null,null,null,null,59,null,null,null,null,{"$f":"IF(ISNA(VLOOKUP(D62,#REF!,2,FALSE)),\"\",VLOOKUP(D62,#REF!,2,FALSE))","v":{"$error":"#REF!"}},{"$f":"IF(ISNA(VLOOKUP(D60,#REF!,3,FALSE)),\"\",VLOOKUP(D60,#REF!,3,FALSE))","v":{"$error":"#REF!"}},{"$f":"IF(ISNA(VLOOKUP(D63,#REF!,4,FALSE)),\"\",VLOOKUP(D63,#REF!,4,FALSE))","v":{"$error":"#REF!"}},"Relégué(e)",null,"i"]
[null,null,null,null,60,null,null,null,null,{"$f":"IF(ISNA(VLOOKUP(D63,#REF!,2,FALSE)),\"\",VLOOKUP(D63,#REF!,2,FALSE))","v":{"$error":"#REF!"}},{"$f":"IF(ISNA(VLOOKUP(D63,#REF!,3,FALSE)),\"\",VLOOKUP(D63,#REF!,3,FALSE))","v":{"$error":"#REF!"}},{"$f":"IF(ISNA(VLOOKUP(D63,#REF!,4,FALSE)),\"\",VLOOKUP(D63,#REF!,4,FALSE))","v":{"$error":"#REF!"}},"Relégué(e)"]
[null,null,null,null,61,null,null,null,null,{"$f":"IF(ISNA(VLOOKUP(D64,#REF!,2,FALSE)),\"\",VLOOKUP(D64,#REF!,2,FALSE))","v":{"$error":"#REF!"}},{"$f":"IF(ISNA(VLOOKUP(D64,#REF!,3,FALSE)),\"\",VLOOKUP(D64,#REF!,3,FALSE))","v":{"$error":"#REF!"}},{"$f":"IF(ISNA(VLOOKUP(D64,#REF!,4,FALSE)),\"\",VLOOKUP(D64,#REF!,4,FALSE))","v":{"$error":"#REF!"}},"Relégué(e)"]
[null,null,null,null,62,null,null,null,null,{"$f":"IF(ISNA(VLOOKUP(D65,#REF!,2,FALSE)),\"\",VLOOKUP(D65,#REF!,2,FALSE))","v":{"$error":"#REF!"}},{"$f":"IF(ISNA(VLOOKUP(D65,#REF!,3,FALSE)),\"\",VLOOKUP(D65,#REF!,3,FALSE))","v":{"$error":"#REF!"}},{"$f":"IF(ISNA(VLOOKUP(D65,#REF!,4,FALSE)),\"\",VLOOKUP(D65,#REF!,4,FALSE))","v":{"$error":"#REF!"}},"Relégué(e)"]
[null,null,null,null,63,null,null,null,null,{"$f":"IF(ISNA(VLOOKUP(D66,#REF!,2,FALSE)),\"\",VLOOKUP(D66,#REF!,2,FALSE))","v":{"$error":"#REF!"}},{"$f":"IF(ISNA(VLOOKUP(D66,#REF!,3,FALSE)),\"\",VLOOKUP(D66,#REF!,3,FALSE))","v":{"$error":"#REF!"}},{"$f":"IF(ISNA(VLOOKUP(D66,#REF!,4,FALSE)),\"\",VLOOKUP(D66,#REF!,4,FALSE))","v":{"$error":"#REF!"}},"Relégué(e)"]
[null,null,null,null,64,null,null,null,null,{"$f":"IF(ISNA(VLOOKUP(D67,#REF!,2,FALSE)),\"\",VLOOKUP(D67,#REF!,2,FALSE))","v":{"$error":"#REF!"}},{"$f":"IF(ISNA(VLOOKUP(D67,#REF!,3,FALSE)),\"\",VLOOKUP(D67,#REF!,3,FALSE))","v":{"$error":"#REF!"}},{"$f":"IF(ISNA(VLOOKUP(D67,#REF!,4,FALSE)),\"\",VLOOKUP(D67,#REF!,4,FALSE))","v":{"$error":"#REF!"}},"Relégué(e)"]
[null,null,null,null,"FE"]
[null,null,null,null,"FE"]
[null,null,null,null,"FE"]
[null,null,null,null,"FE"]
[null,null,null,null,"FE"]

{"sheet":"Points","index":11,"n_rows":68,"n_cols":8,"rows_kept":68,"cut":false,"hidden":true,"merged":[]}
["Place","R1","R2","R3"]
[1,200,200,93]
[2,180,180,79]
[3,161,161,66]
[4,161,161,66,null,null,{"$f":"IF(AND(#REF!=\"A\",#REF!=\"A\"),#REF!,IF(#REF!=\"A\",#REF!,IF(#REF!=\"A\",#REF!,IF(#REF!=#REF!,\"\",(IF(#REF!>#REF!,#REF!,#REF!))))))","v":{"$error":"#REF!"}},{"$f":"IF(AND(#REF!=\"A\",#REF!=\"A\"),#REF!,IF(#REF!=\"A\",#REF!,IF(#REF!=\"A\",#REF!,IF(#REF!=#REF!,\"\",(IF(#REF!>#REF!,#REF!+#REF!-#REF!,#REF!+#REF!-#REF!))))))","v":{"$error":"#REF!"}}]
[5,143,143,54,null,null,{"$f":"IF(AND(#REF!=\"A\",#REF!=\"A\"),#REF!,IF(#REF!=\"A\",#REF!,IF(#REF!=\"A\",#REF!,IF(#REF!=#REF!,\"\",(IF(#REF!>#REF!,#REF!,#REF!))))))","v":{"$error":"#REF!"}},{"$f":"IF(AND(#REF!=\"A\",#REF!=\"A\"),#REF!,IF(#REF!=\"A\",#REF!,IF(#REF!=\"A\",#REF!,IF(#REF!=#REF!,\"\",(IF(#REF!>#REF!,#REF!+#REF!-#REF!,#REF!+#REF!-#REF!))))))","v":{"$error":"#REF!"}}]
[6,143,143,54]
[7,143,143,54]
[8,143,143,54]
[9,126,126,43]
[10,126,126,43]
[11,126,126,43]
[12,126,126,43]
[13,126,126,43]
[14,126,126,43]
[15,126,126,43]
[16,126,126,43]
[17,118,118,38]
[18,118,118,38]
[19,118,118,38]
[20,118,118,38]
[21,118,118,38]
[22,118,118,38]
[23,118,118,38]
[24,118,118,38]
[25,118,110,38]
[26,118,110,38]
[27,118,110,38]
[28,118,110,38]
[29,118,110,38]
[30,118,110,38]
[31,118,110,38]
[32,118,110,38]
[33,110,95,33]
[34,110,95,33]
[35,110,95,33]
[36,110,95,33]
[37,110,95,33]
[38,110,95,33]
[39,110,95,33]
[40,110,95,33]
[41,110,95,33]
[42,110,95,33]
[43,110,95,33]
[44,110,95,33]
[45,110,95,33]
[46,110,95,33]
[47,110,95,33]
[48,110,95,33]
[49,95,81,24]
[50,95,81,24]
[51,95,81,24]
[52,95,81,24]
[53,95,81,24]
[54,95,81,24]
[55,95,81,24]
[56,95,81,24]
[57,95,81,24]
[58,95,81,24]
[59,95,81,24]
[60,95,81,24]
[61,95,81,24]
[62,95,81,24]
[63,95,81,24]
[64,95,81,24]
["FNE",-50,-50,-20]
["FE",0,0,0]
["A",0,0,0]

{"sheet":"Parametres","index":12,"n_rows":29,"n_cols":5,"rows_kept":29,"cut":false,"hidden":true,"merged":[]}
[]
[]
[]
[]
[]
[]
[]
[]
[]
[]
[]
[]
[]
[]
[]
[]
[]
[]
[]
[]
["Billard",null,"Partie_Poule","Partie_Tab_Fin","Partie Finale"]
[1,null,"A","A","A"]
[2,null,"F","F","F"]
[3,null,0,0,0]
[4,null,1,1,1]
[5,null,2,2,2]
[6,null,3,3,3]
[null,null,null,4,4]
[null,null,null,null,5]