{"text_format":"1","workbook":"xlsx","n_sheets":7,"sheets":["Points","Accueil","Inscrits","1","2","Final","Classement"],"not_rendered":{"charts":0,"images":2,"macros":1,"external_links":0,"defined_names":66,"comments":3,"pivot_tables":0},"unopened":[],"bounds":{"document_bytes":16777216,"sheet_cells":100000,"rows_first":2000,"rows_last":500,"rows_between":2000,"halvings":0,"cell_chars":16384,"cell_head_chars":4096},"cells_cut":0,"cells_raw":0,"read":"whole","date_system":"1900"}

{"sheet":"Points","index":0,"n_rows":20,"n_cols":4,"rows_kept":20,"cut":false,"hidden":false,"merged":[]}
["Place","R1","R2","R3"]
[1,200,142,93]
[2,180,125,79]
[3,161,109,66]
[4,161,109,66]
[5,143,94,54]
{"$rows_left_out":15}
{"sheet":"Accueil","index":1,"n_rows":128,"n_cols":7,"rows_kept":128,"cut":false,"hidden":false,"merged":[[1,2,1,6],[24,3,24,6],[25,3,25,6],[15,2,15,6]]}
["A"]
["F",null,"INFOS UTILES POUR CE TOURNOI"]
[0]
[1,null,"LIGUE","Rhône-Alpes",null,"SAISON","2017/2018"]
[2]
[3,null,"DATE","2017-10-26",null,"TOURNOI","N°1"]
{"$rows_left_out":123}
{"sheet":"Inscrits","index":2,"n_rows":42,"n_cols":12,"rows_kept":42,"cut":false,"hidden":false,"merged":[[0,11,1,11],[8,11,9,11],[16,11,18,11],[25,11,26,11]]}
["N° Tirage","Nom du Joueur","Classement","Club","N° Licence","Forfait\nNon Excusé","Forfait\nExcusé","Abandon",1,"X",null,1]
[1,"BERRAHOU SOLANGE","NC","Academie de Billard de la Valserine","153217Q",null,"-",null,2,"-"]
[2,"DONATO LAURENT","NC","Academie de Billard de la Valserine","146971B",null,"-",null,3]
[3,"DUARTE JOSE","NC","Academie de Billard de la Valserine","146968Y",null,"-",null,4]
[4,"GELIBERT ALEXIS","NC","Academie de Billard de la Valserine","159122J",null,"-",null,5]
[5,"DURET CHRISTOPHE","NC","Club Chamberien de Billard","105704O",null,"-",null,6]
{"$rows_left_out":37}
{"sheet":"1","index":3,"n_rows":21,"n_cols":45,"rows_kept":21,"cut":false,"hidden":false,"merged":[[20,9,20,17],[12,1,12,2],[0,9,0,17],[1,42,1,45],[11,42,11,45],[10,20,10,21]]}
[null,null,null,null,null,null,null,null,null,"MATCHS EN 3 PARTIES GAGNANTES"]
[null,null,null,null,null,null,null,null,null,null,null,null,null,null,null,null,null,null,null,null,null,null,null,null,null,null,null,null,null,null,null,null,null,null,null,null,null,null,null,null,null,null,"QUALIFIES"]
[null,null,null,null,null,null,null,null,null,null,"P1",1,{"$f":"IF(IF(ISNA(VLOOKUP(L3,Inscrits!$A$2:$C$33,2,FALSE)),\"\",VLOOKUP(L3,Inscrits!$A$2:$C$33,2,FALSE))=0,\"\",IF(ISNA(VLOOKUP(L3,Inscrits!$A$2:$C$33,2,FALSE)),\"\",VLOOKUP(L3,Inscrits!$A$2:$C$33,2,FALSE)))","v":"BERRAHOU SOLANGE"},{"$f":"IF(IF(ISNA(VLOOKUP(L3,Inscrits!$A$2:$C$33,3,FALSE)),\"\",\"(\"&(VLOOKUP(L3,Inscrits!$A$2:$C$33,3,FALSE))&\")\")=\"()\",\"\",IF(ISNA(VLOOKUP(L3,Inscrits!$A$2:$C$33,3,FALSE)),\"\",\"(\"&(VLOOKUP(L3,Inscrits!$A$2:$C$33,3,FALSE))&\")\"))","v":"(NC)"},null,null,"G1",null,null,null,null,null,null,null,null,null,null,null,"G","P","G","P","G","P","G","P","G","P","G","P","Ga",null,null,"NOM","Ga"]
[null,null,null,null,null,null,null,null,"F",{"$f":"IF(OR(AND(O3=\"F\",O5=\"F\"),AND(O3=\"A\",O5=\"A\")),M5,IF(OR(O3=\"F\",O3=\"A\"),M3,IF(OR(O5=\"F\",O5=\"A\"),M5,IF(O3=O5,\"\",(IF(O3<O5,M3,M5))))))","v":"BLANC 6"},{"$f":"IF(OR(AND(O3=\"F\",O5=\"F\"),AND(O3=\"A\",O5=\"A\")),N5,IF(OR(O3=\"F\",O3=\"A\"),N3,IF(OR(O5=\"F\",O5=\"A\"),N5,IF(O3=O5,\"\",(IF(O3<O5,N3,N5))))))","v":"(NC)"},null,"Match 1 - Billard",null,null,null,{"$f":"IF(OR(AND(O3=\"F\",O5=\"F\"),AND(O3=\"A\",O5=\"A\")),M3,IF(OR(O3=\"F\",O3=\"A\"),M5,IF(OR(O5=\"F\",O5=\"A\"),M3,IF(O3=O5,\"\",(IF(O3>O5,M3,M5))))))","v":"BERRAHOU SOLANGE"},{"$f":"IF(OR(AND(O3=\"F\",O5=\"F\"),AND(O3=\"A\",O5=\"A\")),N3,IF(OR(O3=\"F\",O3=\"A\"),N5,IF(OR(O5=\"F\",O5=\"A\"),N3,IF(O3=O5,\"\",(IF(O3>O5,N3,N5))))))","v":"(NC)"},null,null,null,null,null,null,1,{"$f":"IF(U6=\"\",\"\",IF(U6=Q4,Q4,Q8))","v":""},null,{"$f":"M3","v":"BERRAHOU SOLANGE"},{"$f":"IF(AB4=M3,IF(O5=\"F\",\"\",O3),0)","v":""},{"$f":"IF(AB4=M3,IF(O3=\"F\",\"\",O5),0)","v":"F"},{"$f":"IF(AB4=Q4,IF(S8=\"F\",\"\",S4),0)","v":0},{"$f":"IF(AB4=Q4,IF(S4=\"F\",\"\",S8),0)","v":0},{"$f":"IF(AB4=J4,IF(I8=\"F\",\"\",I4),0)","v":0},{"$f":"IF(AB4=J4,IF(I4=\"F\",\"\",I8),0)","v":0},{"$f":"IF(AB4=F6,IF(E10=\"F\",\"\",E6),0)","v":0},{"$f":"IF(AB4=F6,IF(E6=\"F\",\"\",E10),0)","v":0},{"$f":"IF(AB4=F20,IF(E16=\"F\",\"\",E20),0)","v":0},{"$f":"IF(AB4=F20,IF(E20=\"F\",\"\",E16),0)","v":0},{"$f":"SUM(AC4,AE4,AG4,AI4,AK4)","v":0},0,{"$f":"AM4-AN4","v":0},null,null,{"$f":"Z4","v":""},{"$f":"IF(AR4=\"\",\"\",(VLOOKUP(AR4,AB4:AO17,14,FALSE)))","v":""}]
[null,null,null,null,null,null,"G7",null,null,null,null,16,{"$f":"IF(IF(ISNA(VLOOKUP(L5,Inscrits!$A$2:$C$33,2,FALSE)),\"\",VLOOKUP(L5,Inscrits!$A$2:$C$33,2,FALSE))=0,\"\",IF(ISNA(VLOOKUP(L5,Inscrits!$A$2:$C$33,2,FALSE)),\"\",VLOOKUP(L5,Inscrits!$A$2:$C$33,2,FALSE)))","v":"BLANC 6"},{"$f":"IF(IF(ISNA(VLOOKUP(L5,Inscrits!$A$2:$C$33,3,FALSE)),\"\",\"(\"&(VLOOKUP(L5,Inscrits!$A$2:$C$33,3,FALSE))&\")\")=\"()\",\"\",IF(ISNA(VLOOKUP(L5,Inscrits!$A$2:$C$33,3,FALSE)),\"\",\"(\"&(VLOOKUP(L5,Inscrits!$A$2:$C$33,3,FALSE))&\")\"))","v":"(NC)"},"F",null,null,null,null,null,"G5",null,null,null,3,{"$f":"IF(B8=\"\",\"\",IF(B8=F6,F6,F10))","v":""},null,{"$f":"M5","v":"BLANC 6"},{"$f":"IF(AB5=M5,IF(O3=\"F\",\"\",O5),0)","v":"F"},{"$f":"IF(AB5=M5,IF(O5=\"F\",\"\",O3),0)","v":""},{"$f":"IF(AB5=Q4,IF(S8=\"F\",\"\",S4),0)","v":0},{"$f":"IF(AB5=Q4,IF(S4=\"F\",\"\",S8),0)","v":0},{"$f":"IF(AB5=J4,IF(I8=\"F\",\"\",I4),0)","v":"F"},{"$f":"IF(AB5=J4,IF(I4=\"F\",\"\",I8),0)","v":""},{"$f":"IF(AB5=F6,IF(E10=\"F\",\"\",E6),0)","v":0},{"$f":"IF(AB5=F6,IF(E6=\"F\",\"\",E10),0)","v":0},{"$f":"IF(AB5=F20,IF(E16=\"F\",\"\",E20),0)","v":0},{"$f":"IF(AB5=F20,IF(E20=\"F\",\"\",E16),0)","v":0},0,0,{"$f":"AM5-AN5","v":0},null,null,{"$f":"Z14","v":""},{"$f":"IF(AR5=\"\",\"\",(VLOOKUP(AR5,AB4:AO17,14,FALSE)))","v":""}]
[null,null,null,null,null,{"$f":"IF(OR(I4=\"F\",I4=\"A\"),J8,IF(OR(I8=\"F\",I8=\"A\"),J4,IF(I4=I8,\"\",(IF(I4>I8,J4,J8)))))","v":""},{"$f":"IF(OR(I4=\"F\",I4=\"A\"),K8,IF(OR(I8=\"F\",I8=\"A\"),K4,IF(I4=I8,\"\",(IF(I4>I8,K4,K8)))))","v":""},null,null,"Match 7 - Billard",null,null,null,null,null,null,"Match 5 - Billard",null,null,null,{"$f":"IF(OR(S4=\"F\",S4=\"A\"),Q8,IF(OR(S8=\"F\",S8=\"A\"),Q4,IF(S4=S8,\"\",(IF(S4>S8,Q4,Q8)))))","v":""},{"$f":"IF(OR(S4=\"F\",S4=\"A\"),R8,IF(OR(S8=\"F\",S8=\"A\"),R4,IF(S4=S8,\"\",(IF(S4>S8,R4,R8)))))","v":""},"A",null,5,{"$f":"IF(B8=\"\",\"\",IF(B8=F6,F10,F6))","v":""},null,{"$f":"M7","v":"RAY VINCENT"},{"$f":"IF(AB6=M7,IF(O9=\"F\",\"\",O7),0)","v":0},{"$f":"IF(AB6=M7,IF(O7=\"F\",\"\",O9),0)","v":0},{"$f":"IF(AB6=Q8,IF(S4=\"F\",\"\",S8),0)","v":0},{"$f":"IF(AB6=Q8,IF(S8=\"F\",\"\",S4),0)","v":0},{"$f":"IF(AB6=J8,IF(I4=\"F\",\"\",I8),0)","v":0},{"$f":"IF(AB6=J8,IF(I8=\"F\",\"\",I4),0)","v":0},{"$f":"IF(AB6=F6,IF(E10=\"F\",\"\",E6),0)","v":0},{"$f":"IF(AB6=F6,IF(E6=\"F\",\"\",E10),0)","v":0},{"$f":"IF(AB6=F20,IF(E16=\"F\",\"\",E20),0)","v":0},{"$f":"IF(AB6=F20,IF(E20=\"F\",\"\",E16),0)","v":0},0,0,{"$f":"AM6-AN6","v":0},null,null,{"$f":"Z5","v":""},{"$f":"IF(AR6=\"\",\"\",(VLOOKUP(AR6,AB4:AO17,14,FALSE)))","v":""}]
{"$rows_left_out":16}
{"sheet":"2","index":4,"n_rows":21,"n_cols":45,"rows_kept":21,"cut":false,"hidden":false,"merged":[[0,9,0,17],[12,1,12,2],[10,20,10,21],[1,42,1,45],[11,42,11,45],[20,9,20,17]]}
[null,null,null,null,null,null,null,null,null,"MATCHS EN 3 PARTIES GAGNANTES"]
[null,null,null,null,null,null,null,null,null,null,null,null,null,null,null,null,null,null,null,null,null,null,null,null,null,null,null,null,null,null,null,null,null,null,null,null,null,null,null,null,null,null,"QUALIFIES"]
[null,null,null,null,null,null,null,null,null,null,"P1",3,{"$f":"IF(IF(ISNA(VLOOKUP(L3,Inscrits!$A$2:$C$33,2,FALSE)),\"\",VLOOKUP(L3,Inscrits!$A$2:$C$33,2,FALSE))=0,\"\",IF(ISNA(VLOOKUP(L3,Inscrits!$A$2:$C$33,2,FALSE)),\"\",VLOOKUP(L3,Inscrits!$A$2:$C$33,2,FALSE)))","v":"DUARTE JOSE"},{"$f":"IF(IF(ISNA(VLOOKUP(L3,Inscrits!$A$2:$C$33,3,FALSE)),\"\",\"(\"&(VLOOKUP(L3,Inscrits!$A$2:$C$33,3,FALSE))&\")\")=\"()\",\"\",IF(ISNA(VLOOKUP(L3,Inscrits!$A$2:$C$33,3,FALSE)),\"\",\"(\"&(VLOOKUP(L3,Inscrits!$A$2:$C$33,3,FALSE))&\")\"))","v":"(NC)"},null,null,"G1",null,null,null,null,null,null,null,null,null,null,null,"G","P","G","P","G","P","G","P","G","P","G","P","Ga",null,null,"NOM","Ga"]
[null,null,null,null,null,null,null,null,null,{"$f":"IF(OR(AND(O3=\"F\",O5=\"F\"),AND(O3=\"A\",O5=\"A\")),M5,IF(OR(O3=\"F\",O3=\"A\"),M3,IF(OR(O5=\"F\",O5=\"A\"),M5,IF(O3=O5,\"\",(IF(O3<O5,M3,M5))))))","v":""},{"$f":"IF(OR(AND(O3=\"F\",O5=\"F\"),AND(O3=\"A\",O5=\"A\")),N5,IF(OR(O3=\"F\",O3=\"A\"),N3,IF(OR(O5=\"F\",O5=\"A\"),N5,IF(O3=O5,\"\",(IF(O3<O5,N3,N5))))))","v":""},null,"Match 1 - Billard",null,null,null,{"$f":"IF(OR(AND(O3=\"F\",O5=\"F\"),AND(O3=\"A\",O5=\"A\")),M3,IF(OR(O3=\"F\",O3=\"A\"),M5,IF(OR(O5=\"F\",O5=\"A\"),M3,IF(O3=O5,\"\",(IF(O3>O5,M3,M5))))))","v":""},{"$f":"IF(OR(AND(O3=\"F\",O5=\"F\"),AND(O3=\"A\",O5=\"A\")),N3,IF(OR(O3=\"F\",O3=\"A\"),N5,IF(OR(O5=\"F\",O5=\"A\"),N3,IF(O3=O5,\"\",(IF(O3>O5,N3,N5))))))","v":""},null,null,null,null,null,null,1,{"$f":"IF(U6=\"\",\"\",IF(U6=Q4,Q4,Q8))","v":""},null,{"$f":"M3","v":"DUARTE JOSE"},{"$f":"IF(AB4=M3,IF(O5=\"F\",\"\",O3),0)","v":0},{"$f":"IF(AB4=M3,IF(O3=\"F\",\"\",O5),0)","v":0},{"$f":"IF(AB4=Q4,IF(S8=\"F\",\"\",S4),0)","v":0},{"$f":"IF(AB4=Q4,IF(S4=\"F\",\"\",S8),0)","v":0},{"$f":"IF(AB4=J4,IF(I8=\"F\",\"\",I4),0)","v":0},{"$f":"IF(AB4=J4,IF(I4=\"F\",\"\",I8),0)","v":0},{"$f":"IF(AB4=F6,IF(E10=\"F\",\"\",E6),0)","v":0},{"$f":"IF(AB4=F6,IF(E6=\"F\",\"\",E10),0)","v":0},{"$f":"IF(AB4=F20,IF(E16=\"F\",\"\",E20),0)","v":0},{"$f":"IF(AB4=F20,IF(E20=\"F\",\"\",E16),0)","v":0},{"$f":"SUM(AC4,AE4,AG4,AI4,AK4)","v":0},0,{"$f":"AM4-AN4","v":0},null,null,{"$f":"Z4","v":""},{"$f":"IF(AR4=\"\",\"\",(VLOOKUP(AR4,AB4:AO17,14,FALSE)))","v":""}]
[null,null,null,null,null,null,"G7",null,null,null,null,14,{"$f":"IF(IF(ISNA(VLOOKUP(L5,Inscrits!$A$2:$C$33,2,FALSE)),\"\",VLOOKUP(L5,Inscrits!$A$2:$C$33,2,FALSE))=0,\"\",IF(ISNA(VLOOKUP(L5,Inscrits!$A$2:$C$33,2,FALSE)),\"\",VLOOKUP(L5,Inscrits!$A$2:$C$33,2,FALSE)))","v":"MOREL FLORENT"},{"$f":"IF(IF(ISNA(VLOOKUP(L5,Inscrits!$A$2:$C$33,3,FALSE)),\"\",\"(\"&(VLOOKUP(L5,Inscrits!$A$2:$C$33,3,FALSE))&\")\")=\"()\",\"\",IF(ISNA(VLOOKUP(L5,Inscrits!$A$2:$C$33,3,FALSE)),\"\",\"(\"&(VLOOKUP(L5,Inscrits!$A$2:$C$33,3,FALSE))&\")\"))","v":"(NC)"},null,null,null,null,null,null,"G5",null,null,null,3,{"$f":"IF(B8=\"\",\"\",IF(B8=F6,F6,F10))","v":""},null,{"$f":"M5","v":"MOREL FLORENT"},{"$f":"IF(AB5=M5,IF(O3=\"F\",\"\",O5),0)","v":0},{"$f":"IF(AB5=M5,IF(O5=\"F\",\"\",O3),0)","v":0},{"$f":"IF(AB5=Q4,IF(S8=\"F\",\"\",S4),0)","v":0},{"$f":"IF(AB5=Q4,IF(S4=\"F\",\"\",S8),0)","v":0},{"$f":"IF(AB5=J4,IF(I8=\"F\",\"\",I4),0)","v":0},{"$f":"IF(AB5=J4,IF(I4=\"F\",\"\",I8),0)","v":0},{"$f":"IF(AB5=F6,IF(E10=\"F\",\"\",E6),0)","v":0},{"$f":"IF(AB5=F6,IF(E6=\"F\",\"\",E10),0)","v":0},{"$f":"IF(AB5=F20,IF(E16=\"F\",\"\",E20),0)","v":0},{"$f":"IF(AB5=F20,IF(E20=\"F\",\"\",E16),0)","v":0},0,0,{"$f":"AM5-AN5","v":0},null,null,{"$f":"Z14","v":""},{"$f":"IF(AR5=\"\",\"\",(VLOOKUP(AR5,AB4:AO17,14,FALSE)))","v":""}]
[null,null,null,null,null,{"$f":"IF(OR(I4=\"F\",I4=\"A\"),J8,IF(OR(I8=\"F\",I8=\"A\"),J4,IF(I4=I8,\"\",(IF(I4>I8,J4,J8)))))","v":""},{"$f":"IF(OR(I4=\"F\",I4=\"A\"),K8,IF(OR(I8=\"F\",I8=\"A\"),K4,IF(I4=I8,\"\",(IF(I4>I8,K4,K8)))))","v":""},null,null,"Match 7 - Billard",null,null,null,null,null,null,"Match 5 - Billard",null,null,null,{"$f":"IF(OR(S4=\"F\",S4=\"A\"),Q8,IF(OR(S8=\"F\",S8=\"A\"),Q4,IF(S4=S8,\"\",(IF(S4>S8,Q4,Q8)))))","v":""},{"$f":"IF(OR(S4=\"F\",S4=\"A\"),R8,IF(OR(S8=\"F\",S8=\"A\"),R4,IF(S4=S8,\"\",(IF(S4>S8,R4,R8)))))","v":""},"C",null,5,{"$f":"IF(B8=\"\",\"\",IF(B8=F6,F10,F6))","v":""},null,{"$f":"M7","v":"ARNAUD JEAN PHILIPPE"},{"$f":"IF(AB6=M7,IF(O9=\"F\",\"\",O7),0)","v":0},{"$f":"IF(AB6=M7,IF(O7=\"F\",\"\",O9),0)","v":0},{"$f":"IF(AB6=Q8,IF(S4=\"F\",\"\",S8),0)","v":0},{"$f":"IF(AB6=Q8,IF(S8=\"F\",\"\",S4),0)","v":0},{"$f":"IF(AB6=J8,IF(I4=\"F\",\"\",I8),0)","v":0},{"$f":"IF(AB6=J8,IF(I8=\"F\",\"\",I4),0)","v":0},{"$f":"IF(AB6=F6,IF(E10=\"F\",\"\",E6),0)","v":0},{"$f":"IF(AB6=F6,IF(E6=\"F\",\"\",E10),0)","v":0},{"$f":"IF(AB6=F20,IF(E16=\"F\",\"\",E20),0)","v":0},{"$f":"IF(AB6=F20,IF(E20=\"F\",\"\",E16),0)","v":0},0,0,{"$f":"AM6-AN6","v":0},null,null,{"$f":"Z5","v":""},{"$f":"IF(AR6=\"\",\"\",(VLOOKUP(AR6,AB4:AO17,14,FALSE)))","v":""}]
{"$rows_left_out":16}
{"sheet":"Final","index":5,"n_rows":27,"n_cols":35,"rows_kept":27,"cut":false,"hidden":false,"merged":[[1,5,1,7],[1,9,1,11],[1,13,1,15],[0,1,0,3],[1,1,1,3],[0,13,0,15],[0,9,0,11],[0,5,0,7]]}
[null,"1/8 de finale",null,null,null,"1/4 de finale",null,null,null,"1/2 finale",null,null,null,"Finale"]
[null,{"$f":"\"(\"&Accueil!D20&\" manches)\"","v":"( manches)"},null,null,null,{"$f":"\"(\"&Accueil!G20&\" manches)\"","v":"(4 manches)"},null,null,null,{"$f":"\"(\"&Accueil!D22&\" manches)\"","v":"(4 manches)"},null,null,null,{"$f":"\"(\"&Accueil!G22&\" manches)\"","v":"(5 manches)"}]
[null,null,null,null,null,null,null,null,null,null,null,null,null,null,null,null,null,null,null,null,null,"JOUEURS","1/8","1/4","1/2","Finale","GA Final",null,"JOUEURS","GA Poules",null,"JOUEURS","GA Poules","GA Final","GA TOTAL"]
[null,null,null,null,null,null,null,null,null,null,null,null,null,null,null,null,null,null,null,null,null,{"$f":"F5","v":""},null,{"$f":"IF(AND(H5=\"A\",H7=\"A\"),0,IF(H5=\"A\",-H7,IF(H7=\"A\",H5,H5-H7)))","v":0},{"$f":"IF(J6=V4,IF(AND(L6=\"A\",L12=\"A\"),0,IF(OR(X4>0,H7=\"A\"),IF(L6=\"A\",-L12,IF(L12=\"A\",L6,L6-L12)),0)),0)","v":0},{"$f":"IF(N9=V4,IF(AND(P9=\"A\",P21=\"A\"),0,IF(OR(Y4>0,L12=\"A\"),IF(P9=\"A\",-P21,IF(P21=\"A\",P9,P9-P21)),0)),0)","v":0},{"$f":"SUM(W4:Z4)","v":0},null,{"$f":"'1'!AR4","v":""},{"$f":"'1'!AS4","v":""},null,{"$f":"IF(Inscrits!B2=0,\"\",Inscrits!B2)","v":"BERRAHOU SOLANGE"},{"$f":"VLOOKUP(AF4,$AC$4:$AD$35,2,FALSE)","v":{"$error":"#N/A"}},{"$f":"VLOOKUP(AF4,$V$4:$AA$35,6,FALSE)","v":{"$error":"#N/A"}},{"$f":"AG4+AH4","v":{"$error":"#N/A"}}]
[null,null,null,null,"A",{"$f":"IF('1'!U6=0,\"\",'1'!U6)","v":""},{"$f":"IF('1'!V6=0,\"\",'1'!V6)","v":""},null,null,null,null,null,null,null,null,null,null,null,null,null,null,null,null,null,null,null,null,null,{"$f":"'1'!AR5","v":""},{"$f":"'1'!AS5","v":""},null,{"$f":"IF(Inscrits!B3=0,\"\",Inscrits!B3)","v":"DONATO LAURENT"},{"$f":"VLOOKUP(AF5,$AC$4:$AD$35,2,FALSE)","v":{"$error":"#N/A"}},{"$f":"VLOOKUP(AF5,$V$4:$AA$35,6,FALSE)","v":{"$error":"#N/A"}},{"$error":"#N/A"}]
[null,null,null,null,null,"Match 1 - Billard",null,null,null,{"$f":"IF(AND(H5=\"A\",H7=\"A\"),F5,IF(H5=\"A\",F7,IF(H7=\"A\",F5,IF(H5=H7,\"\",(IF(H5>H7,F5,F7))))))","v":""},{"$f":"IF(AND(H5=\"A\",H7=\"A\"),G5,IF(H5=\"A\",G7,IF(H7=\"A\",G5,IF(H5=H7,\"\",(IF(H5>H7,G5,G7))))))","v":""},null,null,null,null,null,null,null,null,null,null,{"$f":"F7","v":""},null,{"$f":"IF(AND(H5=\"A\",H7=\"A\"),0,IF(H7=\"A\",-H5,IF(H5=\"A\",H7,H7-H5)))","v":0},{"$f":"IF(J6=V6,IF(AND(L6=\"A\",L12=\"A\"),0,IF(OR(X6>0,H5=\"A\"),IF(L6=\"A\",-L12,IF(L12=\"A\",L6,L6-L12)),0)),0)","v":0},{"$f":"IF(N9=V6,IF(AND(P9=\"A\",P21=\"A\"),0,IF(OR(Y6>0,L12=\"A\"),IF(P9=\"A\",-P21,IF(P21=\"A\",P9,P9-P21)),0)),0)","v":0},{"$f":"SUM(W6:Z6)","v":0},null,{"$f":"'1'!AR6","v":""},{"$f":"'1'!AS6","v":""},null,{"$f":"IF(Inscrits!B4=0,\"\",Inscrits!B4)","v":"DUARTE JOSE"},{"$error":"#N/A"},{"$error":"#N/A"},{"$error":"#N/A"}]
{"$rows_left_out":22}
{"sheet":"Classement","index":6,"n_rows":17,"n_cols":13,"rows_kept":17,"cut":false,"hidden":false,"merged":[]}
[null,null,"Formules Initiales","Nom & Prénom","Place","Points","GA","CF","RF","Club","Ville","Licence","Division"]
[null,null,1,{"$f":"Final!R15","v":""},null,{"$f":"IF(ISNA(IF(LEFT(Division,2)=\"R1\",VLOOKUP(E2,Points!$A$2:$D$20,2,FALSE),IF(LEFT(Division,2)=\"R2\",VLOOKUP(E2,Points!$A$2:$D$20,3,FALSE),IF(LEFT(Division,2)=\"R3\",VLOOKUP(E2,Points!$A$2:$D$20,4,FALSE),\"DIV ???\")))),0,IF(LEFT(Division,2)=\"R1\",VLOOKUP(E2,Points!$A$2:$D$20,2,FALSE),IF(LEFT(Division,2)=\"R2\",VLOOKUP(E2,Points!$A$2:$D$20,3,FALSE),IF(LEFT(Division,2)=\"R3\",VLOOKUP(E2,Points!$A$2:$D$20,4,FALSE),\"DIV ???\"))))","v":0},{"$f":"IF(ISERROR(VLOOKUP(D2,Final!$AF$4:$AI$35,4,FALSE)),\"\",VLOOKUP(D2,Final!$AF$4:$AI$35,4,FALSE))","v":""},null,null,{"$f":"IF(ISNA(VLOOKUP(D2,Inscrits!B:E,3,FALSE)),\"\",VLOOKUP(D2,Inscrits!B:E,3,FALSE))","v":""},{"$f":"IF(ISNA(VLOOKUP(D2,Inscrits!B:E,4,FALSE)),\"\",VLOOKUP(D2,Inscrits!B:E,4,FALSE))","v":""},{"$f":"IF(ISNA(VLOOKUP(D2,Inscrits!B:E,5,FALSE)),\"\",VLOOKUP(D2,Inscrits!B:E,5,FALSE))","v":""},{"$f":"IF(NB_JOUEURS_UP>0,IF(LEN(Division)=2,\"R\"&RIGHT(Division,1)-1&\"\",IF(LEN(Division)=3,IF(RIGHT(LEFT(Division,2),1)=\"2\",\"R1\",IF(Nb_R2=1,\"R2\",\"R\"&RIGHT(LEFT(Division,2),1)-1&\"\"&RIGHT(Division,1)&\"\")),IF(LEN(Division)=4,IF(RIGHT(LEFT(Division,2),1)=\"2\",\"R1\",\"R\"&RIGHT(LEFT(Division,2),1)-1&\"\"&RIGHT(LEFT(Division,3),1)&\"\"),\"?\"))),Division)","v":"R1"}]
[null,null,2,{"$f":"IF(Final!P21=\"A\",Final!N21,IF(Final!P9=\"A\",Final!N9,IF(Final!P9<Final!P21,Final!N9,Final!N21)))","v":""},null,{"$f":"IF(ISNA(IF(LEFT(Division,2)=\"R1\",VLOOKUP(E3,Points!$A$2:$D$20,2,FALSE),IF(LEFT(Division,2)=\"R2\",VLOOKUP(E3,Points!$A$2:$D$20,3,FALSE),IF(LEFT(Division,2)=\"R3\",VLOOKUP(E3,Points!$A$2:$D$20,4,FALSE),\"DIV ???\")))),0,IF(LEFT(Division,2)=\"R1\",VLOOKUP(E3,Points!$A$2:$D$20,2,FALSE),IF(LEFT(Division,2)=\"R2\",VLOOKUP(E3,Points!$A$2:$D$20,3,FALSE),IF(LEFT(Division,2)=\"R3\",VLOOKUP(E3,Points!$A$2:$D$20,4,FALSE),\"DIV ???\"))))","v":0},{"$f":"IF(ISERROR(VLOOKUP(D3,Final!$AF$4:$AI$35,4,FALSE)),\"\",VLOOKUP(D3,Final!$AF$4:$AI$35,4,FALSE))","v":""},null,null,{"$f":"IF(ISNA(VLOOKUP(D3,Inscrits!B:E,3,FALSE)),\"\",VLOOKUP(D3,Inscrits!B:E,3,FALSE))","v":""},{"$f":"IF(ISNA(VLOOKUP(D3,Inscrits!B:E,4,FALSE)),\"\",VLOOKUP(D3,Inscrits!B:E,4,FALSE))","v":""},{"$f":"IF(ISNA(VLOOKUP(D3,Inscrits!B:E,5,FALSE)),\"\",VLOOKUP(D3,Inscrits!B:E,5,FALSE))","v":""},{"$f":"IF(NB_JOUEURS_UP>1,IF(LEN(Division)=2,\"R\"&RIGHT(Division,1)-1&\"\",IF(LEN(Division)=3,IF(RIGHT(LEFT(Division,2),1)=\"2\",\"R1\",IF(Nb_R2=1,\"R2\",\"R\"&RIGHT(LEFT(Division,2),1)-1&\"\"&RIGHT(Division,1)&\"\")),IF(LEN(Division)=4,IF(RIGHT(LEFT(Division,2),1)=\"2\",\"R1\",\"R\"&RIGHT(LEFT(Division,2),1)-1&\"\"&RIGHT(LEFT(Division,3),1)&\"\"),\"?\"))),Division)","v":"R1"}]
[null,null,4,{"$f":"IF(Final!L24=\"A\",Final!J24,IF(Final!L18=\"A\",Final!J18,IF(Final!L18<Final!L24,Final!J18,Final!J24)))","v":""},null,{"$f":"IF(ISNA(IF(LEFT(Division,2)=\"R1\",VLOOKUP(E4,Points!$A$2:$D$20,2,FALSE),IF(LEFT(Division,2)=\"R2\",VLOOKUP(E4,Points!$A$2:$D$20,3,FALSE),IF(LEFT(Division,2)=\"R3\",VLOOKUP(E4,Points!$A$2:$D$20,4,FALSE),\"DIV ???\")))),0,IF(LEFT(Division,2)=\"R1\",VLOOKUP(E4,Points!$A$2:$D$20,2,FALSE),IF(LEFT(Division,2)=\"R2\",VLOOKUP(E4,Points!$A$2:$D$20,3,FALSE),IF(LEFT(Division,2)=\"R3\",VLOOKUP(E4,Points!$A$2:$D$20,4,FALSE),\"DIV ???\"))))","v":0},{"$f":"IF(ISERROR(VLOOKUP(D4,Final!$AF$4:$AI$35,4,FALSE)),\"\",VLOOKUP(D4,Final!$AF$4:$AI$35,4,FALSE))","v":""},null,null,{"$f":"IF(ISNA(VLOOKUP(D4,Inscrits!B:E,3,FALSE)),\"\",VLOOKUP(D4,Inscrits!B:E,3,FALSE))","v":""},{"$f":"IF(ISNA(VLOOKUP(D4,Inscrits!B:E,4,FALSE)),\"\",VLOOKUP(D4,Inscrits!B:E,4,FALSE))","v":""},{"$f":"IF(ISNA(VLOOKUP(D4,Inscrits!B:E,5,FALSE)),\"\",VLOOKUP(D4,Inscrits!B:E,5,FALSE))","v":""},{"$f":"IF(NB_JOUEURS_UP>2,IF(LEN(Division)=2,\"R\"&RIGHT(Division,1)-1&\"\",IF(LEN(Division)=3,IF(RIGHT(LEFT(Division,2),1)=\"2\",\"R1\",IF(Nb_R2=1,\"R2\",\"R\"&RIGHT(LEFT(Division,2),1)-1&\"\"&RIGHT(Division,1)&\"\")),IF(LEN(Division)=4,IF(RIGHT(LEFT(Division,2),1)=\"2\",\"R1\",\"R\"&RIGHT(LEFT(Division,2),1)-1&\"\"&RIGHT(LEFT(Division,3),1)&\"\"),\"?\"))),Division)","v":"R1"}]
[null,null,3,{"$f":"IF(Final!L12=\"A\",Final!J12,IF(Final!L6=\"A\",Final!J6,IF(Final!L6<Final!L12,Final!J6,Final!J12)))","v":""},null,{"$f":"IF(ISNA(IF(LEFT(Division,2)=\"R1\",VLOOKUP(E5,Points!$A$2:$D$20,2,FALSE),IF(LEFT(Division,2)=\"R2\",VLOOKUP(E5,Points!$A$2:$D$20,3,FALSE),IF(LEFT(Division,2)=\"R3\",VLOOKUP(E5,Points!$A$2:$D$20,4,FALSE),\"DIV ???\")))),0,IF(LEFT(Division,2)=\"R1\",VLOOKUP(E5,Points!$A$2:$D$20,2,FALSE),IF(LEFT(Division,2)=\"R2\",VLOOKUP(E5,Points!$A$2:$D$20,3,FALSE),IF(LEFT(Division,2)=\"R3\",VLOOKUP(E5,Points!$A$2:$D$20,4,FALSE),\"DIV ???\"))))","v":0},{"$f":"IF(ISERROR(VLOOKUP(D5,Final!$AF$4:$AI$35,4,FALSE)),\"\",VLOOKUP(D5,Final!$AF$4:$AI$35,4,FALSE))","v":""},null,null,{"$f":"IF(ISNA(VLOOKUP(D5,Inscrits!B:E,3,FALSE)),\"\",VLOOKUP(D5,Inscrits!B:E,3,FALSE))","v":""},{"$f":"IF(ISNA(VLOOKUP(D5,Inscrits!B:E,4,FALSE)),\"\",VLOOKUP(D5,Inscrits!B:E,4,FALSE))","v":""},{"$f":"IF(ISNA(VLOOKUP(D5,Inscrits!B:E,5,FALSE)),\"\",VLOOKUP(D5,Inscrits!B:E,5,FALSE))","v":""},{"$f":"IF(NB_JOUEURS_UP>3,IF(LEN(Division)=2,\"R\"&RIGHT(Division,1)-1&\"\",IF(LEN(Division)=3,IF(RIGHT(LEFT(Division,2),1)=\"2\",\"R1\",IF(Nb_R2=1,\"R2\",\"R\"&RIGHT(LEFT(Division,2),1)-1&\"\"&RIGHT(Division,1)&\"\")),IF(LEN(Division)=4,IF(RIGHT(LEFT(Division,2),1)=\"2\",\"R1\",\"R\"&RIGHT(LEFT(Division,2),1)-1&\"\"&RIGHT(LEFT(Division,3),1)&\"\"),\"?\"))),Division)","v":"R1"}]
[null,null,5,{"$f":"IF(Final!H7=\"A\",Final!F7,IF(Final!H5=\"A\",Final!F5,IF(Final!H5<Final!H7,Final!F5,Final!F7)))","v":""},null,{"$f":"IF(ISNA(IF(LEFT(Division,2)=\"R1\",VLOOKUP(E6,Points!$A$2:$D$20,2,FALSE),IF(LEFT(Division,2)=\"R2\",VLOOKUP(E6,Points!$A$2:$D$20,3,FALSE),IF(LEFT(Division,2)=\"R3\",VLOOKUP(E6,Points!$A$2:$D$20,4,FALSE),\"DIV ???\")))),0,IF(LEFT(Division,2)=\"R1\",VLOOKUP(E6,Points!$A$2:$D$20,2,FALSE),IF(LEFT(Division,2)=\"R2\",VLOOKUP(E6,Points!$A$2:$D$20,3,FALSE),IF(LEFT(Division,2)=\"R3\",VLOOKUP(E6,Points!$A$2:$D$20,4,FALSE),\"DIV ???\"))))","v":0},{"$f":"IF(ISERROR(VLOOKUP(D6,Final!$AF$4:$AI$35,4,FALSE)),\"\",VLOOKUP(D6,Final!$AF$4:$AI$35,4,FALSE))","v":""},null,null,{"$f":"IF(ISNA(VLOOKUP(D6,Inscrits!B:E,3,FALSE)),\"\",VLOOKUP(D6,Inscrits!B:E,3,FALSE))","v":""},{"$f":"IF(ISNA(VLOOKUP(D6,Inscrits!B:E,4,FALSE)),\"\",VLOOKUP(D6,Inscrits!B:E,4,FALSE))","v":""},{"$f":"IF(ISNA(VLOOKUP(D6,Inscrits!B:E,5,FALSE)),\"\",VLOOKUP(D6,Inscrits!B:E,5,FALSE))","v":""},{"$f":"IF(NB_JOUEURS_UP>4,IF(LEN(Division)=2,\"R\"&RIGHT(Division,1)-1&\"\",IF(LEN(Division)=3,IF(RIGHT(LEFT(Division,2),1)=\"2\",\"R1\",IF(Nb_R2=1,\"R2\",\"R\"&RIGHT(LEFT(Division,2),1)-1&\"\"&RIGHT(Division,1)&\"\")),IF(LEN(Division)=4,IF(RIGHT(LEFT(Division,2),1)=\"2\",\"R1\",\"R\"&RIGHT(LEFT(Division,2),1)-1&\"\"&RIGHT(LEFT(Division,3),1)&\"\"),\"?\"))),Division)","v":"R1"}]
{"$rows_left_out":11}