{"text_format":"1","workbook":"xlsx","n_sheets":9,"sheets":["Points","Accueil","Inscrits","1","2","3","4","Final","Classement"],"not_rendered":{"charts":0,"images":1,"macros":1,"external_links":0,"defined_names":66,"comments":5,"pivot_tables":0},"unopened":[],"bounds":{"document_bytes":16777216,"sheet_cells":100000,"rows_first":2000,"rows_last":500,"rows_between":2000,"halvings":0,"cell_chars":16384,"cell_head_chars":4096},"cells_cut":0,"cells_raw":0,"read":"whole","date_system":"1900"}

{"sheet":"Points","index":0,"n_rows":36,"n_cols":4,"rows_kept":36,"cut":false,"hidden":false,"merged":[]}
["Place","R1","D2","D3"]
[1,200,200,200]
[2,180,180,180]
[3,161,161,161]
[4,161,161,161]
[5,143,143,143]
[6,143,143,143]
[7,143,143,143]
[8,143,143,143]
[9,126,126,126]
[10,126,126,126]
[11,126,126,126]
[12,126,126,126]
[13,126,126,126]
[14,126,126,126]
[15,126,126,126]
[16,126,126,126]
[17,110,110,110]
[18,110,110,110]
[19,110,110,110]
[20,110,110,110]
[21,110,110,110]
[22,110,110,110]
[23,110,110,110]
[24,110,110,110]
[25,95,95,95]
[26,95,95,95]
[27,95,95,95]
[28,95,95,95]
[29,95,95,95]
[30,95,95,95]
[31,95,95,95]
[32,95,95,95]
["FNE",-100,-100,-100]
["FE",0,0,0]
["A",0,0,0]

{"sheet":"Accueil","index":1,"n_rows":128,"n_cols":7,"rows_kept":128,"cut":false,"hidden":false,"merged":[[1,2,1,6],[24,3,24,6],[25,3,25,6],[15,2,15,6]]}
["A"]
["F",null,"INFOS UTILES POUR CE TOURNOI"]
[0]
[1,null,"Ligue","Auvergne-Rhône-Alpes",null,"SAISON","2017/2018"]
[2]
[3,null,"DATE","2017-11-26",null,"TOURNOI","N°1"]
[4]
[5,null,"CLUB","Nigth Billard Club",null,"DIVISION","R1"]
["A"]
["F",null,"VILLE DU CLUB","Beauregard",null,"NB JOUEURS",21]
[0]
[1,null,"Nombre de joueurs\nMontants de Division",0]
[2]
[{"$f":"IF(G18=3,3,\"\")","v":3},null,"Nombre de joueurs\nDescendants de Division",0,null,"Nombre de Billards\n8 Pool",5]
["A"]
[0,null,"DISTANCES DES MATCHS"]
[1]
[3,null,"Nb Parties Gagnantes\ndans les Poules\n(côté gagnant)",3,null,"Nb Parties Gagnantes\ndans les Poules\n(côté perdant)",3]
[4]
[{"$f":"IF(D20=4,4,\"\")","v":4},null,"Nb Parties Gagnantes\nen 1/8 de finale",4,null,"Nb Parties Gagnantes\nen 1/4 de finale",4]
[]
["A",null,"Nb Parties Gagnantes\nen 1/2 de finale",4,null,"Nb Parties Gagnantes\nen Finale",5]
[0]
[1]
[2,null,"Nom du fichier des Licenciés","Championnat FFB avec R3.xls"]
[3,null,"Chemin du fichier Licenciés","E:\\FFB\\Logiciel\\Championnat FFB avec R3.xls"]
[{"$f":"IF(G20=4,4,\"\")","v":4}]
[]
["A"]
[0]
[1]
[2]
[3]
[{"$f":"IF(D22=4,4,\"\")","v":4}]
[]
["A"]
[0]
[1]
[2]
[3]
[{"$f":"IF(G22>3,4,\"\")","v":4}]
[{"$f":"IF(G22=5,5,\"\")","v":5}]
[]
[1]
[2]
[3]
[4]
[5]
[6]
[7]
[8]
[9]
[10]
[11]
[12]
[13]
[14]
[15]
[16]
[17]
[18]
[19]
[20]
[21]
[22]
[23]
[24]
["A"]
["B"]
["C"]
["D"]
["E"]
["F"]
["G"]
["H"]
["I"]
["J"]
["K"]
["L"]
["M"]
["N"]
["O"]
["P"]
["Q"]
[]
[]
[]
[]
[]
[]
[]
[]
[]
[]
[]
[]
[]
[]
[]
[]
[]
[]
[]
[]
[]
[]
[]
[]
[]
[]
[]
[]
[]
[]
[]
[]
[]
[]
[]
[]
[]
[]
[]
[]
[]
[]
[]
["DAMIENFFB8POOL"]

{"sheet":"Inscrits","index":2,"n_rows":34,"n_cols":12,"rows_kept":34,"cut":false,"hidden":false,"merged":[[0,11,1,11],[8,11,9,11],[16,11,18,11],[25,11,26,11]]}
["N° Tirage","Nom du Joueur","Classement","Club","N° Licence","Forfait\nNon Excusé","Forfait\nExcusé","Abandon",1,"X",null,1]
[1,"TEBBANI AZIZ",1,"Night Billard Club","128999N","-","-","-",2,"-"]
[2,"BACCAM BOUNLIENG",2,"Night Billard Club","137597F","-","-","-",3]
[3,"REDON VALERIE",3,"Night Billard Club","152167Z","-","-","-",4]
[4,"PARDO RAMON",4,"Night Billard Club","158398X","-","-","-",5]
[5,"VAPILLON DANIEL",5,"Night Billard Club","152287E","-","-","-",6]
[6,"BRENDEL CHRISTIAN",7,"Billard Club de Bourg en Bresse","135920S","-","-","-",7]
[7,"MANDY NATHALIE",8,"Billard Club de Bourg en Bresse","135919R","-","-","-",8]
[8,"KLEIN STEPHANE",9,"Night Billard Club","148984P","-","-","-",9,null,null,2]
[9,"HERRY MIREILLE",10,"Night Billard Club","152190Z","-","-","-",10]
[10,"MOREL SYLVAIN",11,"Night Billard Club","152633F","-","-","-",11]
[11,"ROZIER MYRIAM",12,"Night Billard Club","156252P","-","-","-",12]
[12,"NOCERA GIUSEPPE",13,"Night Billard Club","153712D","-","-","-",13]
[13,"MIRTO EVELYNE",15,"Night Billard Club","156415R","-","-","-",14]
[14,"BOBROSKY BERNARD",17,"Night Billard Club","156618M","-","-","-",15]
[15,"LE GOFF THIERRY",18,"Night Billard Club","160236V","-","-","-",16]
[16,"BRUNET MAURICE",26,"Billard Club de Bourg en Bresse","156980F","-","-","-",17,null,null,"OU"]
[17,"CHAIR MOURAD","NC","Night Billard Club","148985Q","-","-","-",18]
[18,"DI BELLA STEPHANIE","NC","Night Billard Club","155784F","-","-","-",19]
[19,"LACROIX VALERIE","NC","Night Billard Club","152915M","-","-","-",20]
[20,"SOPIC NICOLAS","NC","Night Billard Club","128998M","-","-","-",21]
[21,"LAPIERRE ERIC","NC","Night Billard Club","152189Y","-","-","-",22]
[22,"Blanc 1","NC",null,null,"-","-","-",23]
[23,"Blanc 2","NC",null,null,"-","-","-",24]
[24,"Blanc 3","NC",null,null,"-","-","-"]
[null,null,null,null,null,null,null,null,null,null,null,3]
[null,null,{"$f":"IF(B27=\"\",\"\",VLOOKUP(B27,#REF!,3,FALSE))","v":""}]
[null,null,{"$f":"IF(B28=\"\",\"\",VLOOKUP(B28,#REF!,3,FALSE))","v":""}]
[null,null,{"$f":"IF(B29=\"\",\"\",VLOOKUP(B29,#REF!,3,FALSE))","v":""}]
[null,null,{"$f":"IF(B30=\"\",\"\",VLOOKUP(B30,#REF!,3,FALSE))","v":""}]
[null,null,{"$f":"IF(B31=\"\",\"\",VLOOKUP(B31,#REF!,3,FALSE))","v":""}]
[null,null,{"$f":"IF(B32=\"\",\"\",VLOOKUP(B32,#REF!,3,FALSE))","v":""}]
[null,null,{"$f":"IF(B33=\"\",\"\",VLOOKUP(B33,#REF!,3,FALSE))","v":""}]
[null,null,{"$f":"IF(B34=\"\",\"\",VLOOKUP(B34,#REF!,3,FALSE))","v":""}]

{"sheet":"1","index":3,"n_rows":21,"n_cols":45,"rows_kept":21,"cut":false,"hidden":false,"merged":[[20,9,20,17],[12,1,12,2],[0,9,0,17],[1,42,1,45],[11,42,11,45],[10,20,10,21]]}
[null,null,null,null,null,null,null,null,null,"MATCHS EN 3 PARTIES GAGNANTES"]
[null,null,null,null,null,null,null,null,null,null,null,null,null,null,null,null,null,null,null,null,null,null,null,null,null,null,null,null,null,null,null,null,null,null,null,null,null,null,null,null,null,null,"QUALIFIES"]
[null,null,null,null,null,null,null,null,null,null,"P1",1,{"$f":"IF(IF(ISNA(VLOOKUP(L3,Inscrits!$A$2:$C$25,2,FALSE)),\"\",VLOOKUP(L3,Inscrits!$A$2:$C$25,2,FALSE))=0,\"\",IF(ISNA(VLOOKUP(L3,Inscrits!$A$2:$C$25,2,FALSE)),\"\",VLOOKUP(L3,Inscrits!$A$2:$C$25,2,FALSE)))","v":"TEBBANI AZIZ"},{"$f":"IF(IF(ISNA(VLOOKUP(L3,Inscrits!$A$2:$C$25,3,FALSE)),\"\",\"(\"&(VLOOKUP(L3,Inscrits!$A$2:$C$25,3,FALSE))&\")\")=\"()\",\"\",IF(ISNA(VLOOKUP(L3,Inscrits!$A$2:$C$25,3,FALSE)),\"\",\"(\"&(VLOOKUP(L3,Inscrits!$A$2:$C$25,3,FALSE))&\")\"))","v":"(1)"},null,null,"G1",null,null,null,null,null,null,null,null,null,null,null,"G","P","G","P","G","P","G","P","G","P","G","P","Ga",null,null,"NOM","Ga"]
[null,null,null,null,null,null,null,null,null,null,null,null,"Match 1 - Billard",null,null,null,{"$f":"M3","v":"TEBBANI AZIZ"},{"$f":"N3","v":"(1)"},null,null,null,null,null,null,1,{"$f":"IF(U6=\"\",\"\",IF(U6=Q4,Q4,Q8))","v":""},null,{"$f":"M3","v":"TEBBANI AZIZ"},{"$f":"IF(AB4=M3,IF(O5=\"F\",\"\",O3),0)","v":0},{"$f":"IF(AB4=M3,IF(O3=\"F\",\"\",O5),0)","v":0},{"$f":"IF(AB4=Q4,IF(S8=\"F\",\"\",S4),0)","v":0},{"$f":"IF(AB4=Q4,IF(S4=\"F\",\"\",S8),0)","v":0},{"$f":"IF(AB4=J4,IF(I8=\"F\",\"\",I4),0)","v":0},{"$f":"IF(AB4=J4,IF(I4=\"F\",\"\",I8),0)","v":0},{"$f":"IF(AB4=F6,IF(E10=\"F\",\"\",E6),0)","v":0},{"$f":"IF(AB4=F6,IF(E6=\"F\",\"\",E10),0)","v":0},{"$f":"IF(AB4=F20,IF(E16=\"F\",\"\",E20),0)","v":0},{"$f":"IF(AB4=F20,IF(E20=\"F\",\"\",E16),0)","v":0},{"$f":"SUM(AC4,AE4,AG4,AI4,AK4)","v":0},0,{"$f":"AM4-AN4","v":0},null,null,{"$f":"Z4","v":""},{"$f":"IF(AR4=\"\",\"\",(VLOOKUP(AR4,AB4:AO17,14,FALSE)))","v":""}]
[null,null,null,null,null,null,"G7",null,null,null,null,null,null,null,null,null,null,null,null,null,"G5",null,null,null,3,{"$f":"IF(B8=\"\",\"\",IF(B8=F6,F6,F10))","v":""},null,{"$f":"M5","v":0},{"$f":"IF(AB5=M5,IF(O3=\"F\",\"\",O5),0)","v":0},{"$f":"IF(AB5=M5,IF(O5=\"F\",\"\",O3),0)","v":0},{"$f":"IF(AB5=Q4,IF(S8=\"F\",\"\",S4),0)","v":0},{"$f":"IF(AB5=Q4,IF(S4=\"F\",\"\",S8),0)","v":0},{"$f":"IF(AB5=J4,IF(I8=\"F\",\"\",I4),0)","v":0},{"$f":"IF(AB5=J4,IF(I4=\"F\",\"\",I8),0)","v":0},{"$f":"IF(AB5=F6,IF(E10=\"F\",\"\",E6),0)","v":0},{"$f":"IF(AB5=F6,IF(E6=\"F\",\"\",E10),0)","v":0},{"$f":"IF(AB5=F20,IF(E16=\"F\",\"\",E20),0)","v":0},{"$f":"IF(AB5=F20,IF(E20=\"F\",\"\",E16),0)","v":0},0,0,{"$f":"AM5-AN5","v":0},null,null,{"$f":"Z14","v":""},{"$f":"IF(AR5=\"\",\"\",(VLOOKUP(AR5,AB4:AO17,14,FALSE)))","v":""}]
[null,null,null,null,null,{"$f":"J8","v":""},{"$f":"K8","v":""},null,null,"Match 7 - Billard",null,null,null,null,null,null,"Match 5 - Billard",null,null,null,{"$f":"IF(OR(S4=\"F\",S4=\"A\"),Q8,IF(OR(S8=\"F\",S8=\"A\"),Q4,IF(S4=S8,\"\",(IF(S4>S8,Q4,Q8)))))","v":""},{"$f":"IF(OR(S4=\"F\",S4=\"A\"),R8,IF(OR(S8=\"F\",S8=\"A\"),R4,IF(S4=S8,\"\",(IF(S4>S8,R4,R8)))))","v":""},"A",null,5,{"$f":"IF(B8=\"\",\"\",IF(B8=F6,F10,F6))","v":""},null,{"$f":"M7","v":"CHAIR MOURAD"},{"$f":"IF(AB6=M7,IF(O9=\"F\",\"\",O7),0)","v":0},{"$f":"IF(AB6=M7,IF(O7=\"F\",\"\",O9),0)","v":0},{"$f":"IF(AB6=Q8,IF(S4=\"F\",\"\",S8),0)","v":0},{"$f":"IF(AB6=Q8,IF(S8=\"F\",\"\",S4),0)","v":0},{"$f":"IF(AB6=J8,IF(I4=\"F\",\"\",I8),0)","v":0},{"$f":"IF(AB6=J8,IF(I8=\"F\",\"\",I4),0)","v":0},{"$f":"IF(AB6=F6,IF(E10=\"F\",\"\",E6),0)","v":0},{"$f":"IF(AB6=F6,IF(E6=\"F\",\"\",E10),0)","v":0},{"$f":"IF(AB6=F20,IF(E16=\"F\",\"\",E20),0)","v":0},{"$f":"IF(AB6=F20,IF(E20=\"F\",\"\",E16),0)","v":0},0,0,{"$f":"AM6-AN6","v":0},null,null,{"$f":"Z5","v":""},{"$f":"IF(AR6=\"\",\"\",(VLOOKUP(AR6,AB4:AO17,14,FALSE)))","v":""}]
[null,null,"G9",null,null,null,null,null,null,null,null,17,{"$f":"IF(IF(ISNA(VLOOKUP(L7,Inscrits!$A$2:$C$25,2,FALSE)),\"\",VLOOKUP(L7,Inscrits!$A$2:$C$25,2,FALSE))=0,\"\",IF(ISNA(VLOOKUP(L7,Inscrits!$A$2:$C$25,2,FALSE)),\"\",VLOOKUP(L7,Inscrits!$A$2:$C$25,2,FALSE)))","v":"CHAIR MOURAD"},{"$f":"IF(IF(ISNA(VLOOKUP(L7,Inscrits!$A$2:$C$25,3,FALSE)),\"\",\"(\"&(VLOOKUP(L7,Inscrits!$A$2:$C$25,3,FALSE))&\")\")=\"()\",\"\",IF(ISNA(VLOOKUP(L7,Inscrits!$A$2:$C$25,3,FALSE)),\"\",\"(\"&(VLOOKUP(L7,Inscrits!$A$2:$C$25,3,FALSE))&\")\"))","v":"(NC)"},null,null,null,null,null,null,null,null,null,null,7,{"$f":"IF(F6=\"\",\"\",IF(F6=J4,J8,J4))","v":""},null,{"$f":"M9","v":"BRUNET MAURICE"},{"$f":"IF(AB7=M9,IF(O7=\"F\",\"\",O9),0)","v":0},{"$f":"IF(AB7=M9,IF(O9=\"F\",\"\",O7),0)","v":0},{"$f":"IF(AB7=Q8,IF(S4=\"F\",\"\",S8),0)","v":0},{"$f":"IF(AB7=Q8,IF(S8=\"F\",\"\",S4),0)","v":0},{"$f":"IF(AB7=J8,IF(I4=\"F\",\"\",I8),0)","v":0},{"$f":"IF(AB7=J8,IF(I8=\"F\",\"\",I4),0)","v":0},{"$f":"IF(AB7=F6,IF(E10=\"F\",\"\",E6),0)","v":0},{"$f":"IF(AB7=F6,IF(E6=\"F\",\"\",E10),0)","v":0},{"$f":"IF(AB7=F20,IF(E16=\"F\",\"\",E20),0)","v":0},{"$f":"IF(AB7=F20,IF(E20=\"F\",\"\",E16),0)","v":0},0,0,{"$f":"AM7-AN7","v":0},null,null,{"$f":"Z15","v":""},{"$f":"IF(AR7=\"\",\"\",(VLOOKUP(AR7,AB4:AO17,14,FALSE)))","v":""}]
["S",{"$f":"IF(OR(E6=\"F\",E6=\"A\"),F10,IF(OR(E10=\"F\",E10=\"A\"),F6,IF(E6=E10,\"\",(IF(E6>E10,F6,F10)))))","v":""},{"$f":"IF(OR(E6=\"F\",E6=\"A\"),G10,IF(OR(E10=\"F\",E10=\"A\"),G6,IF(E6=E10,\"\",(IF(E6>E10,G6,G10)))))","v":""},null,null,"Match 9 - Billard",null,null,null,{"$f":"IF(OR(AND(O7=\"F\",O9=\"F\"),AND(O7=\"A\",O9=\"A\")),M9,IF(OR(O7=\"F\",O7=\"A\"),M7,IF(OR(O9=\"F\",O9=\"A\"),M9,IF(O7=O9,\"\",(IF(O7<O9,M7,M9))))))","v":""},{"$f":"IF(OR(AND(O7=\"F\",O9=\"F\"),AND(O7=\"A\",O9=\"A\")),N9,IF(OR(O7=\"F\",O7=\"A\"),N7,IF(OR(O9=\"F\",O9=\"A\"),N9,IF(O7=O9,\"\",(IF(O7<O9,N7,N9))))))","v":""},null,"Match 2 - Billard",null,null,null,{"$f":"IF(OR(AND(O7=\"F\",O9=\"F\"),AND(O7=\"A\",O9=\"A\")),M7,IF(OR(O7=\"F\",O7=\"A\"),M9,IF(OR(O9=\"F\",O9=\"A\"),M7,IF(O7=O9,\"\",(IF(O7>O9,M7,M9))))))","v":""},{"$f":"IF(OR(AND(O7=\"F\",O9=\"F\"),AND(O7=\"A\",O9=\"A\")),N7,IF(OR(O7=\"F\",O7=\"A\"),N9,IF(OR(O9=\"F\",O9=\"A\"),N7,IF(O7=O9,\"\",(IF(O7>O9,N7,N9))))))","v":""}]
[null,null,null,null,null,null,null,null,null,null,"P2",16,{"$f":"IF(IF(ISNA(VLOOKUP(L9,Inscrits!$A$2:$C$25,2,FALSE)),\"\",VLOOKUP(L9,Inscrits!$A$2:$C$25,2,FALSE))=0,\"\",IF(ISNA(VLOOKUP(L9,Inscrits!$A$2:$C$25,2,FALSE)),\"\",VLOOKUP(L9,Inscrits!$A$2:$C$25,2,FALSE)))","v":"BRUNET MAURICE"},{"$f":"IF(IF(ISNA(VLOOKUP(L9,Inscrits!$A$2:$C$25,3,FALSE)),\"\",\"(\"&(VLOOKUP(L9,Inscrits!$A$2:$C$25,3,FALSE))&\")\")=\"()\",\"\",IF(ISNA(VLOOKUP(L9,Inscrits!$A$2:$C$25,3,FALSE)),\"\",\"(\"&(VLOOKUP(L9,Inscrits!$A$2:$C$25,3,FALSE))&\")\"))","v":"(26)"},null,null,"G2"]
[null,null,null,null,null,{"$f":"IF(OR(S14=\"F\",S14=\"A\"),Q14,IF(OR(S18=\"F\",S18=\"A\"),Q18,IF(S14=S18,\"\",(IF(S14<S18,Q14,Q18)))))","v":""},{"$f":"IF(OR(S14=\"F\",S14=\"A\"),R14,IF(OR(S18=\"F\",S18=\"A\"),R18,IF(S14=S18,\"\",(IF(S14<S18,R14,R18)))))","v":""}]
[null,null,null,null,null,null,"P6",null,null,null,null,null,null,null,null,null,null,null,null,null,"QUALIFIES"]
[null,null,null,null,null,null,null,null,null,null,null,null,null,null,null,null,null,null,null,null,null,null,null,null,null,null,null,null,null,null,null,null,null,null,null,null,null,null,null,null,null,null,"ELIMINES"]
[null,"QUALIFIES",null,null,null,null,null,null,null,null,"P3",9,{"$f":"IF(IF(ISNA(VLOOKUP(L13,Inscrits!$A$2:$C$25,2,FALSE)),\"\",VLOOKUP(L13,Inscrits!$A$2:$C$25,2,FALSE))=0,\"\",IF(ISNA(VLOOKUP(L13,Inscrits!$A$2:$C$25,2,FALSE)),\"\",VLOOKUP(L13,Inscrits!$A$2:$C$25,2,FALSE)))","v":"HERRY MIREILLE"},{"$f":"IF(IF(ISNA(VLOOKUP(L13,Inscrits!$A$2:$C$25,3,FALSE)),\"\",\"(\"&(VLOOKUP(L13,Inscrits!$A$2:$C$25,3,FALSE))&\")\")=\"()\",\"\",IF(ISNA(VLOOKUP(L13,Inscrits!$A$2:$C$25,3,FALSE)),\"\",\"(\"&(VLOOKUP(L13,Inscrits!$A$2:$C$25,3,FALSE))&\")\"))","v":"(10)"},null,null,"G3",null,null,null,null,null,null,null,null,null,null,null,"G","P","G","P","G","P","G","P","G","P","G","P","Ga",null,null,"NOM","Ga"]
[null,null,null,null,null,null,null,null,null,{"$f":"IF(OR(AND(O13=\"F\",O15=\"F\"),AND(O13=\"A\",O15=\"A\")),M15,IF(OR(O13=\"F\",O13=\"A\"),M13,IF(OR(O15=\"F\",O15=\"A\"),M15,IF(O13=O15,\"\",(IF(O13<O15,M13,M15))))))","v":"Blanc 3"},{"$f":"IF(OR(AND(O13=\"F\",O15=\"F\"),AND(O13=\"A\",O15=\"A\")),N15,IF(OR(O13=\"F\",O13=\"A\"),N13,IF(OR(O15=\"F\",O15=\"A\"),N15,IF(O13=O15,\"\",(IF(O13<O15,N13,N15))))))","v":"(NC)"},null,"Match 3 - Billard",null,null,null,{"$f":"IF(OR(AND(O13=\"F\",O15=\"F\"),AND(O13=\"A\",O15=\"A\")),M13,IF(OR(O13=\"F\",O13=\"A\"),M15,IF(OR(O15=\"F\",O15=\"A\"),M13,IF(O13=O15,\"\",(IF(O13>O15,M13,M15))))))","v":"HERRY MIREILLE"},{"$f":"IF(OR(AND(O13=\"F\",O15=\"F\"),AND(O13=\"A\",O15=\"A\")),N13,IF(OR(O13=\"F\",O13=\"A\"),N15,IF(OR(O15=\"F\",O15=\"A\"),N13,IF(O13=O15,\"\",(IF(O13>O15,N13,N15))))))","v":"(10)"},null,null,null,null,null,null,2,{"$f":"IF(U16=\"\",\"\",IF(U16=Q14,Q14,Q18))","v":""},null,{"$f":"M13","v":"HERRY MIREILLE"},{"$f":"IF(AB14=M13,IF(O15=\"F\",\"\",O13),0)","v":""},{"$f":"IF(AB14=M13,IF(O13=\"F\",\"\",O15),0)","v":"F"},{"$f":"IF(AB14=Q14,IF(S18=\"F\",\"\",S14),0)","v":0},{"$f":"IF(AB14=Q14,IF(S14=\"F\",\"\",S18),0)","v":0},{"$f":"IF(AB14=J14,IF(I18=\"F\",\"\",I14),0)","v":0},{"$f":"IF(AB14=J14,IF(I14=\"F\",\"\",I18),0)","v":0},{"$f":"IF(AB14=F16,IF(E20=\"F\",\"\",E16),0)","v":0},{"$f":"IF(AB14=F16,IF(E16=\"F\",\"\",E20),0)","v":0},{"$f":"IF(AB14=F10,IF(E6=\"F\",\"\",E10),0)","v":0},{"$f":"IF(AB14=F10,IF(E10=\"F\",\"\",E6),0)","v":0},{"$f":"SUM(AC14,AE14,AG14,AI14,AK14)","v":0},0,{"$f":"AM14-AN14","v":0},null,null,{"$f":"Z6","v":""},{"$f":"IF(AR14=\"\",\"\",(VLOOKUP(AR14,AB4:AO17,14,FALSE)))","v":""}]
[null,null,null,null,null,null,"G8",null,null,null,null,24,{"$f":"IF(IF(ISNA(VLOOKUP(L15,Inscrits!$A$2:$C$25,2,FALSE)),\"\",VLOOKUP(L15,Inscrits!$A$2:$C$25,2,FALSE))=0,\"\",IF(ISNA(VLOOKUP(L15,Inscrits!$A$2:$C$25,2,FALSE)),\"\",VLOOKUP(L15,Inscrits!$A$2:$C$25,2,FALSE)))","v":"Blanc 3"},{"$f":"IF(IF(ISNA(VLOOKUP(L15,Inscrits!$A$2:$C$25,3,FALSE)),\"\",\"(\"&(VLOOKUP(L15,Inscrits!$A$2:$C$25,3,FALSE))&\")\")=\"()\",\"\",IF(ISNA(VLOOKUP(L15,Inscrits!$A$2:$C$25,3,FALSE)),\"\",\"(\"&(VLOOKUP(L15,Inscrits!$A$2:$C$25,3,FALSE))&\")\"))","v":"(NC)"},"F",null,null,null,null,null,"G6",null,null,null,4,{"$f":"IF(B18=\"\",\"\",IF(B18=F16,F16,F20))","v":""},null,{"$f":"M15","v":"Blanc 3"},{"$f":"IF(AB15=M15,IF(O13=\"F\",\"\",O15),0)","v":"F"},{"$f":"IF(AB15=M15,IF(O15=\"F\",\"\",O13),0)","v":""},{"$f":"IF(AB15=Q14,IF(S18=\"F\",\"\",S14),0)","v":0},{"$f":"IF(AB15=Q14,IF(S14=\"F\",\"\",S18),0)","v":0},{"$f":"IF(AB15=J14,IF(I18=\"F\",\"\",I14),0)","v":0},{"$f":"IF(AB15=J14,IF(I14=\"F\",\"\",I18),0)","v":0},{"$f":"IF(AB15=F16,IF(E20=\"F\",\"\",E16),0)","v":"F"},{"$f":"IF(AB15=F16,IF(E16=\"F\",\"\",E20),0)","v":""},{"$f":"IF(AB15=F10,IF(E6=\"F\",\"\",E10),0)","v":0},{"$f":"IF(AB15=F10,IF(E10=\"F\",\"\",E6),0)","v":0},0,0,{"$f":"AM15-AN15","v":0},null,null,{"$f":"Z16","v":""},{"$f":"IF(AR15=\"\",\"\",(VLOOKUP(AR15,AB4:AO17,14,FALSE)))","v":""}]
[null,null,null,null,"F",{"$f":"J14","v":"Blanc 3"},{"$f":"K14","v":"(NC)"},null,null,"Match 8 - Billard",null,null,null,null,null,null,"Match 6 - Billard",null,null,null,{"$f":"IF(OR(S14=\"F\",S14=\"A\"),Q18,IF(OR(S18=\"F\",S18=\"A\"),Q14,IF(S14=S18,\"\",(IF(S14>S18,Q14,Q18)))))","v":""},{"$f":"IF(OR(S14=\"F\",S14=\"A\"),R18,IF(OR(S18=\"F\",S18=\"A\"),R14,IF(S14=S18,\"\",(IF(S14>S18,R14,R18)))))","v":""},"B",null,6,{"$f":"IF(B18=\"\",\"\",IF(B18=F16,F20,F16))","v":""},null,{"$f":"M17","v":0},{"$f":"IF(AB16=M17,IF(O19=\"F\",\"\",O17),0)","v":0},{"$f":"IF(AB16=M17,IF(O17=\"F\",\"\",O19),0)","v":0},{"$f":"IF(AB16=Q18,IF(S14=\"F\",\"\",S18),0)","v":0},{"$f":"IF(AB16=Q18,IF(S18=\"F\",\"\",S14),0)","v":0},{"$f":"IF(AB16=J18,IF(I14=\"F\",\"\",I18),0)","v":0},{"$f":"IF(AB16=J18,IF(I18=\"F\",\"\",I14),0)","v":0},{"$f":"IF(AB16=F16,IF(E20=\"F\",\"\",E16),0)","v":0},{"$f":"IF(AB16=F16,IF(E16=\"F\",\"\",E20),0)","v":0},{"$f":"IF(AB16=F10,IF(E6=\"F\",\"\",E10),0)","v":0},{"$f":"IF(AB16=F10,IF(E10=\"F\",\"\",E6),0)","v":0},0,0,{"$f":"AM16-AN16","v":0}]
[null,null,"G10",null,null,null,null,null,null,null,null,null,null,null,null,null,null,null,null,null,null,null,null,null,8,{"$f":"IF(F16=\"\",\"\",IF(F16=J14,J18,J14))","v":0},null,{"$f":"M19","v":"KLEIN STEPHANE"},{"$f":"IF(AB17=M19,IF(O17=\"F\",\"\",O19),0)","v":0},{"$f":"IF(AB17=M19,IF(O19=\"F\",\"\",O17),0)","v":0},{"$f":"IF(AB17=Q18,IF(S14=\"F\",\"\",S18),0)","v":0},{"$f":"IF(AB17=Q18,IF(S18=\"F\",\"\",S14),0)","v":0},{"$f":"IF(AB17=J18,IF(I14=\"F\",\"\",I18),0)","v":0},{"$f":"IF(AB17=J18,IF(I18=\"F\",\"\",I14),0)","v":0},{"$f":"IF(AB17=F16,IF(E20=\"F\",\"\",E16),0)","v":0},{"$f":"IF(AB17=F16,IF(E16=\"F\",\"\",E20),0)","v":0},{"$f":"IF(AB17=F10,IF(E6=\"F\",\"\",E10),0)","v":0},{"$f":"IF(AB17=F10,IF(E10=\"F\",\"\",E6),0)","v":0},0,{"$f":"SUM(AD17,AF17,AH17,AJ17,AL17)","v":0},{"$f":"AM17-AN17","v":0}]
["T",{"$f":"IF(OR(E16=\"F\",E16=\"A\"),F20,IF(OR(E20=\"F\",E20=\"A\"),F16,IF(E16=E20,\"\",(IF(E16>E20,F16,F20)))))","v":""},{"$f":"IF(OR(E16=\"F\",E16=\"A\"),G20,IF(OR(E20=\"F\",E20=\"A\"),G16,IF(E16=E20,\"\",(IF(E16>E20,G16,G20)))))","v":""},null,null,"Match 10 - Billard",null,null,null,null,null,null,"Match 4 - Billard",null,null,null,{"$f":"M19","v":"KLEIN STEPHANE"},{"$f":"N19","v":"(9)"}]
[null,null,null,null,null,null,null,null,null,null,"P4",8,{"$f":"IF(IF(ISNA(VLOOKUP(L19,Inscrits!$A$2:$C$25,2,FALSE)),\"\",VLOOKUP(L19,Inscrits!$A$2:$C$25,2,FALSE))=0,\"\",IF(ISNA(VLOOKUP(L19,Inscrits!$A$2:$C$25,2,FALSE)),\"\",VLOOKUP(L19,Inscrits!$A$2:$C$25,2,FALSE)))","v":"KLEIN STEPHANE"},{"$f":"IF(IF(ISNA(VLOOKUP(L19,Inscrits!$A$2:$C$25,3,FALSE)),\"\",\"(\"&(VLOOKUP(L19,Inscrits!$A$2:$C$25,3,FALSE))&\")\")=\"()\",\"\",IF(ISNA(VLOOKUP(L19,Inscrits!$A$2:$C$25,3,FALSE)),\"\",\"(\"&(VLOOKUP(L19,Inscrits!$A$2:$C$25,3,FALSE))&\")\"))","v":"(9)"},null,null,"G4"]
[null,null,null,null,null,{"$f":"IF(OR(S4=\"F\",S4=\"A\"),Q4,IF(OR(S8=\"F\",S8=\"A\"),Q8,IF(S4=S8,\"\",(IF(S4<S8,Q4,Q8)))))","v":""},{"$f":"IF(OR(S4=\"F\",S4=\"A\"),R4,IF(OR(S8=\"F\",S8=\"A\"),R8,IF(S4=S8,\"\",(IF(S4<S8,R4,R8)))))","v":""}]
[null,null,null,null,null,null,"P5",null,null,{"$f":"IF(Accueil!G18=3,\"\",\"MATCHS EN 4 GAGNANTES COTE PERDANT\")","v":""}]

{"sheet":"2","index":4,"n_rows":21,"n_cols":45,"rows_kept":21,"cut":false,"hidden":false,"merged":[[1,42,1,45],[11,42,11,45],[20,9,20,17],[0,9,0,17],[12,1,12,2],[10,20,10,21]]}
[null,null,null,null,null,null,null,null,null,"MATCHS EN 3 PARTIES GAGNANTES"]
[null,null,null,null,null,null,null,null,null,null,null,null,null,null,null,null,null,null,null,null,null,null,null,null,null,null,null,null,null,null,null,null,null,null,null,null,null,null,null,null,null,null,"QUALIFIES"]
[null,null,null,null,null,null,null,null,null,null,"P1",5,{"$f":"IF(IF(ISNA(VLOOKUP(L3,Inscrits!$A$2:$C$25,2,FALSE)),\"\",VLOOKUP(L3,Inscrits!$A$2:$C$25,2,FALSE))=0,\"\",IF(ISNA(VLOOKUP(L3,Inscrits!$A$2:$C$25,2,FALSE)),\"\",VLOOKUP(L3,Inscrits!$A$2:$C$25,2,FALSE)))","v":"VAPILLON DANIEL"},{"$f":"IF(IF(ISNA(VLOOKUP(L3,Inscrits!$A$2:$C$25,3,FALSE)),\"\",\"(\"&(VLOOKUP(L3,Inscrits!$A$2:$C$25,3,FALSE))&\")\")=\"()\",\"\",IF(ISNA(VLOOKUP(L3,Inscrits!$A$2:$C$25,3,FALSE)),\"\",\"(\"&(VLOOKUP(L3,Inscrits!$A$2:$C$25,3,FALSE))&\")\"))","v":"(5)"},null,null,"G1",null,null,null,null,null,null,null,null,null,null,null,"G","P","G","P","G","P","G","P","G","P","G","P","Ga",null,null,"NOM","Ga"]
[null,null,null,null,null,null,null,null,null,null,null,null,"Match 1 - Billard",null,null,null,{"$f":"M3","v":"VAPILLON DANIEL"},{"$f":"N3","v":"(5)"},null,null,null,null,null,null,1,{"$f":"IF(U6=\"\",\"\",IF(U6=Q4,Q4,Q8))","v":""},null,{"$f":"M3","v":"VAPILLON DANIEL"},{"$f":"IF(AB4=M3,IF(O5=\"F\",\"\",O3),0)","v":0},{"$f":"IF(AB4=M3,IF(O3=\"F\",\"\",O5),0)","v":0},{"$f":"IF(AB4=Q4,IF(S8=\"F\",\"\",S4),0)","v":0},{"$f":"IF(AB4=Q4,IF(S4=\"F\",\"\",S8),0)","v":0},{"$f":"IF(AB4=J4,IF(I8=\"F\",\"\",I4),0)","v":0},{"$f":"IF(AB4=J4,IF(I4=\"F\",\"\",I8),0)","v":0},{"$f":"IF(AB4=F6,IF(E10=\"F\",\"\",E6),0)","v":0},{"$f":"IF(AB4=F6,IF(E6=\"F\",\"\",E10),0)","v":0},{"$f":"IF(AB4=F20,IF(E16=\"F\",\"\",E20),0)","v":0},{"$f":"IF(AB4=F20,IF(E20=\"F\",\"\",E16),0)","v":0},{"$f":"SUM(AC4,AE4,AG4,AI4,AK4)","v":0},0,{"$f":"AM4-AN4","v":0},null,null,{"$f":"Z4","v":""},{"$f":"IF(AR4=\"\",\"\",(VLOOKUP(AR4,AB4:AO17,14,FALSE)))","v":""}]
[null,null,null,null,null,null,"G7",null,null,null,null,null,null,null,null,null,null,null,null,null,"G5",null,null,null,3,{"$f":"IF(B8=\"\",\"\",IF(B8=F6,F6,F10))","v":""},null,{"$f":"M5","v":0},{"$f":"IF(AB5=M5,IF(O3=\"F\",\"\",O5),0)","v":0},{"$f":"IF(AB5=M5,IF(O5=\"F\",\"\",O3),0)","v":0},{"$f":"IF(AB5=Q4,IF(S8=\"F\",\"\",S4),0)","v":0},{"$f":"IF(AB5=Q4,IF(S4=\"F\",\"\",S8),0)","v":0},{"$f":"IF(AB5=J4,IF(I8=\"F\",\"\",I4),0)","v":0},{"$f":"IF(AB5=J4,IF(I4=\"F\",\"\",I8),0)","v":0},{"$f":"IF(AB5=F6,IF(E10=\"F\",\"\",E6),0)","v":0},{"$f":"IF(AB5=F6,IF(E6=\"F\",\"\",E10),0)","v":0},{"$f":"IF(AB5=F20,IF(E16=\"F\",\"\",E20),0)","v":0},{"$f":"IF(AB5=F20,IF(E20=\"F\",\"\",E16),0)","v":0},0,0,{"$f":"AM5-AN5","v":0},null,null,{"$f":"Z14","v":""},{"$f":"IF(AR5=\"\",\"\",(VLOOKUP(AR5,AB4:AO17,14,FALSE)))","v":""}]
[null,null,null,null,null,{"$f":"J8","v":""},{"$f":"K8","v":""},null,null,"Match 7 - Billard",null,null,null,null,null,null,"Match 5 - Billard",null,null,null,{"$f":"IF(OR(S4=\"F\",S4=\"A\"),Q8,IF(OR(S8=\"F\",S8=\"A\"),Q4,IF(S4=S8,\"\",(IF(S4>S8,Q4,Q8)))))","v":""},{"$f":"IF(OR(S4=\"F\",S4=\"A\"),R8,IF(OR(S8=\"F\",S8=\"A\"),R4,IF(S4=S8,\"\",(IF(S4>S8,R4,R8)))))","v":""},"C",null,5,{"$f":"IF(B8=\"\",\"\",IF(B8=F6,F10,F6))","v":""},null,{"$f":"M7","v":"LAPIERRE ERIC"},{"$f":"IF(AB6=M7,IF(O9=\"F\",\"\",O7),0)","v":0},{"$f":"IF(AB6=M7,IF(O7=\"F\",\"\",O9),0)","v":0},{"$f":"IF(AB6=Q8,IF(S4=\"F\",\"\",S8),0)","v":0},{"$f":"IF(AB6=Q8,IF(S8=\"F\",\"\",S4),0)","v":0},{"$f":"IF(AB6=J8,IF(I4=\"F\",\"\",I8),0)","v":0},{"$f":"IF(AB6=J8,IF(I8=\"F\",\"\",I4),0)","v":0},{"$f":"IF(AB6=F6,IF(E10=\"F\",\"\",E6),0)","v":0},{"$f":"IF(AB6=F6,IF(E6=\"F\",\"\",E10),0)","v":0},{"$f":"IF(AB6=F20,IF(E16=\"F\",\"\",E20),0)","v":0},{"$f":"IF(AB6=F20,IF(E20=\"F\",\"\",E16),0)","v":0},0,0,{"$f":"AM6-AN6","v":0},null,null,{"$f":"Z5","v":""},{"$f":"IF(AR6=\"\",\"\",(VLOOKUP(AR6,AB4:AO17,14,FALSE)))","v":""}]
[null,null,"G9",null,null,null,null,null,null,null,null,21,{"$f":"IF(IF(ISNA(VLOOKUP(L7,Inscrits!$A$2:$C$25,2,FALSE)),\"\",VLOOKUP(L7,Inscrits!$A$2:$C$25,2,FALSE))=0,\"\",IF(ISNA(VLOOKUP(L7,Inscrits!$A$2:$C$25,2,FALSE)),\"\",VLOOKUP(L7,Inscrits!$A$2:$C$25,2,FALSE)))","v":"LAPIERRE ERIC"},{"$f":"IF(IF(ISNA(VLOOKUP(L7,Inscrits!$A$2:$C$25,3,FALSE)),\"\",\"(\"&(VLOOKUP(L7,Inscrits!$A$2:$C$25,3,FALSE))&\")\")=\"()\",\"\",IF(ISNA(VLOOKUP(L7,Inscrits!$A$2:$C$25,3,FALSE)),\"\",\"(\"&(VLOOKUP(L7,Inscrits!$A$2:$C$25,3,FALSE))&\")\"))","v":"(NC)"},null,null,null,null,null,null,null,null,null,null,7,{"$f":"IF(F6=\"\",\"\",IF(F6=J4,J8,J4))","v":""},null,{"$f":"M9","v":"NOCERA GIUSEPPE"},{"$f":"IF(AB7=M9,IF(O7=\"F\",\"\",O9),0)","v":0},{"$f":"IF(AB7=M9,IF(O9=\"F\",\"\",O7),0)","v":0},{"$f":"IF(AB7=Q8,IF(S4=\"F\",\"\",S8),0)","v":0},{"$f":"IF(AB7=Q8,IF(S8=\"F\",\"\",S4),0)","v":0},{"$f":"IF(AB7=J8,IF(I4=\"F\",\"\",I8),0)","v":0},{"$f":"IF(AB7=J8,IF(I8=\"F\",\"\",I4),0)","v":0},{"$f":"IF(AB7=F6,IF(E10=\"F\",\"\",E6),0)","v":0},{"$f":"IF(AB7=F6,IF(E6=\"F\",\"\",E10),0)","v":0},{"$f":"IF(AB7=F20,IF(E16=\"F\",\"\",E20),0)","v":0},{"$f":"IF(AB7=F20,IF(E20=\"F\",\"\",E16),0)","v":0},0,0,{"$f":"AM7-AN7","v":0},null,null,{"$f":"Z15","v":""},{"$f":"IF(AR7=\"\",\"\",(VLOOKUP(AR7,AB4:AO17,14,FALSE)))","v":""}]
["U",{"$f":"IF(OR(E6=\"F\",E6=\"A\"),F10,IF(OR(E10=\"F\",E10=\"A\"),F6,IF(E6=E10,\"\",(IF(E6>E10,F6,F10)))))","v":""},{"$f":"IF(OR(E6=\"F\",E6=\"A\"),G10,IF(OR(E10=\"F\",E10=\"A\"),G6,IF(E6=E10,\"\",(IF(E6>E10,G6,G10)))))","v":""},null,null,"Match 9 - Billard",null,null,null,{"$f":"IF(OR(AND(O7=\"F\",O9=\"F\"),AND(O7=\"A\",O9=\"A\")),M9,IF(OR(O7=\"F\",O7=\"A\"),M7,IF(OR(O9=\"F\",O9=\"A\"),M9,IF(O7=O9,\"\",(IF(O7<O9,M7,M9))))))","v":""},{"$f":"IF(OR(AND(O7=\"F\",O9=\"F\"),AND(O7=\"A\",O9=\"A\")),N9,IF(OR(O7=\"F\",O7=\"A\"),N7,IF(OR(O9=\"F\",O9=\"A\"),N9,IF(O7=O9,\"\",(IF(O7<O9,N7,N9))))))","v":""},null,"Match 2 - Billard",null,null,null,{"$f":"IF(OR(AND(O7=\"F\",O9=\"F\"),AND(O7=\"A\",O9=\"A\")),M7,IF(OR(O7=\"F\",O7=\"A\"),M9,IF(OR(O9=\"F\",O9=\"A\"),M7,IF(O7=O9,\"\",(IF(O7>O9,M7,M9))))))","v":""},{"$f":"IF(OR(AND(O7=\"F\",O9=\"F\"),AND(O7=\"A\",O9=\"A\")),N7,IF(OR(O7=\"F\",O7=\"A\"),N9,IF(OR(O9=\"F\",O9=\"A\"),N7,IF(O7=O9,\"\",(IF(O7>O9,N7,N9))))))","v":""}]
[null,null,null,null,null,null,null,null,null,null,"P2",12,{"$f":"IF(IF(ISNA(VLOOKUP(L9,Inscrits!$A$2:$C$25,2,FALSE)),\"\",VLOOKUP(L9,Inscrits!$A$2:$C$25,2,FALSE))=0,\"\",IF(ISNA(VLOOKUP(L9,Inscrits!$A$2:$C$25,2,FALSE)),\"\",VLOOKUP(L9,Inscrits!$A$2:$C$25,2,FALSE)))","v":"NOCERA GIUSEPPE"},{"$f":"IF(IF(ISNA(VLOOKUP(L9,Inscrits!$A$2:$C$25,3,FALSE)),\"\",\"(\"&(VLOOKUP(L9,Inscrits!$A$2:$C$25,3,FALSE))&\")\")=\"()\",\"\",IF(ISNA(VLOOKUP(L9,Inscrits!$A$2:$C$25,3,FALSE)),\"\",\"(\"&(VLOOKUP(L9,Inscrits!$A$2:$C$25,3,FALSE))&\")\"))","v":"(13)"},null,null,"G2"]
[null,null,null,null,null,{"$f":"IF(OR(S14=\"F\",S14=\"A\"),Q14,IF(OR(S18=\"F\",S18=\"A\"),Q18,IF(S14=S18,\"\",(IF(S14<S18,Q14,Q18)))))","v":""},{"$f":"IF(OR(S14=\"F\",S14=\"A\"),R14,IF(OR(S18=\"F\",S18=\"A\"),R18,IF(S14=S18,\"\",(IF(S14<S18,R14,R18)))))","v":""}]
[null,null,null,null,null,null,"P6",null,null,null,null,null,null,null,null,null,null,null,null,null,"QUALIFIES"]
[null,null,null,null,null,null,null,null,null,null,null,null,null,null,null,null,null,null,null,null,null,null,null,null,null,null,null,null,null,null,null,null,null,null,null,null,null,null,null,null,null,null,"ELIMINES"]
[null,"QUALIFIES",null,null,null,null,null,null,null,null,"P3",13,{"$f":"IF(IF(ISNA(VLOOKUP(L13,Inscrits!$A$2:$C$25,2,FALSE)),\"\",VLOOKUP(L13,Inscrits!$A$2:$C$25,2,FALSE))=0,\"\",IF(ISNA(VLOOKUP(L13,Inscrits!$A$2:$C$25,2,FALSE)),\"\",VLOOKUP(L13,Inscrits!$A$2:$C$25,2,FALSE)))","v":"MIRTO EVELYNE"},{"$f":"IF(IF(ISNA(VLOOKUP(L13,Inscrits!$A$2:$C$25,3,FALSE)),\"\",\"(\"&(VLOOKUP(L13,Inscrits!$A$2:$C$25,3,FALSE))&\")\")=\"()\",\"\",IF(ISNA(VLOOKUP(L13,Inscrits!$A$2:$C$25,3,FALSE)),\"\",\"(\"&(VLOOKUP(L13,Inscrits!$A$2:$C$25,3,FALSE))&\")\"))","v":"(15)"},null,null,"G3",null,null,null,null,null,null,null,null,null,null,null,"G","P","G","P","G","P","G","P","G","P","G","P","Ga",null,null,"NOM","Ga"]
[null,null,null,null,null,null,null,null,null,{"$f":"IF(OR(AND(O13=\"F\",O15=\"F\"),AND(O13=\"A\",O15=\"A\")),M15,IF(OR(O13=\"F\",O13=\"A\"),M13,IF(OR(O15=\"F\",O15=\"A\"),M15,IF(O13=O15,\"\",(IF(O13<O15,M13,M15))))))","v":""},{"$f":"IF(OR(AND(O13=\"F\",O15=\"F\"),AND(O13=\"A\",O15=\"A\")),N15,IF(OR(O13=\"F\",O13=\"A\"),N13,IF(OR(O15=\"F\",O15=\"A\"),N15,IF(O13=O15,\"\",(IF(O13<O15,N13,N15))))))","v":""},null,"Match 3 - Billard",null,null,null,{"$f":"IF(OR(AND(O13=\"F\",O15=\"F\"),AND(O13=\"A\",O15=\"A\")),M13,IF(OR(O13=\"F\",O13=\"A\"),M15,IF(OR(O15=\"F\",O15=\"A\"),M13,IF(O13=O15,\"\",(IF(O13>O15,M13,M15))))))","v":""},{"$f":"IF(OR(AND(O13=\"F\",O15=\"F\"),AND(O13=\"A\",O15=\"A\")),N13,IF(OR(O13=\"F\",O13=\"A\"),N15,IF(OR(O15=\"F\",O15=\"A\"),N13,IF(O13=O15,\"\",(IF(O13>O15,N13,N15))))))","v":""},null,null,null,null,null,null,2,{"$f":"IF(U16=\"\",\"\",IF(U16=Q14,Q14,Q18))","v":""},null,{"$f":"M13","v":"MIRTO EVELYNE"},{"$f":"IF(AB14=M13,IF(O15=\"F\",\"\",O13),0)","v":0},{"$f":"IF(AB14=M13,IF(O13=\"F\",\"\",O15),0)","v":0},{"$f":"IF(AB14=Q14,IF(S18=\"F\",\"\",S14),0)","v":0},{"$f":"IF(AB14=Q14,IF(S14=\"F\",\"\",S18),0)","v":0},{"$f":"IF(AB14=J14,IF(I18=\"F\",\"\",I14),0)","v":0},{"$f":"IF(AB14=J14,IF(I14=\"F\",\"\",I18),0)","v":0},{"$f":"IF(AB14=F16,IF(E20=\"F\",\"\",E16),0)","v":0},{"$f":"IF(AB14=F16,IF(E16=\"F\",\"\",E20),0)","v":0},{"$f":"IF(AB14=F10,IF(E6=\"F\",\"\",E10),0)","v":0},{"$f":"IF(AB14=F10,IF(E10=\"F\",\"\",E6),0)","v":0},{"$f":"SUM(AC14,AE14,AG14,AI14,AK14)","v":0},0,{"$f":"AM14-AN14","v":0},null,null,{"$f":"Z6","v":""},{"$f":"IF(AR14=\"\",\"\",(VLOOKUP(AR14,AB4:AO17,14,FALSE)))","v":""}]
[null,null,null,null,null,null,"G8",null,null,null,null,20,{"$f":"IF(IF(ISNA(VLOOKUP(L15,Inscrits!$A$2:$C$25,2,FALSE)),\"\",VLOOKUP(L15,Inscrits!$A$2:$C$25,2,FALSE))=0,\"\",IF(ISNA(VLOOKUP(L15,Inscrits!$A$2:$C$25,2,FALSE)),\"\",VLOOKUP(L15,Inscrits!$A$2:$C$25,2,FALSE)))","v":"SOPIC NICOLAS"},{"$f":"IF(IF(ISNA(VLOOKUP(L15,Inscrits!$A$2:$C$25,3,FALSE)),\"\",\"(\"&(VLOOKUP(L15,Inscrits!$A$2:$C$25,3,FALSE))&\")\")=\"()\",\"\",IF(ISNA(VLOOKUP(L15,Inscrits!$A$2:$C$25,3,FALSE)),\"\",\"(\"&(VLOOKUP(L15,Inscrits!$A$2:$C$25,3,FALSE))&\")\"))","v":"(NC)"},null,null,null,null,null,null,"G6",null,null,null,4,{"$f":"IF(B18=\"\",\"\",IF(B18=F16,F16,F20))","v":""},null,{"$f":"M15","v":"SOPIC NICOLAS"},{"$f":"IF(AB15=M15,IF(O13=\"F\",\"\",O15),0)","v":0},{"$f":"IF(AB15=M15,IF(O15=\"F\",\"\",O13),0)","v":0},{"$f":"IF(AB15=Q14,IF(S18=\"F\",\"\",S14),0)","v":0},{"$f":"IF(AB15=Q14,IF(S14=\"F\",\"\",S18),0)","v":0},{"$f":"IF(AB15=J14,IF(I18=\"F\",\"\",I14),0)","v":0},{"$f":"IF(AB15=J14,IF(I14=\"F\",\"\",I18),0)","v":0},{"$f":"IF(AB15=F16,IF(E20=\"F\",\"\",E16),0)","v":0},{"$f":"IF(AB15=F16,IF(E16=\"F\",\"\",E20),0)","v":0},{"$f":"IF(AB15=F10,IF(E6=\"F\",\"\",E10),0)","v":0},{"$f":"IF(AB15=F10,IF(E10=\"F\",\"\",E6),0)","v":0},0,0,{"$f":"AM15-AN15","v":0},null,null,{"$f":"Z16","v":""},{"$f":"IF(AR15=\"\",\"\",(VLOOKUP(AR15,AB4:AO17,14,FALSE)))","v":""}]
[null,null,null,null,null,{"$f":"J14","v":""},{"$f":"K14","v":""},null,null,"Match 8 - Billard",null,null,null,null,null,null,"Match 6 - Billard",null,null,null,{"$f":"IF(OR(S14=\"F\",S14=\"A\"),Q18,IF(OR(S18=\"F\",S18=\"A\"),Q14,IF(S14=S18,\"\",(IF(S14>S18,Q14,Q18)))))","v":""},{"$f":"IF(OR(S14=\"F\",S14=\"A\"),R18,IF(OR(S18=\"F\",S18=\"A\"),R14,IF(S14=S18,\"\",(IF(S14>S18,R14,R18)))))","v":""},"D",null,6,{"$f":"IF(B18=\"\",\"\",IF(B18=F16,F20,F16))","v":""},null,{"$f":"M17","v":0},{"$f":"IF(AB16=M17,IF(O19=\"F\",\"\",O17),0)","v":0},{"$f":"IF(AB16=M17,IF(O17=\"F\",\"\",O19),0)","v":0},{"$f":"IF(AB16=Q18,IF(S14=\"F\",\"\",S18),0)","v":0},{"$f":"IF(AB16=Q18,IF(S18=\"F\",\"\",S14),0)","v":0},{"$f":"IF(AB16=J18,IF(I14=\"F\",\"\",I18),0)","v":0},{"$f":"IF(AB16=J18,IF(I18=\"F\",\"\",I14),0)","v":0},{"$f":"IF(AB16=F16,IF(E20=\"F\",\"\",E16),0)","v":0},{"$f":"IF(AB16=F16,IF(E16=\"F\",\"\",E20),0)","v":0},{"$f":"IF(AB16=F10,IF(E6=\"F\",\"\",E10),0)","v":0},{"$f":"IF(AB16=F10,IF(E10=\"F\",\"\",E6),0)","v":0},0,0,{"$f":"AM16-AN16","v":0}]
[null,null,"G10",null,null,null,null,null,null,null,null,null,null,null,null,null,null,null,null,null,null,null,null,null,8,{"$f":"IF(F16=\"\",\"\",IF(F16=J14,J18,J14))","v":""},null,{"$f":"M19","v":"PARDO RAMON"},{"$f":"IF(AB17=M19,IF(O17=\"F\",\"\",O19),0)","v":0},{"$f":"IF(AB17=M19,IF(O19=\"F\",\"\",O17),0)","v":0},{"$f":"IF(AB17=Q18,IF(S14=\"F\",\"\",S18),0)","v":0},{"$f":"IF(AB17=Q18,IF(S18=\"F\",\"\",S14),0)","v":0},{"$f":"IF(AB17=J18,IF(I14=\"F\",\"\",I18),0)","v":0},{"$f":"IF(AB17=J18,IF(I18=\"F\",\"\",I14),0)","v":0},{"$f":"IF(AB17=F16,IF(E20=\"F\",\"\",E16),0)","v":0},{"$f":"IF(AB17=F16,IF(E16=\"F\",\"\",E20),0)","v":0},{"$f":"IF(AB17=F10,IF(E6=\"F\",\"\",E10),0)","v":0},{"$f":"IF(AB17=F10,IF(E10=\"F\",\"\",E6),0)","v":0},0,0,{"$f":"AM17-AN17","v":0}]
["V",{"$f":"IF(OR(E16=\"F\",E16=\"A\"),F20,IF(OR(E20=\"F\",E20=\"A\"),F16,IF(E16=E20,\"\",(IF(E16>E20,F16,F20)))))","v":""},{"$f":"IF(OR(E16=\"F\",E16=\"A\"),G20,IF(OR(E20=\"F\",E20=\"A\"),G16,IF(E16=E20,\"\",(IF(E16>E20,G16,G20)))))","v":""},null,null,"Match 10 - Billard",null,null,null,null,null,null,"Match 4 - Billard",null,null,null,{"$f":"M19","v":"PARDO RAMON"},{"$f":"N19","v":"(4)"}]
[null,null,null,null,null,null,null,null,null,null,"P4",4,{"$f":"IF(IF(ISNA(VLOOKUP(L19,Inscrits!$A$2:$C$25,2,FALSE)),\"\",VLOOKUP(L19,Inscrits!$A$2:$C$25,2,FALSE))=0,\"\",IF(ISNA(VLOOKUP(L19,Inscrits!$A$2:$C$25,2,FALSE)),\"\",VLOOKUP(L19,Inscrits!$A$2:$C$25,2,FALSE)))","v":"PARDO RAMON"},{"$f":"IF(IF(ISNA(VLOOKUP(L19,Inscrits!$A$2:$C$25,3,FALSE)),\"\",\"(\"&(VLOOKUP(L19,Inscrits!$A$2:$C$25,3,FALSE))&\")\")=\"()\",\"\",IF(ISNA(VLOOKUP(L19,Inscrits!$A$2:$C$25,3,FALSE)),\"\",\"(\"&(VLOOKUP(L19,Inscrits!$A$2:$C$25,3,FALSE))&\")\"))","v":"(4)"},null,null,"G4"]
[null,null,null,null,null,{"$f":"IF(OR(S4=\"F\",S4=\"A\"),Q4,IF(OR(S8=\"F\",S8=\"A\"),Q8,IF(S4=S8,\"\",(IF(S4<S8,Q4,Q8)))))","v":""},{"$f":"IF(OR(S4=\"F\",S4=\"A\"),R4,IF(OR(S8=\"F\",S8=\"A\"),R8,IF(S4=S8,\"\",(IF(S4<S8,R4,R8)))))","v":""}]
[null,null,null,null,null,null,"P5",null,null,{"$f":"IF(Accueil!G18=3,\"\",\"MATCHS EN 4 GAGNANTES COTE PERDANT\")","v":""}]

{"sheet":"3","index":5,"n_rows":21,"n_cols":45,"rows_kept":21,"cut":false,"hidden":false,"merged":[[1,42,1,45],[11,42,11,45],[20,9,20,17],[0,9,0,17],[12,1,12,2],[10,20,10,21]]}
[null,null,null,null,null,null,null,null,null,"MATCHS EN 3 PARTIES GAGNANTES"]
[null,null,null,null,null,null,null,null,null,null,null,null,null,null,null,null,null,null,null,null,null,null,null,null,null,null,null,null,null,null,null,null,null,null,null,null,null,null,null,null,null,null,"QUALIFIES"]
[null,null,null,null,null,null,null,null,null,null,"P1",3,{"$f":"IF(IF(ISNA(VLOOKUP(L3,Inscrits!$A$2:$C$25,2,FALSE)),\"\",VLOOKUP(L3,Inscrits!$A$2:$C$25,2,FALSE))=0,\"\",IF(ISNA(VLOOKUP(L3,Inscrits!$A$2:$C$25,2,FALSE)),\"\",VLOOKUP(L3,Inscrits!$A$2:$C$25,2,FALSE)))","v":"REDON VALERIE"},{"$f":"IF(IF(ISNA(VLOOKUP(L3,Inscrits!$A$2:$C$25,3,FALSE)),\"\",\"(\"&(VLOOKUP(L3,Inscrits!$A$2:$C$25,3,FALSE))&\")\")=\"()\",\"\",IF(ISNA(VLOOKUP(L3,Inscrits!$A$2:$C$25,3,FALSE)),\"\",\"(\"&(VLOOKUP(L3,Inscrits!$A$2:$C$25,3,FALSE))&\")\"))","v":"(3)"},null,null,"G1",null,null,null,null,null,null,null,null,null,null,null,"G","P","G","P","G","P","G","P","G","P","G","P","Ga",null,null,"NOM","Ga"]
[null,null,null,null,null,null,null,null,null,null,null,null,"Match 1 - Billard",null,null,null,{"$f":"M3","v":"REDON VALERIE"},{"$f":"N3","v":"(3)"},null,null,null,null,null,null,1,{"$f":"IF(U6=\"\",\"\",IF(U6=Q4,Q4,Q8))","v":""},null,{"$f":"M3","v":"REDON VALERIE"},{"$f":"IF(AB4=M3,IF(O5=\"F\",\"\",O3),0)","v":0},{"$f":"IF(AB4=M3,IF(O3=\"F\",\"\",O5),0)","v":0},{"$f":"IF(AB4=Q4,IF(S8=\"F\",\"\",S4),0)","v":0},{"$f":"IF(AB4=Q4,IF(S4=\"F\",\"\",S8),0)","v":0},{"$f":"IF(AB4=J4,IF(I8=\"F\",\"\",I4),0)","v":0},{"$f":"IF(AB4=J4,IF(I4=\"F\",\"\",I8),0)","v":0},{"$f":"IF(AB4=F6,IF(E10=\"F\",\"\",E6),0)","v":0},{"$f":"IF(AB4=F6,IF(E6=\"F\",\"\",E10),0)","v":0},{"$f":"IF(AB4=F20,IF(E16=\"F\",\"\",E20),0)","v":0},{"$f":"IF(AB4=F20,IF(E20=\"F\",\"\",E16),0)","v":0},{"$f":"SUM(AC4,AE4,AG4,AI4,AK4)","v":0},0,{"$f":"AM4-AN4","v":0},null,null,{"$f":"Z4","v":""},{"$f":"IF(AR4=\"\",\"\",(VLOOKUP(AR4,AB4:AO17,14,FALSE)))","v":""}]
[null,null,null,null,null,null,"G7",null,null,null,null,null,null,null,null,null,null,null,null,null,"G5",null,null,null,3,{"$f":"IF(B8=\"\",\"\",IF(B8=F6,F6,F10))","v":""},null,{"$f":"M5","v":0},{"$f":"IF(AB5=M5,IF(O3=\"F\",\"\",O5),0)","v":0},{"$f":"IF(AB5=M5,IF(O5=\"F\",\"\",O3),0)","v":0},{"$f":"IF(AB5=Q4,IF(S8=\"F\",\"\",S4),0)","v":0},{"$f":"IF(AB5=Q4,IF(S4=\"F\",\"\",S8),0)","v":0},{"$f":"IF(AB5=J4,IF(I8=\"F\",\"\",I4),0)","v":0},{"$f":"IF(AB5=J4,IF(I4=\"F\",\"\",I8),0)","v":0},{"$f":"IF(AB5=F6,IF(E10=\"F\",\"\",E6),0)","v":0},{"$f":"IF(AB5=F6,IF(E6=\"F\",\"\",E10),0)","v":0},{"$f":"IF(AB5=F20,IF(E16=\"F\",\"\",E20),0)","v":0},{"$f":"IF(AB5=F20,IF(E20=\"F\",\"\",E16),0)","v":0},0,0,{"$f":"AM5-AN5","v":0},null,null,{"$f":"Z14","v":""},{"$f":"IF(AR5=\"\",\"\",(VLOOKUP(AR5,AB4:AO17,14,FALSE)))","v":""}]
[null,null,null,null,null,{"$f":"J8","v":""},{"$f":"K8","v":""},null,null,"Match 7 - Billard",null,null,null,null,null,null,"Match 5 - Billard",null,null,null,{"$f":"IF(OR(S4=\"F\",S4=\"A\"),Q8,IF(OR(S8=\"F\",S8=\"A\"),Q4,IF(S4=S8,\"\",(IF(S4>S8,Q4,Q8)))))","v":""},{"$f":"IF(OR(S4=\"F\",S4=\"A\"),R8,IF(OR(S8=\"F\",S8=\"A\"),R4,IF(S4=S8,\"\",(IF(S4>S8,R4,R8)))))","v":""},"E",null,5,{"$f":"IF(B8=\"\",\"\",IF(B8=F6,F10,F6))","v":""},null,{"$f":"M7","v":"LACROIX VALERIE"},{"$f":"IF(AB6=M7,IF(O9=\"F\",\"\",O7),0)","v":0},{"$f":"IF(AB6=M7,IF(O7=\"F\",\"\",O9),0)","v":0},{"$f":"IF(AB6=Q8,IF(S4=\"F\",\"\",S8),0)","v":0},{"$f":"IF(AB6=Q8,IF(S8=\"F\",\"\",S4),0)","v":0},{"$f":"IF(AB6=J8,IF(I4=\"F\",\"\",I8),0)","v":0},{"$f":"IF(AB6=J8,IF(I8=\"F\",\"\",I4),0)","v":0},{"$f":"IF(AB6=F6,IF(E10=\"F\",\"\",E6),0)","v":0},{"$f":"IF(AB6=F6,IF(E6=\"F\",\"\",E10),0)","v":0},{"$f":"IF(AB6=F20,IF(E16=\"F\",\"\",E20),0)","v":0},{"$f":"IF(AB6=F20,IF(E20=\"F\",\"\",E16),0)","v":0},0,0,{"$f":"AM6-AN6","v":0},null,null,{"$f":"Z5","v":""},{"$f":"IF(AR6=\"\",\"\",(VLOOKUP(AR6,AB4:AO17,14,FALSE)))","v":""}]
[null,null,"G9",null,null,null,null,null,null,null,null,19,{"$f":"IF(IF(ISNA(VLOOKUP(L7,Inscrits!$A$2:$C$25,2,FALSE)),\"\",VLOOKUP(L7,Inscrits!$A$2:$C$25,2,FALSE))=0,\"\",IF(ISNA(VLOOKUP(L7,Inscrits!$A$2:$C$25,2,FALSE)),\"\",VLOOKUP(L7,Inscrits!$A$2:$C$25,2,FALSE)))","v":"LACROIX VALERIE"},{"$f":"IF(IF(ISNA(VLOOKUP(L7,Inscrits!$A$2:$C$25,3,FALSE)),\"\",\"(\"&(VLOOKUP(L7,Inscrits!$A$2:$C$25,3,FALSE))&\")\")=\"()\",\"\",IF(ISNA(VLOOKUP(L7,Inscrits!$A$2:$C$25,3,FALSE)),\"\",\"(\"&(VLOOKUP(L7,Inscrits!$A$2:$C$25,3,FALSE))&\")\"))","v":"(NC)"},null,null,null,null,null,null,null,null,null,null,7,{"$f":"IF(F6=\"\",\"\",IF(F6=J4,J8,J4))","v":""},null,{"$f":"M9","v":"BOBROSKY BERNARD"},{"$f":"IF(AB7=M9,IF(O7=\"F\",\"\",O9),0)","v":0},{"$f":"IF(AB7=M9,IF(O9=\"F\",\"\",O7),0)","v":0},{"$f":"IF(AB7=Q8,IF(S4=\"F\",\"\",S8),0)","v":0},{"$f":"IF(AB7=Q8,IF(S8=\"F\",\"\",S4),0)","v":0},{"$f":"IF(AB7=J8,IF(I4=\"F\",\"\",I8),0)","v":0},{"$f":"IF(AB7=J8,IF(I8=\"F\",\"\",I4),0)","v":0},{"$f":"IF(AB7=F6,IF(E10=\"F\",\"\",E6),0)","v":0},{"$f":"IF(AB7=F6,IF(E6=\"F\",\"\",E10),0)","v":0},{"$f":"IF(AB7=F20,IF(E16=\"F\",\"\",E20),0)","v":0},{"$f":"IF(AB7=F20,IF(E20=\"F\",\"\",E16),0)","v":0},0,0,{"$f":"AM7-AN7","v":0},null,null,{"$f":"Z15","v":""},{"$f":"IF(AR7=\"\",\"\",(VLOOKUP(AR7,AB4:AO17,14,FALSE)))","v":""}]
["W",{"$f":"IF(OR(E6=\"F\",E6=\"A\"),F10,IF(OR(E10=\"F\",E10=\"A\"),F6,IF(E6=E10,\"\",(IF(E6>E10,F6,F10)))))","v":""},{"$f":"IF(OR(E6=\"F\",E6=\"A\"),G10,IF(OR(E10=\"F\",E10=\"A\"),G6,IF(E6=E10,\"\",(IF(E6>E10,G6,G10)))))","v":""},null,null,"Match 9 - Billard",null,null,null,{"$f":"IF(OR(AND(O7=\"F\",O9=\"F\"),AND(O7=\"A\",O9=\"A\")),M9,IF(OR(O7=\"F\",O7=\"A\"),M7,IF(OR(O9=\"F\",O9=\"A\"),M9,IF(O7=O9,\"\",(IF(O7<O9,M7,M9))))))","v":""},{"$f":"IF(OR(AND(O7=\"F\",O9=\"F\"),AND(O7=\"A\",O9=\"A\")),N9,IF(OR(O7=\"F\",O7=\"A\"),N7,IF(OR(O9=\"F\",O9=\"A\"),N9,IF(O7=O9,\"\",(IF(O7<O9,N7,N9))))))","v":""},null,"Match 2 - Billard",null,null,null,{"$f":"IF(OR(AND(O7=\"F\",O9=\"F\"),AND(O7=\"A\",O9=\"A\")),M7,IF(OR(O7=\"F\",O7=\"A\"),M9,IF(OR(O9=\"F\",O9=\"A\"),M7,IF(O7=O9,\"\",(IF(O7>O9,M7,M9))))))","v":""},{"$f":"IF(OR(AND(O7=\"F\",O9=\"F\"),AND(O7=\"A\",O9=\"A\")),N7,IF(OR(O7=\"F\",O7=\"A\"),N9,IF(OR(O9=\"F\",O9=\"A\"),N7,IF(O7=O9,\"\",(IF(O7>O9,N7,N9))))))","v":""}]
[null,null,null,null,null,null,null,null,null,null,"P2",14,{"$f":"IF(IF(ISNA(VLOOKUP(L9,Inscrits!$A$2:$C$25,2,FALSE)),\"\",VLOOKUP(L9,Inscrits!$A$2:$C$25,2,FALSE))=0,\"\",IF(ISNA(VLOOKUP(L9,Inscrits!$A$2:$C$25,2,FALSE)),\"\",VLOOKUP(L9,Inscrits!$A$2:$C$25,2,FALSE)))","v":"BOBROSKY BERNARD"},{"$f":"IF(IF(ISNA(VLOOKUP(L9,Inscrits!$A$2:$C$25,3,FALSE)),\"\",\"(\"&(VLOOKUP(L9,Inscrits!$A$2:$C$25,3,FALSE))&\")\")=\"()\",\"\",IF(ISNA(VLOOKUP(L9,Inscrits!$A$2:$C$25,3,FALSE)),\"\",\"(\"&(VLOOKUP(L9,Inscrits!$A$2:$C$25,3,FALSE))&\")\"))","v":"(17)"},null,null,"G2"]
[null,null,null,null,null,{"$f":"IF(OR(S14=\"F\",S14=\"A\"),Q14,IF(OR(S18=\"F\",S18=\"A\"),Q18,IF(S14=S18,\"\",(IF(S14<S18,Q14,Q18)))))","v":""},{"$f":"IF(OR(S14=\"F\",S14=\"A\"),R14,IF(OR(S18=\"F\",S18=\"A\"),R18,IF(S14=S18,\"\",(IF(S14<S18,R14,R18)))))","v":""}]
[null,null,null,null,null,null,"P6",null,null,null,null,null,null,null,null,null,null,null,null,null,"QUALIFIES"]
[null,null,null,null,null,null,null,null,null,null,null,null,null,null,null,null,null,null,null,null,null,null,null,null,null,null,null,null,null,null,null,null,null,null,null,null,null,null,null,null,null,null,"ELIMINES"]
[null,"QUALIFIES",null,null,null,null,null,null,null,null,"P3",11,{"$f":"IF(IF(ISNA(VLOOKUP(L13,Inscrits!$A$2:$C$25,2,FALSE)),\"\",VLOOKUP(L13,Inscrits!$A$2:$C$25,2,FALSE))=0,\"\",IF(ISNA(VLOOKUP(L13,Inscrits!$A$2:$C$25,2,FALSE)),\"\",VLOOKUP(L13,Inscrits!$A$2:$C$25,2,FALSE)))","v":"ROZIER MYRIAM"},{"$f":"IF(IF(ISNA(VLOOKUP(L13,Inscrits!$A$2:$C$25,3,FALSE)),\"\",\"(\"&(VLOOKUP(L13,Inscrits!$A$2:$C$25,3,FALSE))&\")\")=\"()\",\"\",IF(ISNA(VLOOKUP(L13,Inscrits!$A$2:$C$25,3,FALSE)),\"\",\"(\"&(VLOOKUP(L13,Inscrits!$A$2:$C$25,3,FALSE))&\")\"))","v":"(12)"},null,null,"G3",null,null,null,null,null,null,null,null,null,null,null,"G","P","G","P","G","P","G","P","G","P","G","P","Ga",null,null,"NOM","Ga"]
[null,null,null,null,null,null,null,null,null,{"$f":"IF(OR(AND(O13=\"F\",O15=\"F\"),AND(O13=\"A\",O15=\"A\")),M15,IF(OR(O13=\"F\",O13=\"A\"),M13,IF(OR(O15=\"F\",O15=\"A\"),M15,IF(O13=O15,\"\",(IF(O13<O15,M13,M15))))))","v":"Blanc 1"},{"$f":"IF(OR(AND(O13=\"F\",O15=\"F\"),AND(O13=\"A\",O15=\"A\")),N15,IF(OR(O13=\"F\",O13=\"A\"),N13,IF(OR(O15=\"F\",O15=\"A\"),N15,IF(O13=O15,\"\",(IF(O13<O15,N13,N15))))))","v":"(NC)"},null,"Match 3 - Billard",null,null,null,{"$f":"IF(OR(AND(O13=\"F\",O15=\"F\"),AND(O13=\"A\",O15=\"A\")),M13,IF(OR(O13=\"F\",O13=\"A\"),M15,IF(OR(O15=\"F\",O15=\"A\"),M13,IF(O13=O15,\"\",(IF(O13>O15,M13,M15))))))","v":"ROZIER MYRIAM"},{"$f":"IF(OR(AND(O13=\"F\",O15=\"F\"),AND(O13=\"A\",O15=\"A\")),N13,IF(OR(O13=\"F\",O13=\"A\"),N15,IF(OR(O15=\"F\",O15=\"A\"),N13,IF(O13=O15,\"\",(IF(O13>O15,N13,N15))))))","v":"(12)"},null,null,null,null,null,null,2,{"$f":"IF(U16=\"\",\"\",IF(U16=Q14,Q14,Q18))","v":""},null,{"$f":"M13","v":"ROZIER MYRIAM"},{"$f":"IF(AB14=M13,IF(O15=\"F\",\"\",O13),0)","v":""},{"$f":"IF(AB14=M13,IF(O13=\"F\",\"\",O15),0)","v":"F"},{"$f":"IF(AB14=Q14,IF(S18=\"F\",\"\",S14),0)","v":0},{"$f":"IF(AB14=Q14,IF(S14=\"F\",\"\",S18),0)","v":0},{"$f":"IF(AB14=J14,IF(I18=\"F\",\"\",I14),0)","v":0},{"$f":"IF(AB14=J14,IF(I14=\"F\",\"\",I18),0)","v":0},{"$f":"IF(AB14=F16,IF(E20=\"F\",\"\",E16),0)","v":0},{"$f":"IF(AB14=F16,IF(E16=\"F\",\"\",E20),0)","v":0},{"$f":"IF(AB14=F10,IF(E6=\"F\",\"\",E10),0)","v":0},{"$f":"IF(AB14=F10,IF(E10=\"F\",\"\",E6),0)","v":0},{"$f":"SUM(AC14,AE14,AG14,AI14,AK14)","v":0},0,{"$f":"AM14-AN14","v":0},null,null,{"$f":"Z6","v":""},{"$f":"IF(AR14=\"\",\"\",(VLOOKUP(AR14,AB4:AO17,14,FALSE)))","v":""}]
[null,null,null,null,null,null,"G8",null,null,null,null,22,{"$f":"IF(IF(ISNA(VLOOKUP(L15,Inscrits!$A$2:$C$25,2,FALSE)),\"\",VLOOKUP(L15,Inscrits!$A$2:$C$25,2,FALSE))=0,\"\",IF(ISNA(VLOOKUP(L15,Inscrits!$A$2:$C$25,2,FALSE)),\"\",VLOOKUP(L15,Inscrits!$A$2:$C$25,2,FALSE)))","v":"Blanc 1"},{"$f":"IF(IF(ISNA(VLOOKUP(L15,Inscrits!$A$2:$C$25,3,FALSE)),\"\",\"(\"&(VLOOKUP(L15,Inscrits!$A$2:$C$25,3,FALSE))&\")\")=\"()\",\"\",IF(ISNA(VLOOKUP(L15,Inscrits!$A$2:$C$25,3,FALSE)),\"\",\"(\"&(VLOOKUP(L15,Inscrits!$A$2:$C$25,3,FALSE))&\")\"))","v":"(NC)"},"F",null,null,null,null,null,"G6",null,null,null,4,{"$f":"IF(B18=\"\",\"\",IF(B18=F16,F16,F20))","v":""},null,{"$f":"M15","v":"Blanc 1"},{"$f":"IF(AB15=M15,IF(O13=\"F\",\"\",O15),0)","v":"F"},{"$f":"IF(AB15=M15,IF(O15=\"F\",\"\",O13),0)","v":""},{"$f":"IF(AB15=Q14,IF(S18=\"F\",\"\",S14),0)","v":0},{"$f":"IF(AB15=Q14,IF(S14=\"F\",\"\",S18),0)","v":0},{"$f":"IF(AB15=J14,IF(I18=\"F\",\"\",I14),0)","v":0},{"$f":"IF(AB15=J14,IF(I14=\"F\",\"\",I18),0)","v":0},{"$f":"IF(AB15=F16,IF(E20=\"F\",\"\",E16),0)","v":"F"},{"$f":"IF(AB15=F16,IF(E16=\"F\",\"\",E20),0)","v":""},{"$f":"IF(AB15=F10,IF(E6=\"F\",\"\",E10),0)","v":0},{"$f":"IF(AB15=F10,IF(E10=\"F\",\"\",E6),0)","v":0},0,0,{"$f":"AM15-AN15","v":0},null,null,{"$f":"Z16","v":""},{"$f":"IF(AR15=\"\",\"\",(VLOOKUP(AR15,AB4:AO17,14,FALSE)))","v":""}]
[null,null,null,null,"F",{"$f":"J14","v":"Blanc 1"},{"$f":"K14","v":"(NC)"},null,null,"Match 8 - Billard",null,null,null,null,null,null,"Match 6 - Billard",null,null,null,{"$f":"IF(OR(S14=\"F\",S14=\"A\"),Q18,IF(OR(S18=\"F\",S18=\"A\"),Q14,IF(S14=S18,\"\",(IF(S14>S18,Q14,Q18)))))","v":""},{"$f":"IF(OR(S14=\"F\",S14=\"A\"),R18,IF(OR(S18=\"F\",S18=\"A\"),R14,IF(S14=S18,\"\",(IF(S14>S18,R14,R18)))))","v":""},"F",null,6,{"$f":"IF(B18=\"\",\"\",IF(B18=F16,F20,F16))","v":""},null,{"$f":"M17","v":0},{"$f":"IF(AB16=M17,IF(O19=\"F\",\"\",O17),0)","v":0},{"$f":"IF(AB16=M17,IF(O17=\"F\",\"\",O19),0)","v":0},{"$f":"IF(AB16=Q18,IF(S14=\"F\",\"\",S18),0)","v":0},{"$f":"IF(AB16=Q18,IF(S18=\"F\",\"\",S14),0)","v":0},{"$f":"IF(AB16=J18,IF(I14=\"F\",\"\",I18),0)","v":0},{"$f":"IF(AB16=J18,IF(I18=\"F\",\"\",I14),0)","v":0},{"$f":"IF(AB16=F16,IF(E20=\"F\",\"\",E16),0)","v":0},{"$f":"IF(AB16=F16,IF(E16=\"F\",\"\",E20),0)","v":0},{"$f":"IF(AB16=F10,IF(E6=\"F\",\"\",E10),0)","v":0},{"$f":"IF(AB16=F10,IF(E10=\"F\",\"\",E6),0)","v":0},0,0,{"$f":"AM16-AN16","v":0}]
[null,null,"G10",null,null,null,null,null,null,null,null,null,null,null,null,null,null,null,null,null,null,null,null,null,8,{"$f":"IF(F16=\"\",\"\",IF(F16=J14,J18,J14))","v":0},null,{"$f":"M19","v":"BRENDEL CHRISTIAN"},{"$f":"IF(AB17=M19,IF(O17=\"F\",\"\",O19),0)","v":0},{"$f":"IF(AB17=M19,IF(O19=\"F\",\"\",O17),0)","v":0},{"$f":"IF(AB17=Q18,IF(S14=\"F\",\"\",S18),0)","v":0},{"$f":"IF(AB17=Q18,IF(S18=\"F\",\"\",S14),0)","v":0},{"$f":"IF(AB17=J18,IF(I14=\"F\",\"\",I18),0)","v":0},{"$f":"IF(AB17=J18,IF(I18=\"F\",\"\",I14),0)","v":0},{"$f":"IF(AB17=F16,IF(E20=\"F\",\"\",E16),0)","v":0},{"$f":"IF(AB17=F16,IF(E16=\"F\",\"\",E20),0)","v":0},{"$f":"IF(AB17=F10,IF(E6=\"F\",\"\",E10),0)","v":0},{"$f":"IF(AB17=F10,IF(E10=\"F\",\"\",E6),0)","v":0},0,0,{"$f":"AM17-AN17","v":0}]
["X",{"$f":"IF(OR(E16=\"F\",E16=\"A\"),F20,IF(OR(E20=\"F\",E20=\"A\"),F16,IF(E16=E20,\"\",(IF(E16>E20,F16,F20)))))","v":""},{"$f":"IF(OR(E16=\"F\",E16=\"A\"),G20,IF(OR(E20=\"F\",E20=\"A\"),G16,IF(E16=E20,\"\",(IF(E16>E20,G16,G20)))))","v":""},null,null,"Match 10 - Billard",null,null,null,null,null,null,"Match 4 - Billard",null,null,null,{"$f":"M19","v":"BRENDEL CHRISTIAN"},{"$f":"N19","v":"(7)"}]
[null,null,null,null,null,null,null,null,null,null,"P4",6,{"$f":"IF(IF(ISNA(VLOOKUP(L19,Inscrits!$A$2:$C$25,2,FALSE)),\"\",VLOOKUP(L19,Inscrits!$A$2:$C$25,2,FALSE))=0,\"\",IF(ISNA(VLOOKUP(L19,Inscrits!$A$2:$C$25,2,FALSE)),\"\",VLOOKUP(L19,Inscrits!$A$2:$C$25,2,FALSE)))","v":"BRENDEL CHRISTIAN"},{"$f":"IF(IF(ISNA(VLOOKUP(L19,Inscrits!$A$2:$C$25,3,FALSE)),\"\",\"(\"&(VLOOKUP(L19,Inscrits!$A$2:$C$25,3,FALSE))&\")\")=\"()\",\"\",IF(ISNA(VLOOKUP(L19,Inscrits!$A$2:$C$25,3,FALSE)),\"\",\"(\"&(VLOOKUP(L19,Inscrits!$A$2:$C$25,3,FALSE))&\")\"))","v":"(7)"},null,null,"G4"]
[null,null,null,null,null,{"$f":"IF(OR(S4=\"F\",S4=\"A\"),Q4,IF(OR(S8=\"F\",S8=\"A\"),Q8,IF(S4=S8,\"\",(IF(S4<S8,Q4,Q8)))))","v":""},{"$f":"IF(OR(S4=\"F\",S4=\"A\"),R4,IF(OR(S8=\"F\",S8=\"A\"),R8,IF(S4=S8,\"\",(IF(S4<S8,R4,R8)))))","v":""}]
[null,null,null,null,null,null,"P5",null,null,{"$f":"IF(Accueil!G18=3,\"\",\"MATCHS EN 4 GAGNANTES COTE PERDANT\")","v":""}]

{"sheet":"4","index":6,"n_rows":21,"n_cols":45,"rows_kept":21,"cut":false,"hidden":false,"merged":[[12,1,12,2],[10,20,10,21],[20,9,20,17],[0,9,0,17],[1,42,1,45],[11,42,11,45]]}
[null,null,null,null,null,null,null,null,null,"MATCHS EN 3 PARTIES GAGNANTES"]
[null,null,null,null,null,null,null,null,null,null,null,null,null,null,null,null,null,null,null,null,null,null,null,null,null,null,null,null,null,null,null,null,null,null,null,null,null,null,null,null,null,null,"QUALIFIES"]
[null,null,null,null,null,null,null,null,null,null,"P2",7,{"$f":"IF(IF(ISNA(VLOOKUP(L3,Inscrits!$A$2:$C$25,2,FALSE)),\"\",VLOOKUP(L3,Inscrits!$A$2:$C$25,2,FALSE))=0,\"\",IF(ISNA(VLOOKUP(L3,Inscrits!$A$2:$C$25,2,FALSE)),\"\",VLOOKUP(L3,Inscrits!$A$2:$C$25,2,FALSE)))","v":"MANDY NATHALIE"},{"$f":"IF(IF(ISNA(VLOOKUP(L3,Inscrits!$A$2:$C$25,3,FALSE)),\"\",\"(\"&(VLOOKUP(L3,Inscrits!$A$2:$C$25,3,FALSE))&\")\")=\"()\",\"\",IF(ISNA(VLOOKUP(L3,Inscrits!$A$2:$C$25,3,FALSE)),\"\",\"(\"&(VLOOKUP(L3,Inscrits!$A$2:$C$25,3,FALSE))&\")\"))","v":"(8)"},null,null,"G1",null,null,null,null,null,null,null,null,null,null,null,"G","P","G","P","G","P","G","P","G","P","G","P","Ga",null,null,"NOM","Ga"]
[null,null,null,null,null,null,null,null,null,null,null,null,"Match 1 - Billard",null,null,null,{"$f":"M3","v":"MANDY NATHALIE"},{"$f":"N3","v":"(8)"},null,null,null,null,null,null,1,{"$f":"IF(U6=\"\",\"\",IF(U6=Q4,Q4,Q8))","v":""},null,{"$f":"M3","v":"MANDY NATHALIE"},{"$f":"IF(AB4=M3,IF(O5=\"F\",\"\",O3),0)","v":0},{"$f":"IF(AB4=M3,IF(O3=\"F\",\"\",O5),0)","v":0},{"$f":"IF(AB4=Q4,IF(S8=\"F\",\"\",S4),0)","v":0},{"$f":"IF(AB4=Q4,IF(S4=\"F\",\"\",S8),0)","v":0},{"$f":"IF(AB4=J4,IF(I8=\"F\",\"\",I4),0)","v":0},{"$f":"IF(AB4=J4,IF(I4=\"F\",\"\",I8),0)","v":0},{"$f":"IF(AB4=F6,IF(E10=\"F\",\"\",E6),0)","v":0},{"$f":"IF(AB4=F6,IF(E6=\"F\",\"\",E10),0)","v":0},{"$f":"IF(AB4=F20,IF(E16=\"F\",\"\",E20),0)","v":0},{"$f":"IF(AB4=F20,IF(E20=\"F\",\"\",E16),0)","v":0},{"$f":"SUM(AC4,AE4,AG4,AI4,AK4)","v":0},0,{"$f":"AM4-AN4","v":0},null,null,{"$f":"Z4","v":""},{"$f":"IF(AR4=\"\",\"\",(VLOOKUP(AR4,AB4:AO17,14,FALSE)))","v":""}]
[null,null,null,null,null,null,"G7",null,null,null,null,null,null,null,null,null,null,null,null,null,"G5",null,null,null,3,{"$f":"IF(B8=\"\",\"\",IF(B8=F6,F6,F10))","v":""},null,{"$f":"M5","v":0},{"$f":"IF(AB5=M5,IF(O3=\"F\",\"\",O5),0)","v":0},{"$f":"IF(AB5=M5,IF(O5=\"F\",\"\",O3),0)","v":0},{"$f":"IF(AB5=Q4,IF(S8=\"F\",\"\",S4),0)","v":0},{"$f":"IF(AB5=Q4,IF(S4=\"F\",\"\",S8),0)","v":0},{"$f":"IF(AB5=J4,IF(I8=\"F\",\"\",I4),0)","v":0},{"$f":"IF(AB5=J4,IF(I4=\"F\",\"\",I8),0)","v":0},{"$f":"IF(AB5=F6,IF(E10=\"F\",\"\",E6),0)","v":0},{"$f":"IF(AB5=F6,IF(E6=\"F\",\"\",E10),0)","v":0},{"$f":"IF(AB5=F20,IF(E16=\"F\",\"\",E20),0)","v":0},{"$f":"IF(AB5=F20,IF(E20=\"F\",\"\",E16),0)","v":0},0,0,{"$f":"AM5-AN5","v":0},null,null,{"$f":"Z14","v":""},{"$f":"IF(AR5=\"\",\"\",(VLOOKUP(AR5,AB4:AO17,14,FALSE)))","v":""}]
[null,null,null,null,"F",{"$f":"J8","v":"Blanc 2"},{"$f":"K8","v":"(NC)"},null,null,"Match 7 - Billard",null,null,null,null,null,null,"Match 5 - Billard",null,null,null,{"$f":"IF(OR(S4=\"F\",S4=\"A\"),Q8,IF(OR(S8=\"F\",S8=\"A\"),Q4,IF(S4=S8,\"\",(IF(S4>S8,Q4,Q8)))))","v":""},{"$f":"IF(OR(S4=\"F\",S4=\"A\"),R8,IF(OR(S8=\"F\",S8=\"A\"),R4,IF(S4=S8,\"\",(IF(S4>S8,R4,R8)))))","v":""},"G",null,5,{"$f":"IF(B8=\"\",\"\",IF(B8=F6,F10,F6))","v":""},null,{"$f":"M7","v":"Blanc 2"},{"$f":"IF(AB6=M7,IF(O9=\"F\",\"\",O7),0)","v":"F"},{"$f":"IF(AB6=M7,IF(O7=\"F\",\"\",O9),0)","v":""},{"$f":"IF(AB6=Q8,IF(S4=\"F\",\"\",S8),0)","v":0},{"$f":"IF(AB6=Q8,IF(S8=\"F\",\"\",S4),0)","v":0},{"$f":"IF(AB6=J8,IF(I4=\"F\",\"\",I8),0)","v":0},{"$f":"IF(AB6=J8,IF(I8=\"F\",\"\",I4),0)","v":0},{"$f":"IF(AB6=F6,IF(E10=\"F\",\"\",E6),0)","v":"F"},{"$f":"IF(AB6=F6,IF(E6=\"F\",\"\",E10),0)","v":""},{"$f":"IF(AB6=F20,IF(E16=\"F\",\"\",E20),0)","v":0},{"$f":"IF(AB6=F20,IF(E20=\"F\",\"\",E16),0)","v":0},0,0,{"$f":"AM6-AN6","v":0},null,null,{"$f":"Z5","v":""},{"$f":"IF(AR6=\"\",\"\",(VLOOKUP(AR6,AB4:AO17,14,FALSE)))","v":""}]
[null,null,"G9",null,null,null,null,null,null,null,null,23,{"$f":"IF(IF(ISNA(VLOOKUP(L7,Inscrits!$A$2:$C$25,2,FALSE)),\"\",VLOOKUP(L7,Inscrits!$A$2:$C$25,2,FALSE))=0,\"\",IF(ISNA(VLOOKUP(L7,Inscrits!$A$2:$C$25,2,FALSE)),\"\",VLOOKUP(L7,Inscrits!$A$2:$C$25,2,FALSE)))","v":"Blanc 2"},{"$f":"IF(IF(ISNA(VLOOKUP(L7,Inscrits!$A$2:$C$25,3,FALSE)),\"\",\"(\"&(VLOOKUP(L7,Inscrits!$A$2:$C$25,3,FALSE))&\")\")=\"()\",\"\",IF(ISNA(VLOOKUP(L7,Inscrits!$A$2:$C$25,3,FALSE)),\"\",\"(\"&(VLOOKUP(L7,Inscrits!$A$2:$C$25,3,FALSE))&\")\"))","v":"(NC)"},"F",null,null,null,null,null,null,null,null,null,7,{"$f":"IF(F6=\"\",\"\",IF(F6=J4,J8,J4))","v":0},null,{"$f":"M9","v":"MOREL SYLVAIN"},{"$f":"IF(AB7=M9,IF(O7=\"F\",\"\",O9),0)","v":""},{"$f":"IF(AB7=M9,IF(O9=\"F\",\"\",O7),0)","v":"F"},{"$f":"IF(AB7=Q8,IF(S4=\"F\",\"\",S8),0)","v":0},{"$f":"IF(AB7=Q8,IF(S8=\"F\",\"\",S4),0)","v":0},{"$f":"IF(AB7=J8,IF(I4=\"F\",\"\",I8),0)","v":0},{"$f":"IF(AB7=J8,IF(I8=\"F\",\"\",I4),0)","v":0},{"$f":"IF(AB7=F6,IF(E10=\"F\",\"\",E6),0)","v":0},{"$f":"IF(AB7=F6,IF(E6=\"F\",\"\",E10),0)","v":0},{"$f":"IF(AB7=F20,IF(E16=\"F\",\"\",E20),0)","v":0},{"$f":"IF(AB7=F20,IF(E20=\"F\",\"\",E16),0)","v":0},0,0,{"$f":"AM7-AN7","v":0},null,null,{"$f":"Z15","v":""},{"$f":"IF(AR7=\"\",\"\",(VLOOKUP(AR7,AB4:AO17,14,FALSE)))","v":""}]
["Y",{"$f":"IF(OR(E6=\"F\",E6=\"A\"),F10,IF(OR(E10=\"F\",E10=\"A\"),F6,IF(E6=E10,\"\",(IF(E6>E10,F6,F10)))))","v":""},{"$f":"IF(OR(E6=\"F\",E6=\"A\"),G10,IF(OR(E10=\"F\",E10=\"A\"),G6,IF(E6=E10,\"\",(IF(E6>E10,G6,G10)))))","v":""},null,null,"Match 9 - Billard",null,null,null,{"$f":"IF(OR(AND(O7=\"F\",O9=\"F\"),AND(O7=\"A\",O9=\"A\")),M9,IF(OR(O7=\"F\",O7=\"A\"),M7,IF(OR(O9=\"F\",O9=\"A\"),M9,IF(O7=O9,\"\",(IF(O7<O9,M7,M9))))))","v":"Blanc 2"},{"$f":"IF(OR(AND(O7=\"F\",O9=\"F\"),AND(O7=\"A\",O9=\"A\")),N9,IF(OR(O7=\"F\",O7=\"A\"),N7,IF(OR(O9=\"F\",O9=\"A\"),N9,IF(O7=O9,\"\",(IF(O7<O9,N7,N9))))))","v":"(NC)"},null,"Match 2 - Billard",null,null,null,{"$f":"IF(OR(AND(O7=\"F\",O9=\"F\"),AND(O7=\"A\",O9=\"A\")),M7,IF(OR(O7=\"F\",O7=\"A\"),M9,IF(OR(O9=\"F\",O9=\"A\"),M7,IF(O7=O9,\"\",(IF(O7>O9,M7,M9))))))","v":"MOREL SYLVAIN"},{"$f":"IF(OR(AND(O7=\"F\",O9=\"F\"),AND(O7=\"A\",O9=\"A\")),N7,IF(OR(O7=\"F\",O7=\"A\"),N9,IF(OR(O9=\"F\",O9=\"A\"),N7,IF(O7=O9,\"\",(IF(O7>O9,N7,N9))))))","v":"(11)"}]
[null,null,null,null,null,null,null,null,null,null,"P2",10,{"$f":"IF(IF(ISNA(VLOOKUP(L9,Inscrits!$A$2:$C$25,2,FALSE)),\"\",VLOOKUP(L9,Inscrits!$A$2:$C$25,2,FALSE))=0,\"\",IF(ISNA(VLOOKUP(L9,Inscrits!$A$2:$C$25,2,FALSE)),\"\",VLOOKUP(L9,Inscrits!$A$2:$C$25,2,FALSE)))","v":"MOREL SYLVAIN"},{"$f":"IF(IF(ISNA(VLOOKUP(L9,Inscrits!$A$2:$C$25,3,FALSE)),\"\",\"(\"&(VLOOKUP(L9,Inscrits!$A$2:$C$25,3,FALSE))&\")\")=\"()\",\"\",IF(ISNA(VLOOKUP(L9,Inscrits!$A$2:$C$25,3,FALSE)),\"\",\"(\"&(VLOOKUP(L9,Inscrits!$A$2:$C$25,3,FALSE))&\")\"))","v":"(11)"},null,null,"G2"]
[null,null,null,null,null,{"$f":"IF(OR(S14=\"F\",S14=\"A\"),Q14,IF(OR(S18=\"F\",S18=\"A\"),Q18,IF(S14=S18,\"\",(IF(S14<S18,Q14,Q18)))))","v":""},{"$f":"IF(OR(S14=\"F\",S14=\"A\"),R14,IF(OR(S18=\"F\",S18=\"A\"),R18,IF(S14=S18,\"\",(IF(S14<S18,R14,R18)))))","v":""}]
[null,null,null,null,null,null,"P6",null,null,null,null,null,null,null,null,null,null,null,null,null,"QUALIFIES"]
[null,null,null,null,null,null,null,null,null,null,null,null,null,null,null,null,null,null,null,null,null,null,null,null,null,null,null,null,null,null,null,null,null,null,null,null,null,null,null,null,null,null,"ELIMINES"]
[null,"QUALIFIES",null,null,null,null,null,null,null,null,"P3",15,{"$f":"IF(IF(ISNA(VLOOKUP(L13,Inscrits!$A$2:$C$25,2,FALSE)),\"\",VLOOKUP(L13,Inscrits!$A$2:$C$25,2,FALSE))=0,\"\",IF(ISNA(VLOOKUP(L13,Inscrits!$A$2:$C$25,2,FALSE)),\"\",VLOOKUP(L13,Inscrits!$A$2:$C$25,2,FALSE)))","v":"LE GOFF THIERRY"},{"$f":"IF(IF(ISNA(VLOOKUP(L13,Inscrits!$A$2:$C$25,3,FALSE)),\"\",\"(\"&(VLOOKUP(L13,Inscrits!$A$2:$C$25,3,FALSE))&\")\")=\"()\",\"\",IF(ISNA(VLOOKUP(L13,Inscrits!$A$2:$C$25,3,FALSE)),\"\",\"(\"&(VLOOKUP(L13,Inscrits!$A$2:$C$25,3,FALSE))&\")\"))","v":"(18)"},null,null,"G3",null,null,null,null,null,null,null,null,null,null,null,"G","P","G","P","G","P","G","P","G","P","G","P","Ga",null,null,"NOM","Ga"]
[null,null,null,null,null,null,null,null,null,{"$f":"IF(OR(AND(O13=\"F\",O15=\"F\"),AND(O13=\"A\",O15=\"A\")),M15,IF(OR(O13=\"F\",O13=\"A\"),M13,IF(OR(O15=\"F\",O15=\"A\"),M15,IF(O13=O15,\"\",(IF(O13<O15,M13,M15))))))","v":""},{"$f":"IF(OR(AND(O13=\"F\",O15=\"F\"),AND(O13=\"A\",O15=\"A\")),N15,IF(OR(O13=\"F\",O13=\"A\"),N13,IF(OR(O15=\"F\",O15=\"A\"),N15,IF(O13=O15,\"\",(IF(O13<O15,N13,N15))))))","v":""},null,"Match 3 - Billard",null,null,null,{"$f":"IF(OR(AND(O13=\"F\",O15=\"F\"),AND(O13=\"A\",O15=\"A\")),M13,IF(OR(O13=\"F\",O13=\"A\"),M15,IF(OR(O15=\"F\",O15=\"A\"),M13,IF(O13=O15,\"\",(IF(O13>O15,M13,M15))))))","v":""},{"$f":"IF(OR(AND(O13=\"F\",O15=\"F\"),AND(O13=\"A\",O15=\"A\")),N13,IF(OR(O13=\"F\",O13=\"A\"),N15,IF(OR(O15=\"F\",O15=\"A\"),N13,IF(O13=O15,\"\",(IF(O13>O15,N13,N15))))))","v":""},null,null,null,null,null,null,2,{"$f":"IF(U16=\"\",\"\",IF(U16=Q14,Q14,Q18))","v":""},null,{"$f":"M13","v":"LE GOFF THIERRY"},{"$f":"IF(AB14=M13,IF(O15=\"F\",\"\",O13),0)","v":0},{"$f":"IF(AB14=M13,IF(O13=\"F\",\"\",O15),0)","v":0},{"$f":"IF(AB14=Q14,IF(S18=\"F\",\"\",S14),0)","v":0},{"$f":"IF(AB14=Q14,IF(S14=\"F\",\"\",S18),0)","v":0},{"$f":"IF(AB14=J14,IF(I18=\"F\",\"\",I14),0)","v":0},{"$f":"IF(AB14=J14,IF(I14=\"F\",\"\",I18),0)","v":0},{"$f":"IF(AB14=F16,IF(E20=\"F\",\"\",E16),0)","v":0},{"$f":"IF(AB14=F16,IF(E16=\"F\",\"\",E20),0)","v":0},{"$f":"IF(AB14=F10,IF(E6=\"F\",\"\",E10),0)","v":0},{"$f":"IF(AB14=F10,IF(E10=\"F\",\"\",E6),0)","v":0},{"$f":"SUM(AC14,AE14,AG14,AI14,AK14)","v":0},0,{"$f":"AM14-AN14","v":0},null,null,{"$f":"Z6","v":""},{"$f":"IF(AR14=\"\",\"\",(VLOOKUP(AR14,AB4:AO17,14,FALSE)))","v":""}]
[null,null,null,null,null,null,"G8",null,null,null,null,18,{"$f":"IF(IF(ISNA(VLOOKUP(L15,Inscrits!$A$2:$C$25,2,FALSE)),\"\",VLOOKUP(L15,Inscrits!$A$2:$C$25,2,FALSE))=0,\"\",IF(ISNA(VLOOKUP(L15,Inscrits!$A$2:$C$25,2,FALSE)),\"\",VLOOKUP(L15,Inscrits!$A$2:$C$25,2,FALSE)))","v":"DI BELLA STEPHANIE"},{"$f":"IF(IF(ISNA(VLOOKUP(L15,Inscrits!$A$2:$C$25,3,FALSE)),\"\",\"(\"&(VLOOKUP(L15,Inscrits!$A$2:$C$25,3,FALSE))&\")\")=\"()\",\"\",IF(ISNA(VLOOKUP(L15,Inscrits!$A$2:$C$25,3,FALSE)),\"\",\"(\"&(VLOOKUP(L15,Inscrits!$A$2:$C$25,3,FALSE))&\")\"))","v":"(NC)"},null,null,null,null,null,null,"G6",null,null,null,4,{"$f":"IF(B18=\"\",\"\",IF(B18=F16,F16,F20))","v":""},null,{"$f":"M15","v":"DI BELLA STEPHANIE"},{"$f":"IF(AB15=M15,IF(O13=\"F\",\"\",O15),0)","v":0},{"$f":"IF(AB15=M15,IF(O15=\"F\",\"\",O13),0)","v":0},{"$f":"IF(AB15=Q14,IF(S18=\"F\",\"\",S14),0)","v":0},{"$f":"IF(AB15=Q14,IF(S14=\"F\",\"\",S18),0)","v":0},{"$f":"IF(AB15=J14,IF(I18=\"F\",\"\",I14),0)","v":0},{"$f":"IF(AB15=J14,IF(I14=\"F\",\"\",I18),0)","v":0},{"$f":"IF(AB15=F16,IF(E20=\"F\",\"\",E16),0)","v":0},{"$f":"IF(AB15=F16,IF(E16=\"F\",\"\",E20),0)","v":0},{"$f":"IF(AB15=F10,IF(E6=\"F\",\"\",E10),0)","v":0},{"$f":"IF(AB15=F10,IF(E10=\"F\",\"\",E6),0)","v":0},0,0,{"$f":"AM15-AN15","v":0},null,null,{"$f":"Z16","v":""},{"$f":"IF(AR15=\"\",\"\",(VLOOKUP(AR15,AB4:AO17,14,FALSE)))","v":""}]
[null,null,null,null,null,{"$f":"J14","v":""},{"$f":"K14","v":""},null,null,"Match 8 - Billard",null,null,null,null,null,null,"Match 6 - Billard",null,null,null,{"$f":"IF(OR(S14=\"F\",S14=\"A\"),Q18,IF(OR(S18=\"F\",S18=\"A\"),Q14,IF(S14=S18,\"\",(IF(S14>S18,Q14,Q18)))))","v":""},{"$f":"IF(OR(S14=\"F\",S14=\"A\"),R18,IF(OR(S18=\"F\",S18=\"A\"),R14,IF(S14=S18,\"\",(IF(S14>S18,R14,R18)))))","v":""},"H",null,6,{"$f":"IF(B18=\"\",\"\",IF(B18=F16,F20,F16))","v":""},null,{"$f":"M17","v":0},{"$f":"IF(AB16=M17,IF(O19=\"F\",\"\",O17),0)","v":0},{"$f":"IF(AB16=M17,IF(O17=\"F\",\"\",O19),0)","v":0},{"$f":"IF(AB16=Q18,IF(S14=\"F\",\"\",S18),0)","v":0},{"$f":"IF(AB16=Q18,IF(S18=\"F\",\"\",S14),0)","v":0},{"$f":"IF(AB16=J18,IF(I14=\"F\",\"\",I18),0)","v":0},{"$f":"IF(AB16=J18,IF(I18=\"F\",\"\",I14),0)","v":0},{"$f":"IF(AB16=F16,IF(E20=\"F\",\"\",E16),0)","v":0},{"$f":"IF(AB16=F16,IF(E16=\"F\",\"\",E20),0)","v":0},{"$f":"IF(AB16=F10,IF(E6=\"F\",\"\",E10),0)","v":0},{"$f":"IF(AB16=F10,IF(E10=\"F\",\"\",E6),0)","v":0},0,0,{"$f":"AM16-AN16","v":0}]
[null,null,"G10",null,null,null,null,null,null,null,null,null,null,null,null,null,null,null,null,null,null,null,null,null,8,{"$f":"IF(F16=\"\",\"\",IF(F16=J14,J18,J14))","v":""},null,{"$f":"M19","v":"BACCAM BOUNLIENG"},{"$f":"IF(AB17=M19,IF(O17=\"F\",\"\",O19),0)","v":0},{"$f":"IF(AB17=M19,IF(O19=\"F\",\"\",O17),0)","v":0},{"$f":"IF(AB17=Q18,IF(S14=\"F\",\"\",S18),0)","v":0},{"$f":"IF(AB17=Q18,IF(S18=\"F\",\"\",S14),0)","v":0},{"$f":"IF(AB17=J18,IF(I14=\"F\",\"\",I18),0)","v":0},{"$f":"IF(AB17=J18,IF(I18=\"F\",\"\",I14),0)","v":0},{"$f":"IF(AB17=F16,IF(E20=\"F\",\"\",E16),0)","v":0},{"$f":"IF(AB17=F16,IF(E16=\"F\",\"\",E20),0)","v":0},{"$f":"IF(AB17=F10,IF(E6=\"F\",\"\",E10),0)","v":0},{"$f":"IF(AB17=F10,IF(E10=\"F\",\"\",E6),0)","v":0},0,0,{"$f":"AM17-AN17","v":0}]
["Z",{"$f":"IF(OR(E16=\"F\",E16=\"A\"),F20,IF(OR(E20=\"F\",E20=\"A\"),F16,IF(E16=E20,\"\",(IF(E16>E20,F16,F20)))))","v":""},{"$f":"IF(OR(E16=\"F\",E16=\"A\"),G20,IF(OR(E20=\"F\",E20=\"A\"),G16,IF(E16=E20,\"\",(IF(E16>E20,G16,G20)))))","v":""},null,null,"Match 10 - Billard",null,null,null,null,null,null,"Match 4 - Billard",null,null,null,{"$f":"M19","v":"BACCAM BOUNLIENG"},{"$f":"N19","v":"(2)"}]
[null,null,null,null,null,null,null,null,null,null,"P4",2,{"$f":"IF(IF(ISNA(VLOOKUP(L19,Inscrits!$A$2:$C$25,2,FALSE)),\"\",VLOOKUP(L19,Inscrits!$A$2:$C$25,2,FALSE))=0,\"\",IF(ISNA(VLOOKUP(L19,Inscrits!$A$2:$C$25,2,FALSE)),\"\",VLOOKUP(L19,Inscrits!$A$2:$C$25,2,FALSE)))","v":"BACCAM BOUNLIENG"},{"$f":"IF(IF(ISNA(VLOOKUP(L19,Inscrits!$A$2:$C$25,3,FALSE)),\"\",\"(\"&(VLOOKUP(L19,Inscrits!$A$2:$C$25,3,FALSE))&\")\")=\"()\",\"\",IF(ISNA(VLOOKUP(L19,Inscrits!$A$2:$C$25,3,FALSE)),\"\",\"(\"&(VLOOKUP(L19,Inscrits!$A$2:$C$25,3,FALSE))&\")\"))","v":"(2)"},null,null,"G4"]
[null,null,null,null,null,{"$f":"IF(OR(S4=\"F\",S4=\"A\"),Q4,IF(OR(S8=\"F\",S8=\"A\"),Q8,IF(S4=S8,\"\",(IF(S4<S8,Q4,Q8)))))","v":""},{"$f":"IF(OR(S4=\"F\",S4=\"A\"),R4,IF(OR(S8=\"F\",S8=\"A\"),R8,IF(S4=S8,\"\",(IF(S4<S8,R4,R8)))))","v":""}]
[null,null,null,null,null,null,"P5",null,null,{"$f":"IF(Accueil!G18=3,\"\",\"MATCHS EN 4 GAGNANTES COTE PERDANT\")","v":""}]

{"sheet":"Final","index":7,"n_rows":35,"n_cols":35,"rows_kept":35,"cut":false,"hidden":false,"merged":[[1,5,1,7],[1,9,1,11],[1,13,1,15],[0,1,0,3],[1,1,1,3],[0,13,0,15],[0,9,0,11],[0,5,0,7]]}
[null,"1/8 de finale",null,null,null,"1/4 de finale",null,null,null,"1/2 finale",null,null,null,"Finale"]
[null,{"$f":"\"(\"&Accueil!D20&\" manches)\"","v":"(4 manches)"},null,null,null,{"$f":"\"(\"&Accueil!G20&\" manches)\"","v":"(4 manches)"},null,null,null,{"$f":"\"(\"&Accueil!D22&\" manches)\"","v":"(4 manches)"},null,null,null,{"$f":"\"(\"&Accueil!G22&\" manches)\"","v":"(5 manches)"}]
[null,"Match 1 - Billard",null,null,null,null,null,null,null,null,null,null,null,null,null,null,null,null,null,null,null,"JOUEURS","1/8","1/4","1/2","Finale","GA Final",null,"JOUEURS","GA Poules",null,"JOUEURS","GA Poules","GA Final","GA TOTAL"]
["A",{"$f":"IF('1'!U6=0,\"\",'1'!U6)","v":""},{"$f":"IF('1'!V6=0,\"\",'1'!V6)","v":""},null,null,null,null,null,null,null,null,null,null,null,null,null,null,null,null,null,null,{"$f":"B4","v":""},{"$f":"IF(AND(D4=\"A\",D5=\"A\"),0,IF(D4=\"A\",-D5,IF(D5=\"A\",D4,D4-D5)))","v":0},{"$f":"IF(F5=V4,IF(AND(H5=\"A\",H7=\"A\"),0,IF(OR(W4>0,D5=\"A\"),IF(H5=\"A\",-H7,IF(H7=\"A\",H5,H5-H7)),0)),0)","v":0},{"$f":"IF(J6=V4,IF(AND(L6=\"A\",L12=\"A\"),0,IF(OR(X4>0,H7=\"A\"),IF(L6=\"A\",-L12,IF(L12=\"A\",L6,L6-L12)),0)),0)","v":0},{"$f":"IF(N9=V4,IF(AND(P9=\"A\",P21=\"A\"),0,IF(OR(Y4>0,L12=\"A\"),IF(P9=\"A\",-P21,IF(P21=\"A\",P9,P9-P21)),0)),0)","v":0},{"$f":"SUM(W4:Z4)","v":0},null,{"$f":"'1'!AR4","v":""},{"$f":"'1'!AS4","v":""},null,{"$f":"IF(Inscrits!B2=0,\"\",Inscrits!B2)","v":"TEBBANI AZIZ"},{"$f":"VLOOKUP(AF4,$AC$4:$AD$35,2,FALSE)","v":{"$error":"#N/A"}},{"$f":"VLOOKUP(AF4,$V$4:$AA$35,6,FALSE)","v":{"$error":"#N/A"}},{"$f":"AG4+AH4","v":{"$error":"#N/A"}}]
["W",{"$f":"IF('3'!B8=0,\"\",'3'!B8)","v":""},{"$f":"IF('3'!C8=0,\"\",'3'!C8)","v":""},null,null,{"$f":"IF(AND(D4=\"A\",D5=\"A\"),B4,IF(D4=\"A\",B5,IF(D5=\"A\",B4,IF(D4=D5,\"\",(IF(D4>D5,B4,B5))))))","v":""},{"$f":"IF(AND(D4=\"A\",D5=\"A\"),C4,IF(D4=\"A\",C5,IF(D5=\"A\",C4,IF(D4=D5,\"\",(IF(D4>D5,C4,C5))))))","v":""},null,null,null,null,null,null,null,null,null,null,null,null,null,null,{"$f":"B5","v":""},{"$f":"IF(AND(D4=\"A\",D5=\"A\"),0,IF(D5=\"A\",-D4,IF(D4=\"A\",D5,D5-D4)))","v":0},{"$f":"IF(F5=V5,IF(AND(H5=\"A\",H7=\"A\"),0,IF(OR(W5>0,D4=\"A\"),IF(H5=\"A\",-H7,IF(H7=\"A\",H5,H5-H7)),0)),0)","v":0},{"$f":"IF(J6=V5,IF(AND(L6=\"A\",L12=\"A\"),0,IF(OR(X5>0,H7=\"A\"),IF(L6=\"A\",-L12,IF(L12=\"A\",L6,L6-L12)),0)),0)","v":0},{"$f":"IF(N9=V5,IF(AND(P9=\"A\",P21=\"A\"),0,IF(OR(Y5>0,L12=\"A\"),IF(P9=\"A\",-P21,IF(P21=\"A\",P9,P9-P21)),0)),0)","v":0},{"$f":"SUM(W5:Z5)","v":0},null,{"$f":"'1'!AR5","v":""},{"$f":"'1'!AS5","v":""},null,{"$f":"IF(Inscrits!B3=0,\"\",Inscrits!B3)","v":"BACCAM BOUNLIENG"},{"$f":"VLOOKUP(AF5,$AC$4:$AD$35,2,FALSE)","v":{"$error":"#N/A"}},{"$f":"VLOOKUP(AF5,$V$4:$AA$35,6,FALSE)","v":{"$error":"#N/A"}},{"$error":"#N/A"}]
[null,"Match 2 - Billard",null,null,null,"Match 9 - Billard",null,null,null,{"$f":"IF(AND(H5=\"A\",H7=\"A\"),F5,IF(H5=\"A\",F7,IF(H7=\"A\",F5,IF(H5=H7,\"\",(IF(H5>H7,F5,F7))))))","v":""},{"$f":"IF(AND(H5=\"A\",H7=\"A\"),G5,IF(H5=\"A\",G7,IF(H7=\"A\",G5,IF(H5=H7,\"\",(IF(H5>H7,G5,G7))))))","v":""},null,null,null,null,null,null,null,null,null,null,{"$f":"B7","v":""},{"$f":"IF(AND(D7=\"A\",D8=\"A\"),0,IF(D7=\"A\",-D8,IF(D8=\"A\",D7,D7-D8)))","v":0},{"$f":"IF(F7=V6,IF(AND(H5=\"A\",H7=\"A\"),0,IF(OR(W6>0,D8=\"A\"),IF(H7=\"A\",-H5,IF(H5=\"A\",H7,H7-H5)),0)),0)","v":0},{"$f":"IF(J6=V6,IF(AND(L6=\"A\",L12=\"A\"),0,IF(OR(X6>0,H5=\"A\"),IF(L6=\"A\",-L12,IF(L12=\"A\",L6,L6-L12)),0)),0)","v":0},{"$f":"IF(N9=V6,IF(AND(P9=\"A\",P21=\"A\"),0,IF(OR(Y6>0,L12=\"A\"),IF(P9=\"A\",-P21,IF(P21=\"A\",P9,P9-P21)),0)),0)","v":0},0,null,{"$f":"'1'!AR6","v":""},{"$f":"'1'!AS6","v":""},null,{"$f":"IF(Inscrits!B4=0,\"\",Inscrits!B4)","v":"REDON VALERIE"},{"$error":"#N/A"},{"$error":"#N/A"},{"$error":"#N/A"}]
["B",{"$f":"IF('1'!U16=0,\"\",'1'!U16)","v":""},{"$f":"IF('1'!V16=0,\"\",'1'!V16)","v":""},null,null,{"$f":"IF(AND(D7=\"A\",D8=\"A\"),B7,IF(D7=\"A\",B8,IF(D8=\"A\",B7,IF(D7=D8,\"\",(IF(D7>D8,B7,B8))))))","v":""},{"$f":"IF(AND(D7=\"A\",D8=\"A\"),C7,IF(D7=\"A\",C8,IF(D8=\"A\",C7,IF(D7=D8,\"\",(IF(D7>D8,C7,C8))))))","v":""},null,null,null,null,null,null,null,null,null,null,null,null,null,null,{"$f":"B8","v":""},{"$f":"IF(AND(D7=\"A\",D8=\"A\"),0,IF(D8=\"A\",-D7,IF(D7=\"A\",D8,D8-D7)))","v":0},{"$f":"IF(F7=V7,IF(AND(H5=\"A\",H7=\"A\"),0,IF(OR(W7>0,D7=\"A\"),IF(H7=\"A\",-H5,IF(H5=\"A\",H7,H7-H5)),0)),0)","v":0},{"$f":"IF(J6=V7,IF(AND(L6=\"A\",L12=\"A\"),0,IF(OR(X7>0,H5=\"A\"),IF(L6=\"A\",-L12,IF(L12=\"A\",L6,L6-L12)),0)),0)","v":0},{"$f":"IF(N9=V7,IF(AND(P9=\"A\",P21=\"A\"),0,IF(OR(Y7>0,L12=\"A\"),IF(P9=\"A\",-P21,IF(P21=\"A\",P9,P9-P21)),0)),0)","v":0},0,null,{"$f":"'1'!AR7","v":""},{"$f":"'1'!AS7","v":""},null,{"$f":"IF(Inscrits!B5=0,\"\",Inscrits!B5)","v":"PARDO RAMON"},{"$error":"#N/A"},{"$error":"#N/A"},{"$error":"#N/A"}]
["X",{"$f":"IF('4'!B18=0,\"\",'4'!B18)","v":""},{"$f":"IF('4'!C18=0,\"\",'4'!C18)","v":""},null,null,null,null,null,null,null,null,null,null,null,null,null,null,null,null,null,null,{"$f":"B10","v":""},{"$f":"IF(AND(D10=\"A\",D11=\"A\"),0,IF(D10=\"A\",-D11,IF(D11=\"A\",D10,D10-D11)))","v":0},{"$f":"IF(F11=V8,IF(AND(H11=\"A\",H13=\"A\"),0,IF(OR(W8>0,D11=\"A\"),IF(H11=\"A\",-H13,IF(H13=\"A\",H11,H11-H13)),0)),0)","v":0},{"$f":"IF(J12=V8,IF(AND(L6=\"A\",L12=\"A\"),0,IF(OR(X8>0,H13=\"A\"),IF(L12=\"A\",-L6,IF(L6=\"A\",L12,L12-L6)),0)),0)","v":0},{"$f":"IF(N9=V8,IF(AND(P9=\"A\",P21=\"A\"),0,IF(OR(Y8>0,L6=\"A\"),IF(P9=\"A\",-P21,IF(P21=\"A\",P9,P9-P21)),0)),0)","v":0},0,null,{"$f":"'1'!AR14","v":""},{"$f":"'1'!AS14","v":""},null,{"$f":"IF(Inscrits!B6=0,\"\",Inscrits!B6)","v":"VAPILLON DANIEL"},{"$error":"#N/A"},{"$error":"#N/A"},{"$error":"#N/A"}]
[null,"Match 3 - Billard",null,null,null,null,null,null,null,"Match 13 - Billard",null,null,null,{"$f":"IF(AND(L6=\"A\",L12=\"A\"),J6,IF(L6=\"A\",J12,IF(L12=\"A\",J6,IF(L6=L12,\"\",(IF(L6>L12,J6,J12))))))","v":""},{"$f":"IF(AND(L6=\"A\",L12=\"A\"),K6,IF(L6=\"A\",K12,IF(L12=\"A\",K6,IF(L6=L12,\"\",(IF(L6>L12,K6,K12))))))","v":""},null,null,null,null,null,null,{"$f":"B11","v":""},{"$f":"IF(AND(D10=\"A\",D11=\"A\"),0,IF(D11=\"A\",-D10,IF(D10=\"A\",D11,D11-D10)))","v":0},{"$f":"IF(F11=V9,IF(AND(H11=\"A\",H13=\"A\"),0,IF(OR(W9>0,D10=\"A\"),IF(H11=\"A\",-H13,IF(H13=\"A\",H11,H11-H13)),0)),0)","v":0},{"$f":"IF(J12=V9,IF(AND(L6=\"A\",L12=\"A\"),0,IF(OR(X9>0,H13=\"A\"),IF(L12=\"A\",-L6,IF(L6=\"A\",L12,L12-L6)),0)),0)","v":0},{"$f":"IF(N9=V9,IF(AND(P9=\"A\",P21=\"A\"),0,IF(OR(Y9>0,L6=\"A\"),IF(P9=\"A\",-P21,IF(P21=\"A\",P9,P9-P21)),0)),0)","v":0},0,null,{"$f":"'1'!AR15","v":""},{"$f":"'1'!AS15","v":""},null,{"$f":"IF(Inscrits!B7=0,\"\",Inscrits!B7)","v":"BRENDEL CHRISTIAN"},{"$error":"#N/A"},{"$error":"#N/A"},{"$error":"#N/A"}]
["C",{"$f":"IF('2'!U6=0,\"\",'2'!U6)","v":""},{"$f":"IF('2'!V6=0,\"\",'2'!V6)","v":""},null,null,null,null,null,null,null,null,null,null,null,null,null,null,null,null,null,null,{"$f":"B13","v":""},{"$f":"IF(AND(D13=\"A\",D14=\"A\"),0,IF(D13=\"A\",-D14,IF(D14=\"A\",D13,D13-D14)))","v":0},{"$f":"IF(F13=V10,IF(AND(H11=\"A\",H13=\"A\"),0,IF(OR(W10>0,D14=\"A\"),IF(H13=\"A\",-H11,IF(H11=\"A\",H13,H13-H11)),0)),0)","v":0},{"$f":"IF(J12=V10,IF(AND(L6=\"A\",L12=\"A\"),0,IF(OR(X10>0,H11=\"A\"),IF(L12=\"A\",-L6,IF(L6=\"A\",L12,L12-L6)),0)),0)","v":0},{"$f":"IF(N9=V10,IF(AND(P9=\"A\",P21=\"A\"),0,IF(OR(Y10>0,L6=\"A\"),IF(P9=\"A\",-P21,IF(P21=\"A\",P9,P9-P21)),0)),0)","v":0},0,null,{"$f":"'1'!AR16","v":0},{"$f":"'1'!AS16","v":0},null,{"$f":"IF(Inscrits!B8=0,\"\",Inscrits!B8)","v":"MANDY NATHALIE"},{"$error":"#N/A"},{"$error":"#N/A"},{"$error":"#N/A"}]
["Y",{"$f":"IF('4'!B8=0,\"\",'4'!B8)","v":""},{"$f":"IF('4'!C8=0,\"\",'4'!C8)","v":""},null,null,{"$f":"IF(AND(D10=\"A\",D11=\"A\"),B10,IF(D10=\"A\",B11,IF(D11=\"A\",B10,IF(D10=D11,\"\",(IF(D10>D11,B10,B11))))))","v":""},{"$f":"IF(AND(D10=\"A\",D11=\"A\"),C10,IF(D10=\"A\",C11,IF(D11=\"A\",C10,IF(D10=D11,\"\",(IF(D10>D11,C10,C11))))))","v":""},null,null,null,null,null,null,null,null,null,null,null,null,null,null,{"$f":"B14","v":""},{"$f":"IF(AND(D13=\"A\",D14=\"A\"),0,IF(D14=\"A\",-D13,IF(D13=\"A\",D14,D14-D13)))","v":0},{"$f":"IF(F13=V11,IF(AND(H11=\"A\",H13=\"A\"),0,IF(OR(W11>0,D13=\"A\"),IF(H13=\"A\",-H11,IF(H11=\"A\",H13,H13-H11)),0)),0)","v":0},{"$f":"IF(J12=V11,IF(AND(L6=\"A\",L12=\"A\"),0,IF(OR(X11>0,H11=\"A\"),IF(L12=\"A\",-L6,IF(L6=\"A\",L12,L12-L6)),0)),0)","v":0},{"$f":"IF(N9=V11,IF(AND(P9=\"A\",P21=\"A\"),0,IF(OR(Y11>0,L6=\"A\"),IF(P9=\"A\",-P21,IF(P21=\"A\",P9,P9-P21)),0)),0)","v":0},0,null,{"$f":"'1'!AR17","v":0},{"$f":"'1'!AS17","v":0},null,{"$f":"IF(Inscrits!B9=0,\"\",Inscrits!B9)","v":"KLEIN STEPHANE"},{"$error":"#N/A"},{"$error":"#N/A"},{"$error":"#N/A"}]
[null,"Match 4 - Billard",null,null,null,"Match 10 - Billard",null,null,null,{"$f":"IF(AND(H11=\"A\",H13=\"A\"),F11,IF(H11=\"A\",F13,IF(H13=\"A\",F11,IF(H11=H13,\"\",(IF(H11>H13,F11,F13))))))","v":""},{"$f":"IF(AND(H11=\"A\",H13=\"A\"),G11,IF(H11=\"A\",G13,IF(H13=\"A\",G11,IF(H11=H13,\"\",(IF(H11>H13,G11,G13))))))","v":""},null,null,null,null,null,null,null,null,null,null,{"$f":"B16","v":""},{"$f":"IF(AND(D16=\"A\",D17=\"A\"),0,IF(D16=\"A\",-D17,IF(D17=\"A\",D16,D16-D17)))","v":0},{"$f":"IF(F17=V12,IF(AND(H17=\"A\",H19=\"A\"),0,IF(OR(W12>0,D17=\"A\"),IF(H17=\"A\",-H19,IF(H19=\"A\",H17,H17-H19)),0)),0)","v":0},{"$f":"IF(J18=V12,IF(AND(L18=\"A\",L24=\"A\"),0,IF(OR(X12>0,H19=\"A\"),IF(L18=\"A\",-L24,IF(L24=\"A\",L18,L18-L24)),0)),0)","v":0},{"$f":"IF(N21=V12,IF(AND(P9=\"A\",P21=\"A\"),0,IF(OR(Y12>0,L24=\"A\"),IF(P21=\"A\",-P9,IF(P9=\"A\",P21,P21-P9)),0)),0)","v":0},0,null,{"$f":"'2'!AR4","v":""},{"$f":"'2'!AS4","v":""},null,{"$f":"IF(Inscrits!B10=0,\"\",Inscrits!B10)","v":"HERRY MIREILLE"},{"$error":"#N/A"},{"$error":"#N/A"},{"$error":"#N/A"}]
["D",{"$f":"IF('2'!U16=0,\"\",'2'!U16)","v":""},{"$f":"IF('2'!V16=0,\"\",'2'!V16)","v":""},null,null,{"$f":"IF(AND(D13=\"A\",D14=\"A\"),B13,IF(D13=\"A\",B14,IF(D14=\"A\",B13,IF(D13=D14,\"\",(IF(D13>D14,B13,B14))))))","v":""},{"$f":"IF(AND(D13=\"A\",D14=\"A\"),C13,IF(D13=\"A\",C14,IF(D14=\"A\",C13,IF(D13=D14,\"\",(IF(D13>D14,C13,C14))))))","v":""},null,null,null,null,null,null,null,null,null,null,null,null,null,null,{"$f":"B17","v":""},{"$f":"IF(AND(D16=\"A\",D17=\"A\"),0,IF(D17=\"A\",-D16,IF(D16=\"A\",D17,D17-D16)))","v":0},{"$f":"IF(F17=V13,IF(AND(H17=\"A\",H19=\"A\"),0,IF(OR(W13>0,D16=\"A\"),IF(H17=\"A\",-H19,IF(H19=\"A\",H17,H17-H19)),0)),0)","v":0},{"$f":"IF(J18=V13,IF(AND(L18=\"A\",L24=\"A\"),0,IF(OR(X13>0,H19=\"A\"),IF(L18=\"A\",-L24,IF(L24=\"A\",L18,L18-L24)),0)),0)","v":0},{"$f":"IF(N21=V13,IF(AND(P9=\"A\",P21=\"A\"),0,IF(OR(Y13>0,L24=\"A\"),IF(P21=\"A\",-P9,IF(P9=\"A\",P21,P21-P9)),0)),0)","v":0},0,null,{"$f":"'2'!AR5","v":""},{"$f":"'2'!AS5","v":""},null,{"$f":"IF(Inscrits!B11=0,\"\",Inscrits!B11)","v":"MOREL SYLVAIN"},{"$error":"#N/A"},{"$error":"#N/A"},{"$error":"#N/A"}]
["Z",{"$f":"IF('3'!B18=0,\"\",'3'!B18)","v":""},{"$f":"IF('3'!C18=0,\"\",'3'!C18)","v":""},null,null,null,null,null,null,null,null,null,null,null,null,null,null,null,null,null,null,{"$f":"B19","v":""},{"$f":"IF(AND(D19=\"A\",D20=\"A\"),0,IF(D19=\"A\",-D20,IF(D20=\"A\",D19,D19-D20)))","v":0},{"$f":"IF(F19=V14,IF(AND(H17=\"A\",H19=\"A\"),0,IF(OR(W14>0,D20=\"A\"),IF(H19=\"A\",-H17,IF(H17=\"A\",H19,H19-H17)),0)),0)","v":0},{"$f":"IF(J18=V14,IF(AND(L18=\"A\",L24=\"A\"),0,IF(OR(X14>0,H17=\"A\"),IF(L18=\"A\",-L24,IF(L24=\"A\",L18,L18-L24)),0)),0)","v":0},{"$f":"IF(N21=V14,IF(AND(P9=\"A\",P21=\"A\"),0,IF(OR(Y14>0,L24=\"A\"),IF(P21=\"A\",-P9,IF(P9=\"A\",P21,P21-P9)),0)),0)","v":0},0,null,{"$f":"'2'!AR6","v":""},{"$f":"'2'!AS6","v":""},null,{"$f":"IF(Inscrits!B12=0,\"\",Inscrits!B12)","v":"ROZIER MYRIAM"},{"$error":"#N/A"},{"$error":"#N/A"},{"$error":"#N/A"}]
[null,"Match 5 - Billard",null,null,null,null,null,null,null,null,null,null,null,"Match 15 - Billard",null,null,null,{"$f":"IF(AND(P9=\"A\",P21=\"A\"),N9,IF(P9=\"A\",N21,IF(P21=\"A\",N9,IF(P9=P21,\"\",(IF(P9>P21,N9,N21))))))","v":""},{"$f":"IF(AND(P9=\"F\",P21=\"F\"),O9,IF(P9=\"F\",O21,IF(P21=\"F\",O9,IF(P9=P21,\"\",(IF(P9>P21,O9,O21))))))","v":""},null,null,{"$f":"B20","v":""},{"$f":"IF(AND(D19=\"A\",D20=\"A\"),0,IF(D20=\"A\",-D19,IF(D19=\"A\",D20,D20-D19)))","v":0},{"$f":"IF(F19=V15,IF(AND(H17=\"A\",H19=\"A\"),0,IF(OR(W15>0,D19=\"A\"),IF(H19=\"A\",-H17,IF(H17=\"A\",H19,H19-H17)),0)),0)","v":0},{"$f":"IF(J18=V15,IF(AND(L18=\"A\",L24=\"A\"),0,IF(OR(X15>0,H17=\"A\"),IF(L18=\"A\",-L24,IF(L24=\"A\",L18,L18-L24)),0)),0)","v":0},{"$f":"IF(N21=V15,IF(AND(P9=\"A\",P21=\"A\"),0,IF(OR(Y15>0,L24=\"A\"),IF(P21=\"A\",-P9,IF(P9=\"A\",P21,P21-P9)),0)),0)","v":0},0,null,{"$f":"'2'!AR7","v":""},{"$f":"'2'!AS7","v":""},null,{"$f":"IF(Inscrits!B13=0,\"\",Inscrits!B13)","v":"NOCERA GIUSEPPE"},{"$error":"#N/A"},{"$error":"#N/A"},{"$error":"#N/A"}]
["E",{"$f":"IF('3'!U6=0,\"\",'3'!U6)","v":""},{"$f":"IF('3'!V6=0,\"\",'3'!V6)","v":""},null,null,null,null,null,null,null,null,null,null,null,null,null,null,null,null,null,null,{"$f":"B22","v":""},{"$f":"IF(AND(D22=\"A\",D23=\"A\"),0,IF(D22=\"A\",-D23,IF(D23=\"A\",D22,D22-D23)))","v":0},{"$f":"IF(F23=V16,IF(AND(H23=\"A\",H25=\"A\"),0,IF(OR(W16>0,D23=\"A\"),IF(H23=\"A\",-H25,IF(H25=\"A\",H23,H23-H25)),0)),0)","v":0},{"$f":"IF(J24=V16,IF(AND(L18=\"A\",L24=\"A\"),0,IF(OR(X16>0,H25=\"A\"),IF(L24=\"A\",-L18,IF(L18=\"A\",L24,L24-L18)),0)),0)","v":0},{"$f":"IF(N21=V16,IF(AND(P9=\"A\",P21=\"A\"),0,IF(OR(Y16>0,L18=\"A\"),IF(P21=\"A\",-P9,IF(P9=\"A\",P21,P21-P9)),0)),0)","v":0},0,null,{"$f":"'2'!AR14","v":""},{"$f":"'2'!AS14","v":""},null,{"$f":"IF(Inscrits!B14=0,\"\",Inscrits!B14)","v":"MIRTO EVELYNE"},{"$error":"#N/A"},{"$error":"#N/A"},{"$error":"#N/A"}]
["S",{"$f":"IF('2'!B8=0,\"\",'2'!B8)","v":""},{"$f":"IF('2'!C8=0,\"\",'2'!C8)","v":""},null,null,{"$f":"IF(AND(D16=\"A\",D17=\"A\"),B16,IF(D16=\"A\",B17,IF(D17=\"A\",B16,IF(D16=D17,\"\",(IF(D16>D17,B16,B17))))))","v":""},{"$f":"IF(AND(D16=\"A\",D17=\"A\"),C16,IF(D16=\"A\",C17,IF(D17=\"A\",C16,IF(D16=D17,\"\",(IF(D16>D17,C16,C17))))))","v":""},null,null,null,null,null,null,null,null,null,null,null,null,null,null,{"$f":"B23","v":""},{"$f":"IF(AND(D22=\"A\",D23=\"A\"),0,IF(D23=\"A\",-D22,IF(D22=\"A\",D23,D23-D22)))","v":0},{"$f":"IF(F23=V17,IF(AND(H23=\"A\",H25=\"A\"),0,IF(OR(W17>0,D22=\"A\"),IF(H23=\"A\",-H25,IF(H25=\"A\",H23,H23-H25)),0)),0)","v":0},{"$f":"IF(J24=V17,IF(AND(L18=\"A\",L24=\"A\"),0,IF(OR(X17>0,H25=\"A\"),IF(L24=\"A\",-L18,IF(L18=\"A\",L24,L24-L18)),0)),0)","v":0},{"$f":"IF(N21=V17,IF(AND(P9=\"A\",P21=\"A\"),0,IF(OR(Y17>0,L18=\"A\"),IF(P21=\"A\",-P9,IF(P9=\"A\",P21,P21-P9)),0)),0)","v":0},0,null,{"$f":"'2'!AR15","v":""},{"$f":"'2'!AS15","v":""},null,{"$f":"IF(Inscrits!B15=0,\"\",Inscrits!B15)","v":"BOBROSKY BERNARD"},{"$error":"#N/A"},{"$error":"#N/A"},{"$error":"#N/A"}]
[null,"Match 6 - Billard",null,null,null,"Match 11 - Billard",null,null,null,{"$f":"IF(AND(H17=\"A\",H19=\"A\"),F17,IF(H17=\"A\",F19,IF(H19=\"A\",F17,IF(H17=H19,\"\",(IF(H17>H19,F17,F19))))))","v":""},{"$f":"IF(AND(H17=\"A\",H19=\"A\"),G17,IF(H17=\"A\",G19,IF(H19=\"A\",G17,IF(H17=H19,\"\",(IF(H17>H19,G17,G19))))))","v":""},null,null,null,null,null,null,null,null,null,null,{"$f":"B25","v":""},{"$f":"IF(AND(D25=\"A\",D26=\"A\"),0,IF(D25=\"A\",-D26,IF(D26=\"A\",D25,D25-D26)))","v":0},{"$f":"IF(F25=V18,IF(AND(H23=\"A\",H25=\"A\"),0,IF(OR(W18>0,D26=\"A\"),IF(H25=\"A\",-H23,IF(H23=\"A\",H25,H25-H23)),0)),0)","v":0},{"$f":"IF(J24=V18,IF(AND(L18=\"A\",L24=\"A\"),0,IF(OR(X18>0,H23=\"A\"),IF(L24=\"A\",-L18,IF(L18=\"A\",L24,L24-L18)),0)),0)","v":0},{"$f":"IF(N21=V18,IF(AND(P9=\"A\",P21=\"A\"),0,IF(OR(Y18>0,L18=\"A\"),IF(P21=\"A\",-P9,IF(P9=\"A\",P21,P21-P9)),0)),0)","v":0},0,null,{"$f":"'2'!AR16","v":0},{"$f":"'2'!AS16","v":0},null,{"$f":"IF(Inscrits!B16=0,\"\",Inscrits!B16)","v":"LE GOFF THIERRY"},{"$error":"#N/A"},{"$error":"#N/A"},{"$error":"#N/A"}]
["F",{"$f":"IF('3'!U16=0,\"\",'3'!U16)","v":""},{"$f":"IF('3'!V16=0,\"\",'3'!V16)","v":""},null,null,{"$f":"IF(AND(D19=\"A\",D20=\"A\"),B19,IF(D19=\"A\",B20,IF(D20=\"A\",B19,IF(D19=D20,\"\",(IF(D19>D20,B19,B20))))))","v":""},{"$f":"IF(AND(D19=\"A\",D20=\"A\"),C19,IF(D19=\"A\",C20,IF(D20=\"A\",C19,IF(D19=D20,\"\",(IF(D19>D20,C19,C20))))))","v":""},null,null,null,null,null,null,null,null,null,null,null,null,null,null,{"$f":"B26","v":""},{"$f":"IF(AND(D25=\"A\",D26=\"A\"),0,IF(D26=\"A\",-D25,IF(D25=\"A\",D26,D26-D25)))","v":0},{"$f":"IF(F25=V19,IF(AND(H23=\"A\",H25=\"A\"),0,IF(OR(W19>0,D25=\"A\"),IF(H25=\"A\",-H23,IF(H23=\"A\",H25,H25-H23)),0)),0)","v":0},{"$f":"IF(J24=V19,IF(AND(L18=\"A\",L24=\"A\"),0,IF(OR(X19>0,H23=\"A\"),IF(L24=\"A\",-L18,IF(L18=\"A\",L24,L24-L18)),0)),0)","v":0},{"$f":"IF(N21=V19,IF(AND(P9=\"A\",P21=\"A\"),0,IF(OR(Y19>0,L18=\"A\"),IF(P21=\"A\",-P9,IF(P9=\"A\",P21,P21-P9)),0)),0)","v":0},0,null,{"$f":"'2'!AR17","v":0},{"$f":"'2'!AS17","v":0},null,{"$f":"IF(Inscrits!B17=0,\"\",Inscrits!B17)","v":"BRUNET MAURICE"},{"$error":"#N/A"},{"$error":"#N/A"},{"$error":"#N/A"}]
["T",{"$f":"IF('1'!B18=0,\"\",'1'!B18)","v":""},{"$f":"IF('1'!C18=0,\"\",'1'!C18)","v":""},null,null,null,null,null,null,null,null,null,null,null,null,null,null,null,null,null,null,{"$f":"'1'!AR14","v":""},null,null,null,null,0,null,{"$f":"'3'!AR4","v":""},{"$f":"'3'!AS4","v":""},null,{"$f":"IF(Inscrits!B19=0,\"\",Inscrits!B19)","v":"DI BELLA STEPHANIE"},{"$error":"#N/A"},{"$error":"#N/A"},{"$error":"#N/A"}]
[null,"Match 7 - Billard",null,null,null,null,null,null,null,"Match 14 - Billard",null,null,null,{"$f":"IF(AND(L18=\"A\",L24=\"A\"),J18,IF(L18=\"A\",J24,IF(L24=\"A\",J18,IF(L18=L24,\"\",(IF(L18>L24,J18,J24))))))","v":""},{"$f":"IF(AND(L18=\"A\",L24=\"A\"),K18,IF(L18=\"A\",K24,IF(L24=\"A\",K18,IF(L18=L24,\"\",(IF(L18>L24,K18,K24))))))","v":""},null,null,null,null,null,null,{"$f":"'1'!AR15","v":""},null,null,null,null,0,null,{"$f":"'3'!AR5","v":""},{"$f":"'3'!AS5","v":""},null,{"$f":"IF(Inscrits!B20=0,\"\",Inscrits!B20)","v":"LACROIX VALERIE"},{"$error":"#N/A"},{"$error":"#N/A"},{"$error":"#N/A"}]
["G",{"$f":"IF('4'!U6=0,\"\",'4'!U6)","v":""},{"$f":"IF('4'!V6=0,\"\",'4'!V6)","v":""},null,null,null,null,null,null,null,null,null,null,null,null,null,null,null,null,null,null,{"$f":"'1'!AR16","v":0},null,null,null,null,0,null,{"$f":"'3'!AR6","v":""},{"$f":"'3'!AS6","v":""},null,{"$f":"IF(Inscrits!B21=0,\"\",Inscrits!B21)","v":"SOPIC NICOLAS"},{"$error":"#N/A"},{"$error":"#N/A"},{"$error":"#N/A"}]
["U",{"$f":"IF('1'!B8=0,\"\",'1'!B8)","v":""},{"$f":"IF('1'!C8=0,\"\",'1'!C8)","v":""},null,null,{"$f":"IF(AND(D22=\"A\",D23=\"A\"),B22,IF(D22=\"A\",B23,IF(D23=\"A\",B22,IF(D22=D23,\"\",(IF(D22>D23,B22,B23))))))","v":""},{"$f":"IF(AND(D22=\"A\",D23=\"A\"),C22,IF(D22=\"A\",C23,IF(D23=\"A\",C22,IF(D22=D23,\"\",(IF(D22>D23,C22,C23))))))","v":""},null,null,null,null,null,null,null,null,null,null,null,null,null,null,{"$f":"'1'!AR17","v":0},null,null,null,null,0,null,{"$f":"'3'!AR7","v":""},{"$f":"'3'!AS7","v":""},null,{"$f":"IF(Inscrits!#REF!=0,\"\",Inscrits!#REF!)","v":{"$error":"#REF!"}},{"$error":"#REF!"},{"$error":"#REF!"},{"$error":"#REF!"}]
[null,"Match 8 - Billard",null,null,null,"Match 12 - Billard",null,null,null,{"$f":"IF(AND(H23=\"A\",H25=\"A\"),F23,IF(H23=\"A\",F25,IF(H25=\"A\",F23,IF(H23=H25,\"\",(IF(H23>H25,F23,F25))))))","v":""},{"$f":"IF(AND(H23=\"A\",H25=\"A\"),G23,IF(H23=\"A\",G25,IF(H25=\"A\",G23,IF(H23=H25,\"\",(IF(H23>H25,G23,G25))))))","v":""},null,null,null,null,null,null,null,null,null,null,{"$f":"'2'!AR14","v":""},null,null,null,null,0,null,{"$f":"'3'!AR14","v":""},{"$f":"'3'!AS14","v":""},null,{"$f":"IF(Inscrits!B22=0,\"\",Inscrits!B22)","v":"LAPIERRE ERIC"},{"$error":"#N/A"},{"$error":"#N/A"},{"$error":"#N/A"}]
["H",{"$f":"IF('4'!U16=0,\"\",'4'!U16)","v":""},{"$f":"IF('4'!V16=0,\"\",'4'!V16)","v":""},null,null,{"$f":"IF(AND(D25=\"A\",D26=\"A\"),B25,IF(D25=\"A\",B26,IF(D26=\"A\",B25,IF(D25=D26,\"\",(IF(D25>D26,B25,B26))))))","v":""},{"$f":"IF(AND(D25=\"A\",D26=\"A\"),C25,IF(D25=\"A\",C26,IF(D26=\"A\",C25,IF(D25=D26,\"\",(IF(D25>D26,C25,C26))))))","v":""},null,null,null,null,null,null,null,null,null,null,null,null,null,null,{"$f":"'2'!AR15","v":""},null,null,null,null,0,null,{"$f":"'3'!AR15","v":""},{"$f":"'3'!AS15","v":""},null,{"$f":"IF(Inscrits!B23=0,\"\",Inscrits!B23)","v":"Blanc 1"},{"$error":"#N/A"},{"$error":"#N/A"},{"$error":"#N/A"}]
["V",{"$f":"IF('2'!B18=0,\"\",'2'!B18)","v":""},{"$f":"IF('2'!C18=0,\"\",'2'!C18)","v":""},null,null,null,null,null,null,null,null,null,null,null,null,null,null,null,null,null,null,{"$f":"'2'!AR16","v":0},null,null,null,null,0,null,{"$f":"'3'!AR16","v":0},{"$f":"'3'!AS16","v":0},null,{"$f":"IF(Inscrits!B24=0,\"\",Inscrits!B24)","v":"Blanc 2"},{"$error":"#N/A"},{"$error":"#N/A"},{"$error":"#N/A"}]
[null,null,null,null,null,null,null,null,null,null,null,null,null,null,null,null,null,null,null,null,null,{"$f":"'2'!AR17","v":0},null,null,null,null,0,null,{"$f":"'3'!AR17","v":0},{"$f":"'3'!AS17","v":0},null,{"$f":"IF(Inscrits!B25=0,\"\",Inscrits!B25)","v":"Blanc 3"},{"$error":"#N/A"},{"$error":"#N/A"},{"$error":"#N/A"}]
[null,null,null,null,null,null,null,null,null,null,null,null,null,null,null,null,null,null,null,null,null,{"$f":"'3'!AR14","v":""},null,null,null,null,0,null,{"$f":"'4'!AR4","v":""},{"$f":"'4'!AS4","v":""},null,{"$f":"IF(Inscrits!#REF!=0,\"\",Inscrits!#REF!)","v":{"$error":"#REF!"}},{"$error":"#REF!"},{"$error":"#REF!"},{"$error":"#REF!"}]
[null,null,null,null,null,null,null,null,null,null,null,null,null,null,null,null,null,null,null,null,null,{"$f":"'3'!AR15","v":""},null,null,null,null,0,null,{"$f":"'4'!AR5","v":""},{"$f":"'4'!AS5","v":""},null,{"$f":"IF(Inscrits!#REF!=0,\"\",Inscrits!#REF!)","v":{"$error":"#REF!"}},{"$error":"#REF!"},{"$error":"#REF!"},{"$error":"#REF!"}]
[null,null,null,null,null,null,null,null,null,null,null,null,null,null,null,null,null,null,null,null,null,{"$f":"'3'!AR16","v":0},null,null,null,null,0,null,{"$f":"'4'!AR6","v":""},{"$f":"'4'!AS6","v":""},null,{"$f":"IF(Inscrits!#REF!=0,\"\",Inscrits!#REF!)","v":{"$error":"#REF!"}},{"$error":"#REF!"},{"$error":"#REF!"},{"$error":"#REF!"}]
[null,null,null,null,null,null,null,null,null,null,null,null,null,null,null,null,null,null,null,null,null,{"$f":"'3'!AR17","v":0},null,null,null,null,0,null,{"$f":"'4'!AR7","v":""},{"$f":"'4'!AS7","v":""},null,{"$f":"IF(Inscrits!#REF!=0,\"\",Inscrits!#REF!)","v":{"$error":"#REF!"}},{"$error":"#REF!"},{"$error":"#REF!"},{"$error":"#REF!"}]
[null,null,null,null,null,null,null,null,null,null,null,null,null,null,null,null,null,null,null,null,null,{"$f":"'4'!AR14","v":""},null,null,null,null,0,null,{"$f":"'4'!AR14","v":""},{"$f":"'4'!AS14","v":""},null,{"$f":"IF(Inscrits!#REF!=0,\"\",Inscrits!#REF!)","v":{"$error":"#REF!"}},{"$error":"#REF!"},{"$error":"#REF!"},{"$error":"#REF!"}]
[null,null,null,null,null,null,null,null,null,null,null,null,null,null,null,null,null,null,null,null,null,{"$f":"'4'!AR15","v":""},null,null,null,null,0,null,{"$f":"'4'!AR15","v":""},{"$f":"'4'!AS15","v":""},null,{"$f":"IF(Inscrits!#REF!=0,\"\",Inscrits!#REF!)","v":{"$error":"#REF!"}},{"$error":"#REF!"},{"$error":"#REF!"},{"$error":"#REF!"}]
[null,null,null,null,null,null,null,null,null,null,null,null,null,null,null,null,null,null,null,null,null,{"$f":"'4'!AR16","v":0},null,null,null,null,0,null,{"$f":"'4'!AR16","v":0},{"$f":"'4'!AS16","v":0},null,{"$f":"IF(Inscrits!#REF!=0,\"\",Inscrits!#REF!)","v":{"$error":"#REF!"}},{"$error":"#REF!"},{"$error":"#REF!"},{"$error":"#REF!"}]
[null,null,null,null,null,null,null,null,null,null,null,null,null,null,null,null,null,null,null,null,null,{"$f":"'4'!AR17","v":0},null,null,null,null,0,null,{"$f":"'4'!AR17","v":0},{"$f":"'4'!AS17","v":0},null,{"$f":"IF(Inscrits!#REF!=0,\"\",Inscrits!#REF!)","v":{"$error":"#REF!"}},{"$error":"#REF!"},{"$error":"#REF!"},{"$error":"#REF!"}]

{"sheet":"Classement","index":8,"n_rows":25,"n_cols":13,"rows_kept":25,"cut":false,"hidden":false,"merged":[]}
[null,null,"Formules Initiales","Nom & Prénom","Place","Points","GA","CF","RF","Club","Ville","Licence","Division"]
[null,null,1,{"$f":"Final!R15","v":""},null,{"$f":"IF(ISNA(IF(LEFT(Division,2)=\"R1\",VLOOKUP(E2,Points!$A$2:$D$36,2,FALSE),IF(LEFT(Division,2)=\"R2\",VLOOKUP(E2,Points!$A$2:$D$36,3,FALSE),IF(LEFT(Division,2)=\"R3\",VLOOKUP(E2,Points!$A$2:$D$36,4,FALSE),\"DIV ???\")))),0,IF(LEFT(Division,2)=\"R1\",VLOOKUP(E2,Points!$A$2:$D$36,2,FALSE),IF(LEFT(Division,2)=\"R2\",VLOOKUP(E2,Points!$A$2:$D$36,3,FALSE),IF(LEFT(Division,2)=\"R3\",VLOOKUP(E2,Points!$A$2:$D$36,4,FALSE),\"DIV ???\"))))","v":0},{"$f":"IF(ISERROR(VLOOKUP(D2,Final!$AF$4:$AI$35,4,FALSE)),\"\",VLOOKUP(D2,Final!$AF$4:$AI$35,4,FALSE))","v":""},null,null,{"$f":"IF(ISNA(VLOOKUP(D2,Inscrits!B:E,3,FALSE)),\"\",VLOOKUP(D2,Inscrits!B:E,3,FALSE))","v":""},{"$f":"IF(ISNA(VLOOKUP(D2,Inscrits!B:E,4,FALSE)),\"\",VLOOKUP(D2,Inscrits!B:E,4,FALSE))","v":""},{"$f":"IF(ISNA(VLOOKUP(D2,Inscrits!B:E,5,FALSE)),\"\",VLOOKUP(D2,Inscrits!B:E,5,FALSE))","v":""},{"$f":"IF(NB_JOUEURS_UP>0,IF(LEN(Division)=2,\"R\"&RIGHT(Division,1)-1&\"\",IF(LEN(Division)=3,IF(RIGHT(LEFT(Division,2),1)=\"2\",\"R1\",IF(Nb_R2=1,\"R2\",\"R\"&RIGHT(LEFT(Division,2),1)-1&\"\"&RIGHT(Division,1)&\"\")),IF(LEN(Division)=4,IF(RIGHT(LEFT(Division,2),1)=\"2\",\"R1\",\"R\"&RIGHT(LEFT(Division,2),1)-1&\"\"&RIGHT(LEFT(Division,3),1)&\"\"),\"?\"))),Division)","v":"R1"}]
[null,null,2,{"$f":"IF(Final!P21=\"A\",Final!N21,IF(Final!P9=\"A\",Final!N9,IF(Final!P9<Final!P21,Final!N9,Final!N21)))","v":""},null,{"$f":"IF(ISNA(IF(LEFT(Division,2)=\"R1\",VLOOKUP(E3,Points!$A$2:$D$36,2,FALSE),IF(LEFT(Division,2)=\"R2\",VLOOKUP(E3,Points!$A$2:$D$36,3,FALSE),IF(LEFT(Division,2)=\"R3\",VLOOKUP(E3,Points!$A$2:$D$36,4,FALSE),\"DIV ???\")))),0,IF(LEFT(Division,2)=\"R1\",VLOOKUP(E3,Points!$A$2:$D$36,2,FALSE),IF(LEFT(Division,2)=\"R2\",VLOOKUP(E3,Points!$A$2:$D$36,3,FALSE),IF(LEFT(Division,2)=\"R3\",VLOOKUP(E3,Points!$A$2:$D$36,4,FALSE),\"DIV ???\"))))","v":0},{"$f":"IF(ISERROR(VLOOKUP(D3,Final!$AF$4:$AI$35,4,FALSE)),\"\",VLOOKUP(D3,Final!$AF$4:$AI$35,4,FALSE))","v":""},null,null,{"$f":"IF(ISNA(VLOOKUP(D3,Inscrits!B:E,3,FALSE)),\"\",VLOOKUP(D3,Inscrits!B:E,3,FALSE))","v":""},{"$f":"IF(ISNA(VLOOKUP(D3,Inscrits!B:E,4,FALSE)),\"\",VLOOKUP(D3,Inscrits!B:E,4,FALSE))","v":""},{"$f":"IF(ISNA(VLOOKUP(D3,Inscrits!B:E,5,FALSE)),\"\",VLOOKUP(D3,Inscrits!B:E,5,FALSE))","v":""},{"$f":"IF(NB_JOUEURS_UP>1,IF(LEN(Division)=2,\"R\"&RIGHT(Division,1)-1&\"\",IF(LEN(Division)=3,IF(RIGHT(LEFT(Division,2),1)=\"2\",\"R1\",IF(Nb_R2=1,\"R2\",\"R\"&RIGHT(LEFT(Division,2),1)-1&\"\"&RIGHT(Division,1)&\"\")),IF(LEN(Division)=4,IF(RIGHT(LEFT(Division,2),1)=\"2\",\"R1\",\"R\"&RIGHT(LEFT(Division,2),1)-1&\"\"&RIGHT(LEFT(Division,3),1)&\"\"),\"?\"))),Division)","v":"R1"}]
[null,null,3,{"$f":"IF(Final!L12=\"A\",Final!J12,IF(Final!L6=\"A\",Final!J6,IF(Final!L6<Final!L12,Final!J6,Final!J12)))","v":""},null,{"$f":"IF(ISNA(IF(LEFT(Division,2)=\"R1\",VLOOKUP(E4,Points!$A$2:$D$36,2,FALSE),IF(LEFT(Division,2)=\"R2\",VLOOKUP(E4,Points!$A$2:$D$36,3,FALSE),IF(LEFT(Division,2)=\"R3\",VLOOKUP(E4,Points!$A$2:$D$36,4,FALSE),\"DIV ???\")))),0,IF(LEFT(Division,2)=\"R1\",VLOOKUP(E4,Points!$A$2:$D$36,2,FALSE),IF(LEFT(Division,2)=\"R2\",VLOOKUP(E4,Points!$A$2:$D$36,3,FALSE),IF(LEFT(Division,2)=\"R3\",VLOOKUP(E4,Points!$A$2:$D$36,4,FALSE),\"DIV ???\"))))","v":0},{"$f":"IF(ISERROR(VLOOKUP(D4,Final!$AF$4:$AI$35,4,FALSE)),\"\",VLOOKUP(D4,Final!$AF$4:$AI$35,4,FALSE))","v":""},null,null,{"$f":"IF(ISNA(VLOOKUP(D4,Inscrits!B:E,3,FALSE)),\"\",VLOOKUP(D4,Inscrits!B:E,3,FALSE))","v":""},{"$f":"IF(ISNA(VLOOKUP(D4,Inscrits!B:E,4,FALSE)),\"\",VLOOKUP(D4,Inscrits!B:E,4,FALSE))","v":""},{"$f":"IF(ISNA(VLOOKUP(D4,Inscrits!B:E,5,FALSE)),\"\",VLOOKUP(D4,Inscrits!B:E,5,FALSE))","v":""},{"$f":"IF(NB_JOUEURS_UP>2,IF(LEN(Division)=2,\"R\"&RIGHT(Division,1)-1&\"\",IF(LEN(Division)=3,IF(RIGHT(LEFT(Division,2),1)=\"2\",\"R1\",IF(Nb_R2=1,\"R2\",\"R\"&RIGHT(LEFT(Division,2),1)-1&\"\"&RIGHT(Division,1)&\"\")),IF(LEN(Division)=4,IF(RIGHT(LEFT(Division,2),1)=\"2\",\"R1\",\"R\"&RIGHT(LEFT(Division,2),1)-1&\"\"&RIGHT(LEFT(Division,3),1)&\"\"),\"?\"))),Division)","v":"R1"}]
[null,null,4,{"$f":"IF(Final!L24=\"A\",Final!J24,IF(Final!L18=\"A\",Final!J18,IF(Final!L18<Final!L24,Final!J18,Final!J24)))","v":""},null,{"$f":"IF(ISNA(IF(LEFT(Division,2)=\"R1\",VLOOKUP(E5,Points!$A$2:$D$36,2,FALSE),IF(LEFT(Division,2)=\"R2\",VLOOKUP(E5,Points!$A$2:$D$36,3,FALSE),IF(LEFT(Division,2)=\"R3\",VLOOKUP(E5,Points!$A$2:$D$36,4,FALSE),\"DIV ???\")))),0,IF(LEFT(Division,2)=\"R1\",VLOOKUP(E5,Points!$A$2:$D$36,2,FALSE),IF(LEFT(Division,2)=\"R2\",VLOOKUP(E5,Points!$A$2:$D$36,3,FALSE),IF(LEFT(Division,2)=\"R3\",VLOOKUP(E5,Points!$A$2:$D$36,4,FALSE),\"DIV ???\"))))","v":0},{"$f":"IF(ISERROR(VLOOKUP(D5,Final!$AF$4:$AI$35,4,FALSE)),\"\",VLOOKUP(D5,Final!$AF$4:$AI$35,4,FALSE))","v":""},null,null,{"$f":"IF(ISNA(VLOOKUP(D5,Inscrits!B:E,3,FALSE)),\"\",VLOOKUP(D5,Inscrits!B:E,3,FALSE))","v":""},{"$f":"IF(ISNA(VLOOKUP(D5,Inscrits!B:E,4,FALSE)),\"\",VLOOKUP(D5,Inscrits!B:E,4,FALSE))","v":""},{"$f":"IF(ISNA(VLOOKUP(D5,Inscrits!B:E,5,FALSE)),\"\",VLOOKUP(D5,Inscrits!B:E,5,FALSE))","v":""},{"$f":"IF(NB_JOUEURS_UP>3,IF(LEN(Division)=2,\"R\"&RIGHT(Division,1)-1&\"\",IF(LEN(Division)=3,IF(RIGHT(LEFT(Division,2),1)=\"2\",\"R1\",IF(Nb_R2=1,\"R2\",\"R\"&RIGHT(LEFT(Division,2),1)-1&\"\"&RIGHT(Division,1)&\"\")),IF(LEN(Division)=4,IF(RIGHT(LEFT(Division,2),1)=\"2\",\"R1\",\"R\"&RIGHT(LEFT(Division,2),1)-1&\"\"&RIGHT(LEFT(Division,3),1)&\"\"),\"?\"))),Division)","v":"R1"}]
[null,null,8,{"$f":"IF(Final!H25=\"A\",Final!F25,IF(Final!H23=\"A\",Final!F23,IF(Final!H23<Final!H25,Final!F23,Final!F25)))","v":""},null,{"$f":"IF(ISNA(IF(LEFT(Division,2)=\"R1\",VLOOKUP(E6,Points!$A$2:$D$36,2,FALSE),IF(LEFT(Division,2)=\"R2\",VLOOKUP(E6,Points!$A$2:$D$36,3,FALSE),IF(LEFT(Division,2)=\"R3\",VLOOKUP(E6,Points!$A$2:$D$36,4,FALSE),\"DIV ???\")))),0,IF(LEFT(Division,2)=\"R1\",VLOOKUP(E6,Points!$A$2:$D$36,2,FALSE),IF(LEFT(Division,2)=\"R2\",VLOOKUP(E6,Points!$A$2:$D$36,3,FALSE),IF(LEFT(Division,2)=\"R3\",VLOOKUP(E6,Points!$A$2:$D$36,4,FALSE),\"DIV ???\"))))","v":0},{"$f":"IF(ISERROR(VLOOKUP(D6,Final!$AF$4:$AI$35,4,FALSE)),\"\",VLOOKUP(D6,Final!$AF$4:$AI$35,4,FALSE))","v":""},null,null,{"$f":"IF(ISNA(VLOOKUP(D6,Inscrits!B:E,3,FALSE)),\"\",VLOOKUP(D6,Inscrits!B:E,3,FALSE))","v":""},{"$f":"IF(ISNA(VLOOKUP(D6,Inscrits!B:E,4,FALSE)),\"\",VLOOKUP(D6,Inscrits!B:E,4,FALSE))","v":""},{"$f":"IF(ISNA(VLOOKUP(D6,Inscrits!B:E,5,FALSE)),\"\",VLOOKUP(D6,Inscrits!B:E,5,FALSE))","v":""},{"$f":"IF(NB_JOUEURS_UP>4,IF(LEN(Division)=2,\"R\"&RIGHT(Division,1)-1&\"\",IF(LEN(Division)=3,IF(RIGHT(LEFT(Division,2),1)=\"2\",\"R1\",IF(Nb_R2=1,\"R2\",\"R\"&RIGHT(LEFT(Division,2),1)-1&\"\"&RIGHT(Division,1)&\"\")),IF(LEN(Division)=4,IF(RIGHT(LEFT(Division,2),1)=\"2\",\"R1\",\"R\"&RIGHT(LEFT(Division,2),1)-1&\"\"&RIGHT(LEFT(Division,3),1)&\"\"),\"?\"))),Division)","v":"R1"}]
[null,null,5,{"$f":"IF(Final!H7=\"A\",Final!F7,IF(Final!H5=\"A\",Final!F5,IF(Final!H5<Final!H7,Final!F5,Final!F7)))","v":""},null,{"$f":"IF(ISNA(IF(LEFT(Division,2)=\"R1\",VLOOKUP(E7,Points!$A$2:$D$36,2,FALSE),IF(LEFT(Division,2)=\"R2\",VLOOKUP(E7,Points!$A$2:$D$36,3,FALSE),IF(LEFT(Division,2)=\"R3\",VLOOKUP(E7,Points!$A$2:$D$36,4,FALSE),\"DIV ???\")))),0,IF(LEFT(Division,2)=\"R1\",VLOOKUP(E7,Points!$A$2:$D$36,2,FALSE),IF(LEFT(Division,2)=\"R2\",VLOOKUP(E7,Points!$A$2:$D$36,3,FALSE),IF(LEFT(Division,2)=\"R3\",VLOOKUP(E7,Points!$A$2:$D$36,4,FALSE),\"DIV ???\"))))","v":0},{"$f":"IF(ISERROR(VLOOKUP(D7,Final!$AF$4:$AI$35,4,FALSE)),\"\",VLOOKUP(D7,Final!$AF$4:$AI$35,4,FALSE))","v":""},null,null,{"$f":"IF(ISNA(VLOOKUP(D7,Inscrits!B:E,3,FALSE)),\"\",VLOOKUP(D7,Inscrits!B:E,3,FALSE))","v":""},{"$f":"IF(ISNA(VLOOKUP(D7,Inscrits!B:E,4,FALSE)),\"\",VLOOKUP(D7,Inscrits!B:E,4,FALSE))","v":""},{"$f":"IF(ISNA(VLOOKUP(D7,Inscrits!B:E,5,FALSE)),\"\",VLOOKUP(D7,Inscrits!B:E,5,FALSE))","v":""},{"$f":"IF(NB_JOUEURS_UP>5,IF(LEN(Division)=2,\"R\"&RIGHT(Division,1)-1&\"\",IF(LEN(Division)=3,IF(RIGHT(LEFT(Division,2),1)=\"2\",\"R1\",IF(Nb_R2=1,\"R2\",\"R\"&RIGHT(LEFT(Division,2),1)-1&\"\"&RIGHT(Division,1)&\"\")),IF(LEN(Division)=4,IF(RIGHT(LEFT(Division,2),1)=\"2\",\"R1\",\"R\"&RIGHT(LEFT(Division,2),1)-1&\"\"&RIGHT(LEFT(Division,3),1)&\"\"),\"?\"))),Division)","v":"R1"}]
[null,null,6,{"$f":"IF(Final!H13=\"A\",Final!F13,IF(Final!H11=\"A\",Final!F11,IF(Final!H11<Final!H13,Final!F11,Final!F13)))","v":""},null,{"$f":"IF(ISNA(IF(LEFT(Division,2)=\"R1\",VLOOKUP(E8,Points!$A$2:$D$36,2,FALSE),IF(LEFT(Division,2)=\"R2\",VLOOKUP(E8,Points!$A$2:$D$36,3,FALSE),IF(LEFT(Division,2)=\"R3\",VLOOKUP(E8,Points!$A$2:$D$36,4,FALSE),\"DIV ???\")))),0,IF(LEFT(Division,2)=\"R1\",VLOOKUP(E8,Points!$A$2:$D$36,2,FALSE),IF(LEFT(Division,2)=\"R2\",VLOOKUP(E8,Points!$A$2:$D$36,3,FALSE),IF(LEFT(Division,2)=\"R3\",VLOOKUP(E8,Points!$A$2:$D$36,4,FALSE),\"DIV ???\"))))","v":0},{"$f":"IF(ISERROR(VLOOKUP(D8,Final!$AF$4:$AI$35,4,FALSE)),\"\",VLOOKUP(D8,Final!$AF$4:$AI$35,4,FALSE))","v":""},null,null,{"$f":"IF(ISNA(VLOOKUP(D8,Inscrits!B:E,3,FALSE)),\"\",VLOOKUP(D8,Inscrits!B:E,3,FALSE))","v":""},{"$f":"IF(ISNA(VLOOKUP(D8,Inscrits!B:E,4,FALSE)),\"\",VLOOKUP(D8,Inscrits!B:E,4,FALSE))","v":""},{"$f":"IF(ISNA(VLOOKUP(D8,Inscrits!B:E,5,FALSE)),\"\",VLOOKUP(D8,Inscrits!B:E,5,FALSE))","v":""},{"$f":"IF(NB_JOUEURS_UP>6,IF(LEN(Division)=2,\"R\"&RIGHT(Division,1)-1&\"\",IF(LEN(Division)=3,IF(RIGHT(LEFT(Division,2),1)=\"2\",\"R1\",IF(Nb_R2=1,\"R2\",\"R\"&RIGHT(LEFT(Division,2),1)-1&\"\"&RIGHT(Division,1)&\"\")),IF(LEN(Division)=4,IF(RIGHT(LEFT(Division,2),1)=\"2\",\"R1\",\"R\"&RIGHT(LEFT(Division,2),1)-1&\"\"&RIGHT(LEFT(Division,3),1)&\"\"),\"?\"))),Division)","v":"R1"}]
[null,null,7,{"$f":"IF(Final!H19=\"A\",Final!F19,IF(Final!H17=\"A\",Final!F17,IF(Final!H17<Final!H19,Final!F17,Final!F19)))","v":""},null,{"$f":"IF(ISNA(IF(LEFT(Division,2)=\"R1\",VLOOKUP(E9,Points!$A$2:$D$36,2,FALSE),IF(LEFT(Division,2)=\"R2\",VLOOKUP(E9,Points!$A$2:$D$36,3,FALSE),IF(LEFT(Division,2)=\"R3\",VLOOKUP(E9,Points!$A$2:$D$36,4,FALSE),\"DIV ???\")))),0,IF(LEFT(Division,2)=\"R1\",VLOOKUP(E9,Points!$A$2:$D$36,2,FALSE),IF(LEFT(Division,2)=\"R2\",VLOOKUP(E9,Points!$A$2:$D$36,3,FALSE),IF(LEFT(Division,2)=\"R3\",VLOOKUP(E9,Points!$A$2:$D$36,4,FALSE),\"DIV ???\"))))","v":0},{"$f":"IF(ISERROR(VLOOKUP(D9,Final!$AF$4:$AI$35,4,FALSE)),\"\",VLOOKUP(D9,Final!$AF$4:$AI$35,4,FALSE))","v":""},null,null,{"$f":"IF(ISNA(VLOOKUP(D9,Inscrits!B:E,3,FALSE)),\"\",VLOOKUP(D9,Inscrits!B:E,3,FALSE))","v":""},{"$f":"IF(ISNA(VLOOKUP(D9,Inscrits!B:E,4,FALSE)),\"\",VLOOKUP(D9,Inscrits!B:E,4,FALSE))","v":""},{"$f":"IF(ISNA(VLOOKUP(D9,Inscrits!B:E,5,FALSE)),\"\",VLOOKUP(D9,Inscrits!B:E,5,FALSE))","v":""},{"$f":"IF(NB_JOUEURS_UP>7,IF(LEN(Division)=2,\"R\"&RIGHT(Division,1)-1&\"\",IF(LEN(Division)=3,IF(RIGHT(LEFT(Division,2),1)=\"2\",\"R1\",IF(Nb_R2=1,\"R2\",\"R\"&RIGHT(LEFT(Division,2),1)-1&\"\"&RIGHT(Division,1)&\"\")),IF(LEN(Division)=4,IF(RIGHT(LEFT(Division,2),1)=\"2\",\"R1\",\"R\"&RIGHT(LEFT(Division,2),1)-1&\"\"&RIGHT(LEFT(Division,3),1)&\"\"),\"?\"))),Division)","v":"R1"}]
[null,null,11,{"$f":"IF(Final!D11=\"A\",Final!B11,IF(Final!D10=\"A\",Final!B10,IF(Final!D10<Final!D11,Final!B10,Final!B11)))","v":""},null,{"$f":"IF(ISNA(IF(LEFT(Division,2)=\"R1\",VLOOKUP(E10,Points!$A$2:$D$36,2,FALSE),IF(LEFT(Division,2)=\"R2\",VLOOKUP(E10,Points!$A$2:$D$36,3,FALSE),IF(LEFT(Division,2)=\"R3\",VLOOKUP(E10,Points!$A$2:$D$36,4,FALSE),\"DIV ???\")))),0,IF(LEFT(Division,2)=\"R1\",VLOOKUP(E10,Points!$A$2:$D$36,2,FALSE),IF(LEFT(Division,2)=\"R2\",VLOOKUP(E10,Points!$A$2:$D$36,3,FALSE),IF(LEFT(Division,2)=\"R3\",VLOOKUP(E10,Points!$A$2:$D$36,4,FALSE),\"DIV ???\"))))","v":0},{"$f":"IF(ISERROR(VLOOKUP(D10,Final!$AF$4:$AI$35,4,FALSE)),\"\",VLOOKUP(D10,Final!$AF$4:$AI$35,4,FALSE))","v":""},null,null,{"$f":"IF(ISNA(VLOOKUP(D10,Inscrits!B:E,3,FALSE)),\"\",VLOOKUP(D10,Inscrits!B:E,3,FALSE))","v":""},{"$f":"IF(ISNA(VLOOKUP(D10,Inscrits!B:E,4,FALSE)),\"\",VLOOKUP(D10,Inscrits!B:E,4,FALSE))","v":""},{"$f":"IF(ISNA(VLOOKUP(D10,Inscrits!B:E,5,FALSE)),\"\",VLOOKUP(D10,Inscrits!B:E,5,FALSE))","v":""},{"$f":"Division","v":"R1"}]
[null,null,9,{"$f":"IF(Final!D5=\"A\",Final!B5,IF(Final!D4=\"A\",Final!B4,IF(Final!D4<Final!D5,Final!B4,Final!B5)))","v":""},null,{"$f":"IF(ISNA(IF(LEFT(Division,2)=\"R1\",VLOOKUP(E11,Points!$A$2:$D$36,2,FALSE),IF(LEFT(Division,2)=\"R2\",VLOOKUP(E11,Points!$A$2:$D$36,3,FALSE),IF(LEFT(Division,2)=\"R3\",VLOOKUP(E11,Points!$A$2:$D$36,4,FALSE),\"DIV ???\")))),0,IF(LEFT(Division,2)=\"R1\",VLOOKUP(E11,Points!$A$2:$D$36,2,FALSE),IF(LEFT(Division,2)=\"R2\",VLOOKUP(E11,Points!$A$2:$D$36,3,FALSE),IF(LEFT(Division,2)=\"R3\",VLOOKUP(E11,Points!$A$2:$D$36,4,FALSE),\"DIV ???\"))))","v":0},{"$f":"IF(ISERROR(VLOOKUP(D11,Final!$AF$4:$AI$35,4,FALSE)),\"\",VLOOKUP(D11,Final!$AF$4:$AI$35,4,FALSE))","v":""},null,null,{"$f":"IF(ISNA(VLOOKUP(D11,Inscrits!B:E,3,FALSE)),\"\",VLOOKUP(D11,Inscrits!B:E,3,FALSE))","v":""},{"$f":"IF(ISNA(VLOOKUP(D11,Inscrits!B:E,4,FALSE)),\"\",VLOOKUP(D11,Inscrits!B:E,4,FALSE))","v":""},{"$f":"IF(ISNA(VLOOKUP(D11,Inscrits!B:E,5,FALSE)),\"\",VLOOKUP(D11,Inscrits!B:E,5,FALSE))","v":""},{"$f":"Division","v":"R1"}]
[null,null,16,{"$f":"IF(Final!D26=\"A\",Final!B26,IF(Final!D25=\"A\",Final!B25,IF(Final!D25<Final!D26,Final!B25,Final!B26)))","v":""},null,{"$f":"IF(ISNA(IF(LEFT(Division,2)=\"R1\",VLOOKUP(E12,Points!$A$2:$D$36,2,FALSE),IF(LEFT(Division,2)=\"R2\",VLOOKUP(E12,Points!$A$2:$D$36,3,FALSE),IF(LEFT(Division,2)=\"R3\",VLOOKUP(E12,Points!$A$2:$D$36,4,FALSE),\"DIV ???\")))),0,IF(LEFT(Division,2)=\"R1\",VLOOKUP(E12,Points!$A$2:$D$36,2,FALSE),IF(LEFT(Division,2)=\"R2\",VLOOKUP(E12,Points!$A$2:$D$36,3,FALSE),IF(LEFT(Division,2)=\"R3\",VLOOKUP(E12,Points!$A$2:$D$36,4,FALSE),\"DIV ???\"))))","v":0},{"$f":"IF(ISERROR(VLOOKUP(D12,Final!$AF$4:$AI$35,4,FALSE)),\"\",VLOOKUP(D12,Final!$AF$4:$AI$35,4,FALSE))","v":""},null,null,{"$f":"IF(ISNA(VLOOKUP(D12,Inscrits!B:E,3,FALSE)),\"\",VLOOKUP(D12,Inscrits!B:E,3,FALSE))","v":""},{"$f":"IF(ISNA(VLOOKUP(D12,Inscrits!B:E,4,FALSE)),\"\",VLOOKUP(D12,Inscrits!B:E,4,FALSE))","v":""},{"$f":"IF(ISNA(VLOOKUP(D12,Inscrits!B:E,5,FALSE)),\"\",VLOOKUP(D12,Inscrits!B:E,5,FALSE))","v":""},"R1"]
[null,null,14,{"$f":"IF(Final!D20=\"A\",Final!B20,IF(Final!D19=\"A\",Final!B19,IF(Final!D19<Final!D20,Final!B19,Final!B20)))","v":""},null,{"$f":"IF(ISNA(IF(LEFT(Division,2)=\"R1\",VLOOKUP(E13,Points!$A$2:$D$36,2,FALSE),IF(LEFT(Division,2)=\"R2\",VLOOKUP(E13,Points!$A$2:$D$36,3,FALSE),IF(LEFT(Division,2)=\"R3\",VLOOKUP(E13,Points!$A$2:$D$36,4,FALSE),\"DIV ???\")))),0,IF(LEFT(Division,2)=\"R1\",VLOOKUP(E13,Points!$A$2:$D$36,2,FALSE),IF(LEFT(Division,2)=\"R2\",VLOOKUP(E13,Points!$A$2:$D$36,3,FALSE),IF(LEFT(Division,2)=\"R3\",VLOOKUP(E13,Points!$A$2:$D$36,4,FALSE),\"DIV ???\"))))","v":0},{"$f":"IF(ISERROR(VLOOKUP(D13,Final!$AF$4:$AI$35,4,FALSE)),\"\",VLOOKUP(D13,Final!$AF$4:$AI$35,4,FALSE))","v":""},null,null,{"$f":"IF(ISNA(VLOOKUP(D13,Inscrits!B:E,3,FALSE)),\"\",VLOOKUP(D13,Inscrits!B:E,3,FALSE))","v":""},{"$f":"IF(ISNA(VLOOKUP(D13,Inscrits!B:E,4,FALSE)),\"\",VLOOKUP(D13,Inscrits!B:E,4,FALSE))","v":""},{"$f":"IF(ISNA(VLOOKUP(D13,Inscrits!B:E,5,FALSE)),\"\",VLOOKUP(D13,Inscrits!B:E,5,FALSE))","v":""},"R1"]
[null,null,12,{"$f":"IF(Final!D14=\"A\",Final!B14,IF(Final!D13=\"A\",Final!B13,IF(Final!D13<Final!D14,Final!B13,Final!B14)))","v":""},null,{"$f":"IF(ISNA(IF(LEFT(Division,2)=\"R1\",VLOOKUP(E14,Points!$A$2:$D$36,2,FALSE),IF(LEFT(Division,2)=\"R2\",VLOOKUP(E14,Points!$A$2:$D$36,3,FALSE),IF(LEFT(Division,2)=\"R3\",VLOOKUP(E14,Points!$A$2:$D$36,4,FALSE),\"DIV ???\")))),0,IF(LEFT(Division,2)=\"R1\",VLOOKUP(E14,Points!$A$2:$D$36,2,FALSE),IF(LEFT(Division,2)=\"R2\",VLOOKUP(E14,Points!$A$2:$D$36,3,FALSE),IF(LEFT(Division,2)=\"R3\",VLOOKUP(E14,Points!$A$2:$D$36,4,FALSE),\"DIV ???\"))))","v":0},{"$f":"IF(ISERROR(VLOOKUP(D14,Final!$AF$4:$AI$35,4,FALSE)),\"\",VLOOKUP(D14,Final!$AF$4:$AI$35,4,FALSE))","v":""},null,null,{"$f":"IF(ISNA(VLOOKUP(D14,Inscrits!B:E,3,FALSE)),\"\",VLOOKUP(D14,Inscrits!B:E,3,FALSE))","v":""},{"$f":"IF(ISNA(VLOOKUP(D14,Inscrits!B:E,4,FALSE)),\"\",VLOOKUP(D14,Inscrits!B:E,4,FALSE))","v":""},{"$f":"IF(ISNA(VLOOKUP(D14,Inscrits!B:E,5,FALSE)),\"\",VLOOKUP(D14,Inscrits!B:E,5,FALSE))","v":""},"R1"]
[null,null,13,{"$f":"IF(Final!D17=\"A\",Final!B17,IF(Final!D16=\"A\",Final!B16,IF(Final!D16<Final!D17,Final!B16,Final!B17)))","v":""},null,{"$f":"IF(ISNA(IF(LEFT(Division,2)=\"R1\",VLOOKUP(E15,Points!$A$2:$D$36,2,FALSE),IF(LEFT(Division,2)=\"R2\",VLOOKUP(E15,Points!$A$2:$D$36,3,FALSE),IF(LEFT(Division,2)=\"R3\",VLOOKUP(E15,Points!$A$2:$D$36,4,FALSE),\"DIV ???\")))),0,IF(LEFT(Division,2)=\"R1\",VLOOKUP(E15,Points!$A$2:$D$36,2,FALSE),IF(LEFT(Division,2)=\"R2\",VLOOKUP(E15,Points!$A$2:$D$36,3,FALSE),IF(LEFT(Division,2)=\"R3\",VLOOKUP(E15,Points!$A$2:$D$36,4,FALSE),\"DIV ???\"))))","v":0},{"$f":"IF(ISERROR(VLOOKUP(D15,Final!$AF$4:$AI$35,4,FALSE)),\"\",VLOOKUP(D15,Final!$AF$4:$AI$35,4,FALSE))","v":""},null,null,{"$f":"IF(ISNA(VLOOKUP(D15,Inscrits!B:E,3,FALSE)),\"\",VLOOKUP(D15,Inscrits!B:E,3,FALSE))","v":""},{"$f":"IF(ISNA(VLOOKUP(D15,Inscrits!B:E,4,FALSE)),\"\",VLOOKUP(D15,Inscrits!B:E,4,FALSE))","v":""},{"$f":"IF(ISNA(VLOOKUP(D15,Inscrits!B:E,5,FALSE)),\"\",VLOOKUP(D15,Inscrits!B:E,5,FALSE))","v":""},"R1"]
[null,null,10,{"$f":"IF(Final!D8=\"A\",Final!B8,IF(Final!D7=\"A\",Final!B7,IF(Final!D7<Final!D8,Final!B7,Final!B8)))","v":""},null,{"$f":"IF(ISNA(IF(LEFT(Division,2)=\"R1\",VLOOKUP(E16,Points!$A$2:$D$36,2,FALSE),IF(LEFT(Division,2)=\"R2\",VLOOKUP(E16,Points!$A$2:$D$36,3,FALSE),IF(LEFT(Division,2)=\"R3\",VLOOKUP(E16,Points!$A$2:$D$36,4,FALSE),\"DIV ???\")))),0,IF(LEFT(Division,2)=\"R1\",VLOOKUP(E16,Points!$A$2:$D$36,2,FALSE),IF(LEFT(Division,2)=\"R2\",VLOOKUP(E16,Points!$A$2:$D$36,3,FALSE),IF(LEFT(Division,2)=\"R3\",VLOOKUP(E16,Points!$A$2:$D$36,4,FALSE),\"DIV ???\"))))","v":0},{"$f":"IF(ISERROR(VLOOKUP(D16,Final!$AF$4:$AI$35,4,FALSE)),\"\",VLOOKUP(D16,Final!$AF$4:$AI$35,4,FALSE))","v":""},null,null,{"$f":"IF(ISNA(VLOOKUP(D16,Inscrits!B:E,3,FALSE)),\"\",VLOOKUP(D16,Inscrits!B:E,3,FALSE))","v":""},{"$f":"IF(ISNA(VLOOKUP(D16,Inscrits!B:E,4,FALSE)),\"\",VLOOKUP(D16,Inscrits!B:E,4,FALSE))","v":""},{"$f":"IF(ISNA(VLOOKUP(D16,Inscrits!B:E,5,FALSE)),\"\",VLOOKUP(D16,Inscrits!B:E,5,FALSE))","v":""},"R1"]
[null,null,15,{"$f":"IF(Final!D23=\"A\",Final!B23,IF(Final!D22=\"A\",Final!B22,IF(Final!D22<Final!D23,Final!B22,Final!B23)))","v":""},null,{"$f":"IF(ISNA(IF(LEFT(Division,2)=\"R1\",VLOOKUP(E17,Points!$A$2:$D$36,2,FALSE),IF(LEFT(Division,2)=\"R2\",VLOOKUP(E17,Points!$A$2:$D$36,3,FALSE),IF(LEFT(Division,2)=\"R3\",VLOOKUP(E17,Points!$A$2:$D$36,4,FALSE),\"DIV ???\")))),0,IF(LEFT(Division,2)=\"R1\",VLOOKUP(E17,Points!$A$2:$D$36,2,FALSE),IF(LEFT(Division,2)=\"R2\",VLOOKUP(E17,Points!$A$2:$D$36,3,FALSE),IF(LEFT(Division,2)=\"R3\",VLOOKUP(E17,Points!$A$2:$D$36,4,FALSE),\"DIV ???\"))))","v":0},{"$f":"IF(ISERROR(VLOOKUP(D17,Final!$AF$4:$AI$35,4,FALSE)),\"\",VLOOKUP(D17,Final!$AF$4:$AI$35,4,FALSE))","v":""},null,null,{"$f":"IF(ISNA(VLOOKUP(D17,Inscrits!B:E,3,FALSE)),\"\",VLOOKUP(D17,Inscrits!B:E,3,FALSE))","v":""},{"$f":"IF(ISNA(VLOOKUP(D17,Inscrits!B:E,4,FALSE)),\"\",VLOOKUP(D17,Inscrits!B:E,4,FALSE))","v":""},{"$f":"IF(ISNA(VLOOKUP(D17,Inscrits!B:E,5,FALSE)),\"\",VLOOKUP(D17,Inscrits!B:E,5,FALSE))","v":""},"R1"]
[null,null,18,{"$f":"'1'!AR15","v":""},null,{"$f":"IF(ISNA(IF(LEFT(Division,2)=\"R1\",VLOOKUP(E18,Points!$A$2:$D$36,2,FALSE),IF(LEFT(Division,2)=\"R2\",VLOOKUP(E18,Points!$A$2:$D$36,3,FALSE),IF(LEFT(Division,2)=\"R3\",VLOOKUP(E18,Points!$A$2:$D$36,4,FALSE),\"DIV ???\")))),0,IF(LEFT(Division,2)=\"R1\",VLOOKUP(E18,Points!$A$2:$D$36,2,FALSE),IF(LEFT(Division,2)=\"R2\",VLOOKUP(E18,Points!$A$2:$D$36,3,FALSE),IF(LEFT(Division,2)=\"R3\",VLOOKUP(E18,Points!$A$2:$D$36,4,FALSE),\"DIV ???\"))))","v":0},{"$f":"IF(ISERROR(VLOOKUP(D18,Final!$AF$4:$AI$35,4,FALSE)),\"\",VLOOKUP(D18,Final!$AF$4:$AI$35,4,FALSE))","v":""},null,null,{"$f":"IF(ISNA(VLOOKUP(D18,Inscrits!B:E,3,FALSE)),\"\",VLOOKUP(D18,Inscrits!B:E,3,FALSE))","v":""},{"$f":"IF(ISNA(VLOOKUP(D18,Inscrits!B:E,4,FALSE)),\"\",VLOOKUP(D18,Inscrits!B:E,4,FALSE))","v":""},{"$f":"IF(ISNA(VLOOKUP(D18,Inscrits!B:E,5,FALSE)),\"\",VLOOKUP(D18,Inscrits!B:E,5,FALSE))","v":""},{"$f":"IF(NB_JOUEURS_DOWN>7,\"Relégué(e)\",Division)","v":"R1"}]
[null,null,17,{"$f":"'1'!AR14","v":""},null,{"$f":"IF(ISNA(IF(LEFT(Division,2)=\"R1\",VLOOKUP(E19,Points!$A$2:$D$36,2,FALSE),IF(LEFT(Division,2)=\"R2\",VLOOKUP(E19,Points!$A$2:$D$36,3,FALSE),IF(LEFT(Division,2)=\"R3\",VLOOKUP(E19,Points!$A$2:$D$36,4,FALSE),\"DIV ???\")))),0,IF(LEFT(Division,2)=\"R1\",VLOOKUP(E19,Points!$A$2:$D$36,2,FALSE),IF(LEFT(Division,2)=\"R2\",VLOOKUP(E19,Points!$A$2:$D$36,3,FALSE),IF(LEFT(Division,2)=\"R3\",VLOOKUP(E19,Points!$A$2:$D$36,4,FALSE),\"DIV ???\"))))","v":0},{"$f":"IF(ISERROR(VLOOKUP(D19,Final!$AF$4:$AI$35,4,FALSE)),\"\",VLOOKUP(D19,Final!$AF$4:$AI$35,4,FALSE))","v":""},null,null,{"$f":"IF(ISNA(VLOOKUP(D19,Inscrits!B:E,3,FALSE)),\"\",VLOOKUP(D19,Inscrits!B:E,3,FALSE))","v":""},{"$f":"IF(ISNA(VLOOKUP(D19,Inscrits!B:E,4,FALSE)),\"\",VLOOKUP(D19,Inscrits!B:E,4,FALSE))","v":""},{"$f":"IF(ISNA(VLOOKUP(D19,Inscrits!B:E,5,FALSE)),\"\",VLOOKUP(D19,Inscrits!B:E,5,FALSE))","v":""},{"$f":"IF(NB_JOUEURS_DOWN>6,\"Relégué(e)\",Division)","v":"R1"}]
[null,null,19,{"$f":"'2'!AR14","v":""},null,{"$f":"IF(ISNA(IF(LEFT(Division,2)=\"R1\",VLOOKUP(E20,Points!$A$2:$D$36,2,FALSE),IF(LEFT(Division,2)=\"R2\",VLOOKUP(E20,Points!$A$2:$D$36,3,FALSE),IF(LEFT(Division,2)=\"R3\",VLOOKUP(E20,Points!$A$2:$D$36,4,FALSE),\"DIV ???\")))),0,IF(LEFT(Division,2)=\"R1\",VLOOKUP(E20,Points!$A$2:$D$36,2,FALSE),IF(LEFT(Division,2)=\"R2\",VLOOKUP(E20,Points!$A$2:$D$36,3,FALSE),IF(LEFT(Division,2)=\"R3\",VLOOKUP(E20,Points!$A$2:$D$36,4,FALSE),\"DIV ???\"))))","v":0},{"$f":"IF(ISERROR(VLOOKUP(D20,Final!$AF$4:$AI$35,4,FALSE)),\"\",VLOOKUP(D20,Final!$AF$4:$AI$35,4,FALSE))","v":""},null,null,{"$f":"IF(ISNA(VLOOKUP(D20,Inscrits!B:E,3,FALSE)),\"\",VLOOKUP(D20,Inscrits!B:E,3,FALSE))","v":""},{"$f":"IF(ISNA(VLOOKUP(D20,Inscrits!B:E,4,FALSE)),\"\",VLOOKUP(D20,Inscrits!B:E,4,FALSE))","v":""},{"$f":"IF(ISNA(VLOOKUP(D20,Inscrits!B:E,5,FALSE)),\"\",VLOOKUP(D20,Inscrits!B:E,5,FALSE))","v":""},{"$f":"IF(NB_JOUEURS_DOWN>5,\"Relégué(e)\",Division)","v":"R1"}]
[null,null,23,{"$f":"'4'!AR14","v":""},null,{"$f":"IF(ISNA(IF(LEFT(Division,2)=\"R1\",VLOOKUP(E21,Points!$A$2:$D$36,2,FALSE),IF(LEFT(Division,2)=\"R2\",VLOOKUP(E21,Points!$A$2:$D$36,3,FALSE),IF(LEFT(Division,2)=\"R3\",VLOOKUP(E21,Points!$A$2:$D$36,4,FALSE),\"DIV ???\")))),0,IF(LEFT(Division,2)=\"R1\",VLOOKUP(E21,Points!$A$2:$D$36,2,FALSE),IF(LEFT(Division,2)=\"R2\",VLOOKUP(E21,Points!$A$2:$D$36,3,FALSE),IF(LEFT(Division,2)=\"R3\",VLOOKUP(E21,Points!$A$2:$D$36,4,FALSE),\"DIV ???\"))))","v":0},{"$f":"IF(ISERROR(VLOOKUP(D21,Final!$AF$4:$AI$35,4,FALSE)),\"\",VLOOKUP(D21,Final!$AF$4:$AI$35,4,FALSE))","v":""},null,null,{"$f":"IF(ISNA(VLOOKUP(D21,Inscrits!B:E,3,FALSE)),\"\",VLOOKUP(D21,Inscrits!B:E,3,FALSE))","v":""},{"$f":"IF(ISNA(VLOOKUP(D21,Inscrits!B:E,4,FALSE)),\"\",VLOOKUP(D21,Inscrits!B:E,4,FALSE))","v":""},{"$f":"IF(ISNA(VLOOKUP(D21,Inscrits!B:E,5,FALSE)),\"\",VLOOKUP(D21,Inscrits!B:E,5,FALSE))","v":""},{"$f":"IF(NB_JOUEURS_DOWN>4,\"Relégué(e)\",Division)","v":"R1"}]
[null,null,20,{"$f":"'2'!AR15","v":""},null,{"$f":"IF(ISNA(IF(LEFT(Division,2)=\"R1\",VLOOKUP(E22,Points!$A$2:$D$36,2,FALSE),IF(LEFT(Division,2)=\"R2\",VLOOKUP(E22,Points!$A$2:$D$36,3,FALSE),IF(LEFT(Division,2)=\"R3\",VLOOKUP(E22,Points!$A$2:$D$36,4,FALSE),\"DIV ???\")))),0,IF(LEFT(Division,2)=\"R1\",VLOOKUP(E22,Points!$A$2:$D$36,2,FALSE),IF(LEFT(Division,2)=\"R2\",VLOOKUP(E22,Points!$A$2:$D$36,3,FALSE),IF(LEFT(Division,2)=\"R3\",VLOOKUP(E22,Points!$A$2:$D$36,4,FALSE),\"DIV ???\"))))","v":0},{"$f":"IF(ISERROR(VLOOKUP(D22,Final!$AF$4:$AI$35,4,FALSE)),\"\",VLOOKUP(D22,Final!$AF$4:$AI$35,4,FALSE))","v":""},null,null,{"$f":"IF(ISNA(VLOOKUP(D22,Inscrits!B:E,3,FALSE)),\"\",VLOOKUP(D22,Inscrits!B:E,3,FALSE))","v":""},{"$f":"IF(ISNA(VLOOKUP(D22,Inscrits!B:E,4,FALSE)),\"\",VLOOKUP(D22,Inscrits!B:E,4,FALSE))","v":""},{"$f":"IF(ISNA(VLOOKUP(D22,Inscrits!B:E,5,FALSE)),\"\",VLOOKUP(D22,Inscrits!B:E,5,FALSE))","v":""},{"$f":"IF(NB_JOUEURS_DOWN>3,\"Relégué(e)\",Division)","v":"R1"}]
[null,null,21,{"$f":"'3'!AR14","v":""},null,{"$f":"IF(ISNA(IF(LEFT(Division,2)=\"R1\",VLOOKUP(E23,Points!$A$2:$D$36,2,FALSE),IF(LEFT(Division,2)=\"R2\",VLOOKUP(E23,Points!$A$2:$D$36,3,FALSE),IF(LEFT(Division,2)=\"R3\",VLOOKUP(E23,Points!$A$2:$D$36,4,FALSE),\"DIV ???\")))),0,IF(LEFT(Division,2)=\"R1\",VLOOKUP(E23,Points!$A$2:$D$36,2,FALSE),IF(LEFT(Division,2)=\"R2\",VLOOKUP(E23,Points!$A$2:$D$36,3,FALSE),IF(LEFT(Division,2)=\"R3\",VLOOKUP(E23,Points!$A$2:$D$36,4,FALSE),\"DIV ???\"))))","v":0},{"$f":"IF(ISERROR(VLOOKUP(D23,Final!$AF$4:$AI$35,4,FALSE)),\"\",VLOOKUP(D23,Final!$AF$4:$AI$35,4,FALSE))","v":""},null,null,{"$f":"IF(ISNA(VLOOKUP(D23,Inscrits!B:E,3,FALSE)),\"\",VLOOKUP(D23,Inscrits!B:E,3,FALSE))","v":""},{"$f":"IF(ISNA(VLOOKUP(D23,Inscrits!B:E,4,FALSE)),\"\",VLOOKUP(D23,Inscrits!B:E,4,FALSE))","v":""},{"$f":"IF(ISNA(VLOOKUP(D23,Inscrits!B:E,5,FALSE)),\"\",VLOOKUP(D23,Inscrits!B:E,5,FALSE))","v":""},{"$f":"IF(NB_JOUEURS_DOWN>2,\"Relégué(e)\",Division)","v":"R1"}]
[null,null,22,{"$f":"'3'!AR15","v":""},null,{"$f":"IF(ISNA(IF(LEFT(Division,2)=\"R1\",VLOOKUP(E24,Points!$A$2:$D$36,2,FALSE),IF(LEFT(Division,2)=\"R2\",VLOOKUP(E24,Points!$A$2:$D$36,3,FALSE),IF(LEFT(Division,2)=\"R3\",VLOOKUP(E24,Points!$A$2:$D$36,4,FALSE),\"DIV ???\")))),0,IF(LEFT(Division,2)=\"R1\",VLOOKUP(E24,Points!$A$2:$D$36,2,FALSE),IF(LEFT(Division,2)=\"R2\",VLOOKUP(E24,Points!$A$2:$D$36,3,FALSE),IF(LEFT(Division,2)=\"R3\",VLOOKUP(E24,Points!$A$2:$D$36,4,FALSE),\"DIV ???\"))))","v":0},{"$f":"IF(ISERROR(VLOOKUP(D24,Final!$AF$4:$AI$35,4,FALSE)),\"\",VLOOKUP(D24,Final!$AF$4:$AI$35,4,FALSE))","v":""},null,null,{"$f":"IF(ISNA(VLOOKUP(D24,Inscrits!B:E,3,FALSE)),\"\",VLOOKUP(D24,Inscrits!B:E,3,FALSE))","v":""},{"$f":"IF(ISNA(VLOOKUP(D24,Inscrits!B:E,4,FALSE)),\"\",VLOOKUP(D24,Inscrits!B:E,4,FALSE))","v":""},{"$f":"IF(ISNA(VLOOKUP(D24,Inscrits!B:E,5,FALSE)),\"\",VLOOKUP(D24,Inscrits!B:E,5,FALSE))","v":""},{"$f":"IF(NB_JOUEURS_DOWN>1,\"Relégué(e)\",Division)","v":"R1"}]
[null,null,24,{"$f":"'4'!AR15","v":""},null,{"$f":"IF(ISNA(IF(LEFT(Division,2)=\"R1\",VLOOKUP(E25,Points!$A$2:$D$36,2,FALSE),IF(LEFT(Division,2)=\"R2\",VLOOKUP(E25,Points!$A$2:$D$36,3,FALSE),IF(LEFT(Division,2)=\"R3\",VLOOKUP(E25,Points!$A$2:$D$36,4,FALSE),\"DIV ???\")))),0,IF(LEFT(Division,2)=\"R1\",VLOOKUP(E25,Points!$A$2:$D$36,2,FALSE),IF(LEFT(Division,2)=\"R2\",VLOOKUP(E25,Points!$A$2:$D$36,3,FALSE),IF(LEFT(Division,2)=\"R3\",VLOOKUP(E25,Points!$A$2:$D$36,4,FALSE),\"DIV ???\"))))","v":0},{"$f":"IF(ISERROR(VLOOKUP(D25,Final!$AF$4:$AI$35,4,FALSE)),\"\",VLOOKUP(D25,Final!$AF$4:$AI$35,4,FALSE))","v":""},null,null,{"$f":"IF(ISNA(VLOOKUP(D25,Inscrits!B:E,3,FALSE)),\"\",VLOOKUP(D25,Inscrits!B:E,3,FALSE))","v":""},{"$f":"IF(ISNA(VLOOKUP(D25,Inscrits!B:E,4,FALSE)),\"\",VLOOKUP(D25,Inscrits!B:E,4,FALSE))","v":""},{"$f":"IF(ISNA(VLOOKUP(D25,Inscrits!B:E,5,FALSE)),\"\",VLOOKUP(D25,Inscrits!B:E,5,FALSE))","v":""},{"$f":"IF(NB_JOUEURS_DOWN>0,\"Relégué(e)\",Division)","v":"R1"}]