{"text_format":"1","workbook":"xlsx","n_sheets":15,"sheets":["Listing joueurs","Liste Joueurs","Calcul","Poules","1","2","3","4","Final","Classement","FEUILLE 3GA","Points","Parametres","FEUILLE 4GA","FEUILLE 5GA"],"not_rendered":{"charts":0,"images":4,"macros":1,"external_links":10,"defined_names":391,"comments":0,"pivot_tables":0},"unopened":[],"bounds":{"document_bytes":16777216,"sheet_cells":100000,"rows_first":2000,"rows_last":500,"rows_between":2000,"halvings":0,"cell_chars":16384,"cell_head_chars":4096},"cells_cut":0,"cells_raw":0,"read":"whole","date_system":"1900"}

{"sheet":"Listing joueurs","index":0,"n_rows":599,"n_cols":10,"rows_kept":599,"cut":false,"hidden":true,"merged":[]}
["Num","Nom","Prénom","Concaténation","Licence","Groupe Sportif"]
[1,"ABRIAL","NICOLE",{"$f":"B2&\" \"&C2","v":"ABRIAL NICOLE"},"153509H","AMICALE BILLARD CLUB DE DAVEZIEUX"]
[2,"ACCETTOLA","ELIO",{"$f":"B3&\" \"&C3","v":"ACCETTOLA ELIO"},"152956G","ACADEMIE DE BILLARD DE CHASSIEU"]
[3,"ALONSO","LUCIEN","ALONSO LUCIEN","122424Q","A.B. DE BOURGOIN-JALLIEU",null,null,null,{"$f":"IF(ISNA(VLOOKUP(D4,[0]!d,2,FALSE)),\"\",VLOOKUP(D4,'Listing joueurs'!B:E,2,FALSE))","v":""}]
[4,"ANDRE","PASCAL","ANDRE PASCAL","100896Q","BILLARD CLUB DE LA PLAINE DU FOREZ"]
[5,"ANDRIEU","JEAN PIERRE","ANDRIEU JEAN PIERRE","153555H","BILLARD CLUB GRENOBLOIS"]
[6,"ANDRIEU","EVELYNE","ANDRIEU EVELYNE","153556J","BILLARD CLUB GRENOBLOIS"]
[7,"ANGELO","NATHANAEL","ANGELO NATHANAEL","159829C","CHARLEMAGNE SNOOKER CLUB"]
[8,"ANNEIX","JACQUES","ANNEIX JACQUES","121510M","BILLARD CLUB BOURBON"]
[9,"ARMAND","BRUNO","ARMAND BRUNO","015777V","VALENCE BILLARD CLUB"]
[10,"ARMAND","JEAN LOUIS","ARMAND JEAN LOUIS","015866G","BILLARD CLUB ROMANAIS PEAGEOIS"]
[11,"ARMANDI","JEAN CLAUDE","ARMANDI JEAN CLAUDE","152479N","BILLARD CLUB BOURBON"]
[12,"ARTICO","JOEL","ARTICO JOEL","162532Q","BILLARD STELLA THONON"]
[13,"AUBERT ROUECHE","ERIC","AUBERT ROUECHE ERIC","022383X","CLUB OMNISPORTS DE SAINT FONS"]
[14,"AUBRY","DOMINIQUE","AUBRY DOMINIQUE","140567L","ACADEMIE DE BILLARD D AUBENAS"]
[15,"AUFFRET","MARCEL","AUFFRET MARCEL","148023V","BILLARD STELLA THONON"]
[16,"AUGAGNEUR","JEAN PAUL","AUGAGNEUR JEAN PAUL","016143X","ASS. SPORTIVE MUNICIPALE ST ETIENNE"]
[17,"AURAND","LOUIS","AURAND LOUIS","015881V","BILLARD CLUB PONTOIS"]
[18,"AVET","BERNARD","AVET BERNARD","147114G","BILLARD CLUB AIXOIS"]
[19,"BACHELET","DANIEL","BACHELET DANIEL","159789J","A.B. DE BOURGOIN-JALLIEU"]
[20,"BAILLY","CLAUDE","BAILLY CLAUDE","016416K","CLUB CHAMBERIEN DE BILLARD"]
[21,"BAILLY","FABRICE","BAILLY FABRICE","126039R","BILLARD CLUB LYONNAIS 8 POOL"]
[22,"BAIZET","CHRISTIAN","BAIZET CHRISTIAN","015869J","BILLARD CLUB ROMANAIS PEAGEOIS"]
[23,"BALHAND","SEBASTIEN","BALHAND SEBASTIEN","160643M","CLUB CHAMBERIEN DE BILLARD"]
[24,"BANCILHON","JEAN","BANCILHON JEAN","143441Z","BILLARD CLUB ROMANAIS PEAGEOIS"]
[25,"BAPST","CHRISTIAN","BAPST CHRISTIAN","160730G","SAINT CHAMOND BILLARD CLUB"]
[26,"BARBIER","YANN","BARBIER YANN","138977H","Licenciés indépendants 42"]
[27,"BARRALON","FREDERIC","BARRALON FREDERIC","140811V","BILLARD CLUB DE SAINT-GALMIER"]
[28,"BARRAUD","PIERRE","BARRAUD PIERRE","132960W","BILLARD CLUB DE VILLEFRANCHE"]
[29,"BARROIS","ALAIN","BARROIS ALAIN","151506F","CLUB CHAMBERIEN DE BILLARD"]
[30,"BATAILLE","RAYMOND","BATAILLE RAYMOND","015826S","BILLARD CLUB PONTOIS"]
[31,"BAUP","PASCAL","BAUP PASCAL","016085R","ACADEMIE ANNECIENNE DE BILLARD"]
[32,"BAYET","BENOIT","BAYET BENOIT","132971H","CLUB DE BILLARD MONTBRISONNAIS"]
[33,"BAYET","BRUNO","BAYET BRUNO","137591Z","CLUB DE BILLARD MONTBRISONNAIS"]
[34,"BEAUCLAIR","JEAN RENE","BEAUCLAIR JEAN RENE","150876W","ACADEMIE DE BILLARD DE LA VALSERINE"]
[35,"BEAUD","CHRISTOPHE","BEAUD CHRISTOPHE","158185Q","CLUB CHAMBERIEN DE BILLARD"]
[36,"BEAUFILS","JEAN PATRICK","BEAUFILS JEAN PATRICK","149841W","CLUB CHAMBERIEN DE BILLARD"]
[37,"BEE","JEAN LUC","BEE JEAN LUC","144173D","B.S.CLERMONTOIS"]
[38,"BELBECIR","MOURAD","BELBECIR MOURAD","130046U","BILLARD CLUB 109"]
[39,"BELLEGY","LUCIEN","BELLEGY LUCIEN","162798E","CLUB DE BILLARD MONTBRISONNAIS"]
[40,"BELLET","SYLVAIN","BELLET SYLVAIN","162814X","CHARLEMAGNE SNOOKER CLUB"]
[41,"BEN ALLAL","YASSINE","BEN ALLAL YASSINE","132940C","BILLARD CLUB 109"]
[42,"BENITA","CLAUDE","BENITA CLAUDE","162934C","CLUB CHAMBERIEN DE BILLARD"]
[43,"BENOIT","LUCIEN","BENOIT LUCIEN","137590Y","CLUB DE BILLARD MONTBRISONNAIS"]
[44,"BERARD","HERVE","BERARD HERVE","135834K","BILLARD CLUB 109"]
[45,"BERCHE","JEAN LUC","BERCHE JEAN LUC","156508S","BILLARD CLUB ISSOIRE"]
[46,"BERGER","CHRISTIAN","BERGER CHRISTIAN","016488E","BILLARD CLUB DE SAINT-GALMIER"]
[47,"BERGER","MICHEL","BERGER MICHEL","127290U","VALENCE BILLARD CLUB"]
[48,"BERGNES","LENNY","BERGNES LENNY","155901H","BILLARD CLUB PONTOIS"]
[49,"BERLIAT","REGIS","BERLIAT REGIS","137600I","BILLARD CLUB PONTOIS"]
[50,"BERLIAT","PATRICIA","BERLIAT PATRICIA","149474X","BILLARD CLUB PONTOIS"]
[51,"BERNARD","ALAIN","BERNARD ALAIN","142693F","CLUB DE BILLARD MONTBRISONNAIS"]
[52,"BERNILLON","MARCEL","BERNILLON MARCEL","100867N","CLUB OMNISPORTS DE SAINT FONS"]
[53,"BERRAHOU","SOLANGE","BERRAHOU SOLANGE","153217Q","ACADEMIE DE BILLARD DE LA VALSERINE"]
[54,"BERRUYER","ROGER","BERRUYER ROGER","015900O","BILLARD CLUB ROMANAIS PEAGEOIS"]
[55,"BERTHELIER","PATRICK","BERTHELIER PATRICK","015959V","LE TAPIS VERT ROANNAIS"]
[56,"BERTHIER","DOMINIQUE","BERTHIER DOMINIQUE","100869P","CLUB OMNISPORTS DE SAINT FONS"]
[57,"BERTHOLON","GERARD","BERTHOLON GERARD","016073F","ACAD. DE BILLARD DE SAINT-ETIENNE"]
[58,"BERTOTTO","CHRISTIAN","BERTOTTO CHRISTIAN","129026O","BILLARD CLUB ISSOIRE"]
[59,"BESSE","DANIEL","BESSE DANIEL","159641Y","BILLARD CLUB GRENOBLOIS"]
[60,"BETTES","JEAN LOUIS","BETTES JEAN LOUIS","100973P","BILLARD CLUB ROMANAIS PEAGEOIS"]
[61,"BEZIER","RENAUD","BEZIER RENAUD","136030Y","ACADEMIE BILLARD OUEST LYONNAIS"]
[62,"BIENNE","CYRIL","BIENNE CYRIL","137839N","CHARLEMAGNE SNOOKER CLUB"]
[63,"BIGNANI","PATRICK","BIGNANI PATRICK","157066Z","ACADEMIE DE BILLARD D AUBENAS"]
[64,"BILLARD","JEAN LOUIS","BILLARD JEAN LOUIS","100915J","CLUB CHAMBERIEN DE BILLARD"]
[65,"BLANCHARD","CLAUDE","BLANCHARD CLAUDE","112490O","ACADEMIE ANNECIENNE DE BILLARD"]
[66,"BLANCHET","PATRICK",{"$f":"B67&\" \"&C67","v":"BLANCHET PATRICK"},"138188Y","BLACKBALL BILLARD CLUB BESAYES 26"]
[67,"BLONDOT","YVES","BLONDOT YVES","016219V","ACADEMIE ANNECIENNE DE BILLARD"]
[68,"BLUET","JEAN MARIE","BLUET JEAN MARIE","133632S","ACADEMIE DE BILLARD DE CHASSIEU"]
[69,"BOBEE","GREGORY","BOBEE GREGORY","100009N","BILLARD CLUB DE SAINT-GALMIER"]
[70,"BOCHARD","PHILIPPE","BOCHARD PHILIPPE","156521G","BILLARD CLUB ISSOIRE"]
[71,"BODEREAU","JOHANNY","BODEREAU JOHANNY","152681H","CLERMONT AUVERGNE BILLARD CLUB"]
[72,"BOISSIERE","VINCENT","BOISSIERE VINCENT","143741N","BILLARD CLUB GRENOBLOIS"]
[73,"BOISSOU","ROBERT","BOISSOU ROBERT","015787F","CLUB CHAMBERIEN DE BILLARD"]
[74,"BONDOUY","FREDERIK","BONDOUY FREDERIK","146112S","ACADEMIE DE BILLARD D AUBENAS"]
[75,"BONNAMOUR","ETIENNE","BONNAMOUR ETIENNE","145637L","CLUB DE BILLARD MONTBRISONNAIS"]
[76,"BONNEFOI","RICHARD","BONNEFOI RICHARD","015796O","CLUB OMNISPORTS DE SAINT FONS"]
[77,"BONNEFOND","CHRISTIAN","BONNEFOND CHRISTIAN","148303Z","ACADEMIE BILLARD OUEST LYONNAIS"]
[78,"BORDET","LEO","BORDET LEO","163047A","ACADEMIE DE BILLARD DE CHASSIEU"]
[79,"BORGEAT","CHRISTIANE","BORGEAT CHRISTIANE","156534W","ACADEMIE DE BILLARD DE LA VALSERINE"]
[80,"BORY","PHILIPPE","BORY PHILIPPE","016111R","CLUB DE BILLARD MONTBRISONNAIS"]
[81,"BOSIA","JULIEN","BOSIA JULIEN","133771B","BILLARD CLUB DE GAILLARD"]
[82,"BOTTON","JACKY","BOTTON JACKY","015843J","BILLARD CLUB PONTOIS"]
[83,"BOUDAILLIER","PIERRE","BOUDAILLIER PIERRE","011105D","B.S.CLERMONTOIS"]
[84,"BOURDIC","CLAUDE","BOURDIC CLAUDE","130420E","A.B. DE BOURGOIN-JALLIEU"]
[85,"BOURDIN","JACQUES","BOURDIN JACQUES","011141N","BILLARD CLUB MONTLUCONNAIS"]
[86,"BOURGEOIS","GERARD","BOURGEOIS GERARD","016056O","BILLARD STELLA THONON"]
[87,"BOURHIS","JEAN","BOURHIS JEAN","021913V","BILLARD CLUB PONTOIS"]
[88,"BOUZOUZOU","HAMID","BOUZOUZOU HAMID","162644M","BILLARD CLUB 109"]
[89,"BOYER","BERNARD","BOYER BERNARD","145377L","BILLARD CLUB ROMANAIS PEAGEOIS"]
[90,"BRAYAT","KEVIN","BRAYAT KEVIN","135588Y","BIG BEN BLACKBALL"]
[91,"BREDA","YVES","BREDA YVES","112866A","BILLARD CLUB AIXOIS"]
[92,"BREGRE","SEBASTIEN","BREGRE SEBASTIEN","159347D","BIG BEN BLACKBALL"]
[93,"BREGRE","MAELYS","BREGRE MAELYS","162579R","BIG BEN BLACKBALL"]
[94,"BREGRE","LILOU","BREGRE LILOU","162580S","BIG BEN BLACKBALL"]
[95,"BROCHIER","PATRICK","BROCHIER PATRICK","152651A","ACADEMIE DE BILLARD DE CHASSIEU"]
[96,"BRUN","CHRISTOPHE","BRUN CHRISTOPHE","155902J","BILLARD CLUB PONTOIS"]
[97,"BRUNET","GILLES","BRUNET GILLES","155127R","SAINT CHAMOND BILLARD CLUB"]
[98,"BRUNET","MARC","BRUNET MARC","163037P","B.S.CLERMONTOIS"]
[99,"BRUNETAUD","ALAIN","BRUNETAUD ALAIN","150014J","BILLARD CLUB AIXOIS"]
[100,"BRUYAS","ANTOINE","BRUYAS ANTOINE","100972O","Licenciés indépendants 42"]
[101,"BUGIS","ANDRE","BUGIS ANDRE","152401D","BILLARD CLUB AIXOIS"]
[102,"CABANES","PHILIPPE","CABANES PHILIPPE","015748S","BILLARD CLUB PONTOIS"]
[103,"CABARET","MICHEL","CABARET MICHEL","127650Q","BILLARD CLUB GRENOBLOIS"]
[104,"CADET","DAVID CHRISTOPHER","CADET DAVID CHRISTOPHER","161384S","BILLARD CLUB LYONNAIS 8 POOL"]
[105,"CADORE","JEAN LUC","CADORE JEAN LUC","112460K","ACADEMIE BILLARD OUEST LYONNAIS"]
[106,"CAESTEKER","MARCEL","CAESTEKER MARCEL","156463T","BILLARD CLUB ISSOIRE"]
[107,"CALYAKA","ABDURRAHMAN","CALYAKA ABDURRAHMAN","161059P","SAINT CHAMOND BILLARD CLUB"]
[108,"CAMBERLIN","FABIEN","CAMBERLIN FABIEN","012125J","CLUB DE BILLARD MONTBRISONNAIS"]
[109,"CARAVATI","PASCAL","CARAVATI PASCAL","152780Q","BILLARD CLUB ROMANAIS PEAGEOIS"]
[110,"CARENZI","ROLLAND","CARENZI ROLLAND","159396G","BILLARD CLUB AIXOIS"]
[111,"CARLIER","QUENTIN","CARLIER QUENTIN","162480J","BLACKBALL BILLARD CLUB BESAYES 26"]
[112,"CARNAT","ROBERT","CARNAT ROBERT","015983T","LE TAPIS VERT ROANNAIS"]
[113,"CARRERES","MANUEL","CARRERES MANUEL","152673Z","LE TAPIS VERT ROANNAIS"]
[114,"CASSIS","MAXIME","CASSIS MAXIME","108521X","BILLARD CLUB GRENOBLOIS"]
[115,"CATIL","DAVID","CATIL DAVID","163092Z","LES SQUALES"]
[116,"CELETTE","MICHEL","CELETTE MICHEL","143750W","BILLARD CLUB GRENOBLOIS"]
[117,"CERVERA","IRIS","CERVERA IRIS","141633L","BILLARD CLUB GRENOBLOIS"]
[118,"CHABRAY","DANIEL","CHABRAY DANIEL","107387H","BILLARD CLUB ROMANAIS PEAGEOIS"]
[119,"CHADELAUD","JEAN MICHEL","CHADELAUD JEAN MICHEL","016247X","BILLARD CLUB ALBERTVILLE"]
[120,"CHAMBON","PIERRE","CHAMBON PIERRE","145364Y","CLUB DE BILLARD MONTBRISONNAIS"]
[121,"CHAMONAZ","VANESSA","CHAMONAZ VANESSA","100904Y","BILLARD CLUB PONTOIS"]
[122,"CHANNAUX","PATRCK","CHANNAUX PATRCK","149865X","BILLARD CLUB DE SAINT-GALMIER"]
[123,"CHANTREAU","DIDIER","CHANTREAU DIDIER","150082H","ACADEMIE ANNECIENNE DE BILLARD"]
[124,"CHAPATON","DOMINIQUE","CHAPATON DOMINIQUE","100834G","BILLARD CLUB 109"]
[125,"CHAPEAUX","EMILE","CHAPEAUX EMILE","015813F","BILLARD CLUB DE VILLEFRANCHE"]
[126,"CHAPON","JEAN MARIE","CHAPON JEAN MARIE","143193L","ACADEMIE DE BILLARD DE LA VALSERINE"]
[127,"CHARDON","JACQUES","CHARDON JACQUES","150746E","ACADEMIE ANNECIENNE DE BILLARD"]
[128,"CHAUSSAT","JEAN MARC","CHAUSSAT JEAN MARC","016054M","ACAD. DE BILLARD DE SAINT-ETIENNE"]
[129,"CHAUVET","IVAN","CHAUVET IVAN","137566A","BILLARD CLUB ISSOIRE"]
[130,"CHEMIN","PIERRE",{"$f":"B131&\" \"&C131","v":"CHEMIN PIERRE"},"139524I","CLUB CHAMBERIEN DE BILLARD"]
[131,"CHERPIN","GUY","CHERPIN GUY","131290Q","LE TAPIS VERT ROANNAIS"]
[132,"CIVRAIS","CHRISTIAN","CIVRAIS CHRISTIAN","122570G","LE TAPIS VERT ROANNAIS"]
[133,"CLARET","GEORGES","CLARET GEORGES","158186R","CLUB CHAMBERIEN DE BILLARD"]
[134,"CLERMONT","PASCAL","CLERMONT PASCAL","155702R","CLUB OMNISPORTS DE SAINT FONS"]
[135,"CLUZEL","JACQUES","CLUZEL JACQUES","107706O","BILLARD CLUB GRENOBLOIS"]
[136,"COCHEZ","FREDERIC","COCHEZ FREDERIC","122770Y","CLERMONT AUVERGNE BILLARD CLUB"]
[137,"COEURET","JACQUES","COEURET JACQUES","015888C","A.B. DE BOURGOIN-JALLIEU"]
[138,"COFFY","JEROME","COFFY JEROME","146267R","BILLARD CLUB PONTOIS"]
[139,"COLLET","JEAN CLAUDE","COLLET JEAN CLAUDE","147331S","LE TAPIS VERT ROANNAIS"]
[140,"COMBAZ","GUY","COMBAZ GUY","153539Q","CLUB CHAMBERIEN DE BILLARD"]
[141,"CONSTANTIN","JACQUES","CONSTANTIN JACQUES","137433X","BILLARD STELLA THONON"]
[142,"CONTAMINE","ALAIN","CONTAMINE ALAIN","010957L","BILLARD CLUB MONTLUCONNAIS"]
[143,"CORBY","JEAN CLAUDE","CORBY JEAN CLAUDE","160166T","BILLARD CLUB AIXOIS"]
[144,"CORVAISIER","DOMINIQUE","CORVAISIER DOMINIQUE","140814Y","CLUB OMNISPORTS DE SAINT FONS"]
[145,"COSNARD","SEBASTIEN","COSNARD SEBASTIEN","145351L","BILLARD CLUB DE GAILLARD"]
[146,"COSNIER","ROMAIN","COSNIER ROMAIN","131320U","BIG BEN BLACKBALL"]
[147,"COSTA","GERARD","COSTA GERARD","159237J","BILLARD CLUB AIXOIS"]
[148,"COTTIN","EMMANUEL","COTTIN EMMANUEL","150468C","SAINT CHAMOND BILLARD CLUB"]
[149,"COURVOISIER","MYRIAM","COURVOISIER MYRIAM","152649Y","ACADEMIE DE BILLARD DE CHASSIEU"]
[150,"COUSTENOBLE","CHRISTOPHE","COUSTENOBLE CHRISTOPHE","133106M","BILLARD STELLA THONON"]
[151,"COUTAREL","YVES","COUTAREL YVES","129879J","ACADEMIE BILLARD OUEST LYONNAIS"]
[152,"CUBIZOLLES","ALAIN","CUBIZOLLES ALAIN","122400S","CLERMONT AUVERGNE BILLARD CLUB"]
[153,"CUBIZOLLES","EVA","CUBIZOLLES EVA","131904G","CLERMONT AUVERGNE BILLARD CLUB"]
[154,"CUCCO","FREDERIC","CUCCO FREDERIC","107701J","BILLARD CLUB PONTOIS"]
[155,"CUNY","ALAIN","CUNY ALAIN","016165T","AMICALE BILLARD CLUB DE DAVEZIEUX"]
[156,"CUNY","BERNARD","CUNY BERNARD","142704Q","CLUB OMNISPORTS DE SAINT FONS"]
[157,"CURT","ALAIN","CURT ALAIN","131284K","BILLARD CLUB ALBERTVILLE"]
[158,"DA ENCARNACAO","JOSE","DA ENCARNACAO JOSE","143275P","BILLARD CLUB 109"]
[159,"DA SILVA","JOSEPH","DA SILVA JOSEPH","146345R","CLERMONT AUVERGNE BILLARD CLUB"]
[160,"DAGNIAUX","DANIEL","DAGNIAUX DANIEL","113580M","BILLARD STELLA THONON"]
[161,"DALLOYEAU","CHRISTIAN","DALLOYEAU CHRISTIAN","015758C","BILLARD STELLA THONON"]
[162,"DAMIER","NICOLAS","DAMIER NICOLAS","105671H","BILLARD CLUB ROMANAIS PEAGEOIS"]
[163,"DARAKDJIAN","CLAUDE","DARAKDJIAN CLAUDE","137613V","VALENCE BILLARD CLUB"]
[164,"DAUBERT","PATRICE","DAUBERT PATRICE","162917J","BILLARD CLUB DE VILLEFRANCHE"]
[165,"DE BORTOLI","PATRICK","DE BORTOLI PATRICK","158189V","CLUB CHAMBERIEN DE BILLARD"]
[166,"DE DOMENICO","ROBERTO","DE DOMENICO ROBERTO","141464Y","BILLARD STELLA THONON"]
[167,"DEBENOIT","FRANCK","DEBENOIT FRANCK","145373H","CLUB OMNISPORTS DE SAINT FONS"]
[168,"DECLERIEUX","YOAN","DECLERIEUX YOAN","123645P","BILLARD CLUB LYONNAIS 8 POOL"]
[169,"DECOMBE","JEAN PIERRE","DECOMBE JEAN PIERRE","107336I","BILLARD CLUB DE VILLEFRANCHE"]
[170,"DECROUX","BERNARD","DECROUX BERNARD","015771P","VALENCE BILLARD CLUB"]
[171,"DEFOSSE","MICHEL","DEFOSSE MICHEL","016486C","LE TAPIS VERT ROANNAIS"]
[172,"DEFRANOUX","FRANCIS","DEFRANOUX FRANCIS","152400C","BILLARD CLUB AIXOIS"]
[173,"DELANGE","GUY","DELANGE GUY","015805X","BILLARD CLUB DE VILLEFRANCHE"]
[174,"DELATTRE","SERGE","DELATTRE SERGE","140563H","A.B. DE BOURGOIN-JALLIEU"]
[175,"DELEPAUT","ANDRE","DELEPAUT ANDRE","147555L","BILLARD CLUB DE GAILLARD"]
[176,"DELLA BOSCA","PAOLO","DELLA BOSCA PAOLO","132952O","BILLARD CLUB 109"]
[177,"DELORME","STEPHANE","DELORME STEPHANE","127292W","BILLARD CLUB ROMANAIS PEAGEOIS"]
[178,"DELOUCHE","ANTOINE","DELOUCHE ANTOINE","127765B","CLERMONT AUVERGNE BILLARD CLUB"]
[179,"DEMELLAYER","ALEXIS","DEMELLAYER ALEXIS","144452W","CHARLEMAGNE SNOOKER CLUB"]
[180,"DEMONET","DAVID","DEMONET DAVID","129874E","CHARLEMAGNE SNOOKER CLUB"]
[181,"DEMONET","ANTOINE","DEMONET ANTOINE","157695H","CLUB DE BILLARD MONTBRISONNAIS"]
[182,"DEODATI","PIERRE","DEODATI PIERRE","160681D","BILLARD CLUB ROMANAIS PEAGEOIS"]
[183,"DEPUYDT","EDDY","DEPUYDT EDDY","159235G","THE BLACK 8 POOL"]
[184,"DEROUALLIERE","JEAN MARC","DEROUALLIERE JEAN MARC","122086Q","BILLARD CLUB PONTOIS"]
[185,"DESBAR","MAXIME","DESBAR MAXIME","162869G","BILLARD CLUB ROMANAIS PEAGEOIS"]
[186,"DESSERLE","GUY","DESSERLE GUY","131551R","LE TAPIS VERT ROANNAIS"]
[187,"DESSERT","STEPHANE","DESSERT STEPHANE","016132M","ACAD. DE BILLARD DE SAINT-ETIENNE"]
[188,"DEVANNE","FREDERIC","DEVANNE FREDERIC","132887B","BILLARD CLUB GRENOBLOIS"]
[189,"DEZEMPTE","MICHEL","DEZEMPTE MICHEL","149951Q","BILLARD CLUB DE VILLEFRANCHE"]
[190,"DIDIER","JEAN PAUL","DIDIER JEAN PAUL","011026C","BILLARD CLUB MOULINS"]
[191,"DOMAS","SOPHIE","DOMAS SOPHIE","159765H","ACADEMIE DE BILLARD DE CHASSIEU"]
[192,"DOMINGO","XAVIER","DOMINGO XAVIER","108968C","BILLARD CLUB ROMANAIS PEAGEOIS"]
[193,"DONATO","LAURENT","DONATO LAURENT","146971B","ACADEMIE DE BILLARD DE LA VALSERINE"]
[194,"DONSBECK","CLAUDE",{"$f":"B195&\" \"&C195","v":"DONSBECK CLAUDE"},"145229T","ACADEMIE DE BILLARD DE LA VALSERINE"]
[195,"DORIER","ALAIN","DORIER ALAIN","015743N","BILLARD CLUB ROMANAIS PEAGEOIS"]
[196,"DREME","BERNARD","DREME BERNARD","156425C","ACADEMIE DE BILLARD DE CHASSIEU"]
[197,"DRIOT","JACKY","DRIOT JACKY","016189R","CLUB DE BILLARD MONTBRISONNAIS"]
[198,"DUARTE","JOSE","DUARTE JOSE","146968Y","ACADEMIE DE BILLARD DE LA VALSERINE"]
[199,"DUBART","JACQUES","DUBART JACQUES","100928W","LES SQUALES"]
[200,"DUBROEUCQ","PHILIPPE","DUBROEUCQ PHILIPPE","156212W","CHARLEMAGNE SNOOKER CLUB"]
[201,"DUBUISSON","EMMA","DUBUISSON EMMA","162910B","ACADEMIE DE BILLARD DE LA VALSERINE"]
[202,"DUDIT","FABIEN","DUDIT FABIEN","130105B","BILLARD CLUB DE BOURG EN BRESSE"]
[203,"DUHEM","SYLVAIN","DUHEM SYLVAIN","143434S","BILLARD CLUB ROMANAIS PEAGEOIS"]
[204,"DUJOUX","JEAN YVES","DUJOUX JEAN YVES","154985M","B.S.CLERMONTOIS"]
[205,"DUMONT","ALAIN","DUMONT ALAIN","147111D","BILLARD CLUB AIXOIS"]
[206,"DUMOULIN","LAURENT","DUMOULIN LAURENT","147330R","LE TAPIS VERT ROANNAIS"]
[207,"DUPLOMB","GUY","DUPLOMB GUY","015992C","VALENCE BILLARD CLUB"]
[208,"DUPONT","GERARD","DUPONT GERARD","139528M","ACADEMIE BILLARD OUEST LYONNAIS"]
[209,"DUPRE RAMBAUD","FREDERIC","DUPRE RAMBAUD FREDERIC","122306C","LES SQUALES"]
[210,"DURAND","MICHEL","DURAND MICHEL","101757T","AMICALE BILLARD CLUB DE DAVEZIEUX"]
[211,"DURET","CHRISTOPHE","DURET CHRISTOPHE","105704O","CLUB CHAMBERIEN DE BILLARD"]
[212,"DUVILLARD","VINCENT","DUVILLARD VINCENT","162776F","CHARLEMAGNE SNOOKER CLUB"]
[213,"DUVOISIN","BAPTISTE","DUVOISIN BAPTISTE","112524W","BILLARD CLUB 109"]
[214,"ELION","MAURICE","ELION MAURICE","129881L","ACADEMIE ANNECIENNE DE BILLARD"]
[215,"ESPINOSA","SEBASTIEN","ESPINOSA SEBASTIEN","155523X","BILLARD CLUB PONTOIS"]
[216,"FACHE","JEAN PAUL","FACHE JEAN PAUL","129027P","BILLARD CLUB ISSOIRE"]
[217,"FADILI","YOUSSEF","FADILI YOUSSEF","159685W","BILLARD CLUB LYONNAIS 8 POOL"]
[218,"FALLOT","EYMERIC","FALLOT EYMERIC","160682E","VALENCE BILLARD CLUB"]
[219,"FANZONE","JEAN CLAUDE","FANZONE JEAN CLAUDE","146110Q","BILLARD CLUB GRENOBLOIS"]
[220,"FAURE","ELIE","FAURE ELIE","157172P","B.S.CLERMONTOIS"]
[221,"FAURE COMTE","HENRI","FAURE COMTE HENRI","016166U","AMICALE BILLARD CLUB DE DAVEZIEUX"]
[222,"FAVENTIN","JACQUES","FAVENTIN JACQUES","146947A","BILLARD CLUB DE VILLEFRANCHE"]
[223,"FAYOLLE","GUY","FAYOLLE GUY","162697V","A.B. DE BOURGOIN-JALLIEU"]
[224,"FELIX","RENE","FELIX RENE","159809F","ACADEMIE DE BILLARD DE CHASSIEU"]
[225,"FERNANDES","PASCAL","FERNANDES PASCAL","126053F","A.B. DE BOURGOIN-JALLIEU"]
[226,"FERNANDES","BENJAMIN","FERNANDES BENJAMIN","163075F","ACADEMIE DE BILLARD DE CHASSIEU"]
[227,"FERNANDEZ","JOSE","FERNANDEZ JOSE","011128A","B.S.CLERMONTOIS"]
[228,"FERNANDEZ","ALPHONSE","FERNANDEZ ALPHONSE","129892W","BILLARD CLUB GRENOBLOIS"]
[229,"FERNANDEZ HERRERA","GUY","FERNANDEZ HERRERA GUY","160181K","CLUB OMNISPORTS DE SAINT FONS"]
[230,"FERRATON","MICHEL","FERRATON MICHEL","117218K","ACAD. DE BILLARD DE SAINT-ETIENNE"]
[231,"FERRE","JEAN PAUL","FERRE JEAN PAUL","016108O","BILLARD CLUB SAINT ROMANAIS"]
[232,"FERREOL","EMILE","FERREOL EMILE","129896A","BILLARD CLUB DE SAINT-GALMIER"]
[233,"FERRIOL","DOMINIQUE","FERRIOL DOMINIQUE","100873T","BILLARD CLUB DE VILLEFRANCHE"]
[234,"FESQUET","EMILIE","FESQUET EMILIE","156703E","BILLARD CLUB PONTOIS"]
[235,"FETTIG","SEVERINE","FETTIG SEVERINE","152575S","SAINT CHAMOND BILLARD CLUB"]
[236,"FLEURY","MICHEL","FLEURY MICHEL","016070C","CLUB OMNISPORTS DE SAINT FONS"]
[237,"FLORIAN","DENIS","FLORIAN DENIS","015524C","CLUB DE BILLARD MONTBRISONNAIS"]
[238,"FLUTTAZ","JEAN LOUIS","FLUTTAZ JEAN LOUIS","142709V","ACADEMIE ANNECIENNE DE BILLARD"]
[239,"FONGARNAND","DIDIER","FONGARNAND DIDIER","013137H","B.S.CLERMONTOIS"]
[240,"FORCE","STEPHANE","FORCE STEPHANE","129018G","B.S.CLERMONTOIS"]
[241,"FORISSIER","LOUIS","FORISSIER LOUIS","137718W","BILLARD CLUB DE SAINT-GALMIER"]
[242,"FOURNIER","CLAUDIUS","FOURNIER CLAUDIUS","121518U","BILLARD CLUB MOULINS"]
[243,"FOURRE","NICOLAS","FOURRE NICOLAS","104920K","CLERMONT AUVERGNE BILLARD CLUB"]
[244,"FRAGNE","MARCEL","FRAGNE MARCEL","137719X","BILLARD CLUB DE SAINT-GALMIER"]
[245,"FRAIX","STEVE","FRAIX STEVE","145120O","CLUB CHAMBERIEN DE BILLARD"]
[246,"FRANCE","FERNAND","FRANCE FERNAND","145114I","BILLARD CLUB DE SAINT-GALMIER"]
[247,"FRANCOIS","DIDIER","FRANCOIS DIDIER","156122Y","CLUB CHAMBERIEN DE BILLARD"]
[248,"FRAPPA","DIDIER","FRAPPA DIDIER","145514S","AMICALE BILLARD CLUB DE DAVEZIEUX"]
[249,"FRECHET","JULIEN","FRECHET JULIEN","159648F","BILLARD CLUB GRENOBLOIS"]
[250,"FUENTES","RICARDO","FUENTES RICARDO","136034C","ACADEMIE DE BILLARD DE LA VALSERINE"]
[251,"GALLAND","GREGORY","GALLAND GREGORY","013178W","ACADEMIE BILLARD OUEST LYONNAIS"]
[252,"GALLO","MICHEL","GALLO MICHEL","015760E","BILLARD CLUB GRENOBLOIS"]
[253,"GALLON","JEAN CLAUDE","GALLON JEAN CLAUDE","140821F","Licenciés indépendants 63"]
[254,"GALLOT","RUDY","GALLOT RUDY","149257L","CLUB DE BILLARD MONTBRISONNAIS"]
[255,"GALTIER","JEAN LUC","GALTIER JEAN LUC","157702Q","ACADEMIE DE BILLARD DE LA VALSERINE"]
[256,"GAUCHER","JEAN FRANCOIS","GAUCHER JEAN FRANCOIS","100870Q","CLUB OMNISPORTS DE SAINT FONS"]
[257,"GEINDRE","BENJAMIN","GEINDRE BENJAMIN","155794R","BIG BEN BLACKBALL"]
[258,"GELIBERT","ALEXIS",{"$f":"B259&\" \"&C259","v":"GELIBERT ALEXIS"},"159122J","ACADEMIE DE BILLARD DE LA VALSERINE"]
[259,"GELIBERT","MARGAUX","GELIBERT MARGAUX","159123K","ACADEMIE DE BILLARD DE LA VALSERINE"]
[260,"GELOFFIER","MAURICE","GELOFFIER MAURICE","147332T","LE TAPIS VERT ROANNAIS"]
[261,"GENEVRIER","GERARD","GENEVRIER GERARD","132972I","BILLARD CLUB SAINT ROMANAIS"]
[262,"GERLAT","MAGALY","GERLAT MAGALY","145518W","LES SQUALES"]
[263,"GHOMINEJAD","KEYVAN","GHOMINEJAD KEYVAN","156213X","CHARLEMAGNE SNOOKER CLUB"]
[264,"GIACOMARRA","ENZO","GIACOMARRA ENZO","153804D","CHARLEMAGNE SNOOKER CLUB"]
[265,"GILARDIN","JACQUES","GILARDIN JACQUES","147591A","BILLARD CLUB MOULINS"]
[266,"GILARDIN","SEBASTIEN","GILARDIN SEBASTIEN","149637Z","BILLARD CLUB MOULINS"]
[267,"GILLON","JEAN CLAUDE","GILLON JEAN CLAUDE","134037H","BILLARD CLUB MOULINS"]
[268,"GIRON","STEPHANIE","GIRON STEPHANIE","134035F","B.S.CLERMONTOIS"]
[269,"GOLDBACH","ERIC","GOLDBACH ERIC","147619F","ACADEMIE DE BILLARD D AUBENAS"]
[270,"GOMBERT","MARTIN","GOMBERT MARTIN","163117B","BILLARD CLUB ROMANAIS PEAGEOIS"]
[271,"GONZALEZ","BORIS","GONZALEZ BORIS","143533N","ACADEMIE BILLARD OUEST LYONNAIS"]
[272,"GOURDIN","MICHEL","GOURDIN MICHEL","107633T","CLUB OMNISPORTS DE SAINT FONS"]
[273,"GOUTTE","LYDIE","GOUTTE LYDIE","155903K","BILLARD CLUB PONTOIS"]
[274,"GOYENETCHE","STEPHANE","GOYENETCHE STEPHANE","159850A","ACADEMIE DE BILLARD DE CHASSIEU"]
[275,"GOYENETCHE","RAMUNTCHO","GOYENETCHE RAMUNTCHO","160060D","ACADEMIE DE BILLARD DE CHASSIEU"]
[276,"GREGOIRE","PHILIPPE","GREGOIRE PHILIPPE","138328I","BILLARD CLUB ROMANAIS PEAGEOIS"]
[277,"GRESLE","JEAN MICHEL","GRESLE JEAN MICHEL","136412Q","BILLARD CLUB MONTLUCONNAIS"]
[278,"GRI","ALEXANDRE","GRI ALEXANDRE","155129T","SAINT CHAMOND BILLARD CLUB"]
[279,"GRIMM","PATRICK","GRIMM PATRICK","146269T","ACADEMIE DE BILLARD DE LA VALSERINE"]
[280,"GRIOT","GILBERT","GRIOT GILBERT","145370E","CLUB DE BILLARD MONTBRISONNAIS"]
[281,"GROS","MARC","GROS MARC","137714S","ACADEMIE BILLARD OUEST LYONNAIS"]
[282,"GRUET","BERNARD","GRUET BERNARD","156507R","BILLARD CLUB ISSOIRE"]
[283,"GUILBAUD","ROMAIN","GUILBAUD ROMAIN","105784Q","BLACKBALL BILLARD CLUB BESAYES 26"]
[284,"GUILBAUD","JEAN CLAUDE","GUILBAUD JEAN CLAUDE","105785R","BLACKBALL BILLARD CLUB BESAYES 26"]
[285,"GUILLAUMOND","ALAIN","GUILLAUMOND ALAIN","145124S","SAINT CHAMOND BILLARD CLUB"]
[286,"GUILLEMIN","CLAUDE","GUILLEMIN CLAUDE","153545X","CLUB CHAMBERIEN DE BILLARD"]
[287,"GUILLOT","CLAUDE","GUILLOT CLAUDE","132533L","BILLARD CLUB DE LA PLAINE DU FOREZ"]
[288,"GUILLOT","PIERRE","GUILLOT PIERRE","140689D","CLUB DE BILLARD MONTBRISONNAIS"]
[289,"GUILLOT","SAMUEL","GUILLOT SAMUEL","162475D","THE BLACK 8 POOL"]
[290,"GUILLOUD","JEAN JACQUES","GUILLOUD JEAN JACQUES","016128I","ACADEMIE DE BILLARD DE CHASSIEU"]
[291,"HAAS","DOMINIQUE","HAAS DOMINIQUE","156663L","BILLARD CLUB DE SAINT-GALMIER"]
[292,"HAINAUT","DAVID","HAINAUT DAVID","155834K","ACADEMIE DE BILLARD DE LA VALSERINE"]
[293,"HANNOU","RACHID","HANNOU RACHID","145227R","BILLARD CLUB DE GAILLARD"]
[294,"HANTZ","MICHEL","HANTZ MICHEL","147113F","BILLARD CLUB AIXOIS"]
[295,"HAYEM","PATRICK","HAYEM PATRICK","119307T","BILLARD CLUB MOULINS"]
[296,"HEBERT","ALAIN","HEBERT ALAIN","015926O","BILLARD CLUB ROMANAIS PEAGEOIS"]
[297,"HELIN","ALAIN","HELIN ALAIN","015815H","BILLARD CLUB DE VILLEFRANCHE"]
[298,"HENRIQUES","VICTOR","HENRIQUES VICTOR","162919L","BILLARD CLUB DE VILLEFRANCHE"]
[299,"HERREMAN","FRANCOIS","HERREMAN FRANCOIS","137571F","LES SQUALES"]
[300,"HILAIRE","JIMMY","HILAIRE JIMMY","137050E","ACADEMIE BILLARD OUEST LYONNAIS"]
[301,"HOGG","JEAN CLAUDE","HOGG JEAN CLAUDE","142694G","CLUB DE BILLARD MONTBRISONNAIS"]
[302,"HONG LAMHONG","PIERRE","HONG LAMHONG PIERRE","100883D","SAINT CHAMOND BILLARD CLUB"]
[303,"HONG LAMHONG","ALEXANDRE","HONG LAMHONG ALEXANDRE","112520S","CLUB OMNISPORTS DE SAINT FONS"]
[304,"HOYER","GILLES","HOYER GILLES","016152G","CLUB OMNISPORTS DE SAINT FONS"]
[305,"HUE","PHILIPPE","HUE PHILIPPE","159168J","BILLARD CLUB AIXOIS"]
[306,"ICARD","ANDRE","ICARD ANDRE","015717N","ACADEMIE DE BILLARD DE CHASSIEU"]
[307,"IGLESIA","PIERRE","IGLESIA PIERRE","160576P","BLACKBALL BILLARD CLUB BESAYES 26"]
[308,"ISMALAJ","YLBER","ISMALAJ YLBER","159866S","BILLARD CLUB 109"]
[309,"IZOULET","SIMON","IZOULET SIMON","131907J","THE BLACK 8 POOL"]
[310,"JACOB","BERNARD","JACOB BERNARD","146254E","CLUB CHAMBERIEN DE BILLARD"]
[311,"JACQUEMART","MICKAEL","JACQUEMART MICKAEL","149406Y","BIG BEN BLACKBALL"]
[312,"JACQUIN","JEROME","JACQUIN JEROME","162800G","CLUB DE BILLARD MONTBRISONNAIS"]
[313,"JACQUIN","LOUIS","JACQUIN LOUIS","162801H","CLUB DE BILLARD MONTBRISONNAIS"]
[314,"JANOIR","ERIC","JANOIR ERIC","101069H","BILLARD CLUB 109"]
[315,"JAPIOT","HUBERT","JAPIOT HUBERT","156124A","ACADEMIE DE BILLARD DE CHASSIEU"]
[316,"JARDIN","GERARD","JARDIN GERARD","015878S","BILLARD CLUB AIXOIS"]
[317,"JARRET","ANDRE","JARRET ANDRE","139455R","ACADEMIE DE BILLARD DE CHASSIEU"]
[318,"JEANTET","JEAN CLAUDE","JEANTET JEAN CLAUDE","159482A","ACADEMIE DE BILLARD DE LA VALSERINE"]
[319,"JOFFRE","MARC","JOFFRE MARC","136095L","AMICALE BILLARD CLUB DE DAVEZIEUX"]
[320,"JOUBERT","ERIC","JOUBERT ERIC","160742V","BILLARD CLUB MONTLUCONNAIS"]
[321,"JOUVE","SAMUEL","JOUVE SAMUEL","101070I","BILLARD CLUB 109"]
[322,"JULLIAT","VINCENT",{"$f":"B323&\" \"&C323","v":"JULLIAT VINCENT"},"016161P","AMICALE BILLARD CLUB DE DAVEZIEUX"]
[323,"JULLIAT","GUILLAUME","JULLIAT GUILLAUME","141631J","AMICALE BILLARD CLUB DE DAVEZIEUX"]
[324,"JULLION","ANDRE","JULLION ANDRE","147356V","AMICALE BILLARD CLUB DE DAVEZIEUX"]
[325,"KEBE","MAMADOU","KEBE MAMADOU","162803K","CLUB CHAMBERIEN DE BILLARD"]
[326,"KERLEAUX","JEAN CLAUDE","KERLEAUX JEAN CLAUDE","142700M","BILLARD CLUB DE VILLEFRANCHE"]
[327,"KLEIN","JEAN LUC","KLEIN JEAN LUC","142184Q","CLUB DE BILLARD MONTBRISONNAIS"]
[328,"KOBYLANSKI","ROMAIN","KOBYLANSKI ROMAIN","143742O","BILLARD CLUB GRENOBLOIS"]
[329,"KOCAURLU","YAVUZ","KOCAURLU YAVUZ","127300E","ACADEMIE DE BILLARD DE CHASSIEU"]
[330,"KOWACKI","JEAN PIERRE","KOWACKI JEAN PIERRE","146949C","BILLARD CLUB DE VILLEFRANCHE"]
[331,"KUHN","JAMES","KUHN JAMES","162698W","A.B. DE BOURGOIN-JALLIEU"]
[332,"KURADJIAN","ALAIN","KURADJIAN ALAIN","145123R","SAINT CHAMOND BILLARD CLUB"]
[333,"KURTZ","RENE","KURTZ RENE","145614O","BILLARD CLUB AIXOIS"]
[334,"LACHAUX","BERNARD","LACHAUX BERNARD","156918N","LE TAPIS VERT ROANNAIS"]
[335,"LACOMBE","JEAN MARIE","LACOMBE JEAN MARIE","011067R","BILLARD CLUB ST ELOY"]
[336,"LACROIX","DANIEL","LACROIX DANIEL","015732C","ACADEMIE BILLARD OUEST LYONNAIS"]
[337,"LAIYADI","NABIL","LAIYADI NABIL","112387P","BLACKBALL BILLARD CLUB BESAYES 26"]
[338,"LAMAT","OLIVIER","LAMAT OLIVIER","129029R","THE BLACK 8 POOL"]
[339,"LAMAT","PAUL","LAMAT PAUL","155788K","THE BLACK 8 POOL"]
[340,"LAMRANI","MEHDI","LAMRANI MEHDI","159769M","BILLARD CLUB PONTOIS"]
[341,"LANDAIS","JEAN CLAUDE","LANDAIS JEAN CLAUDE","157556G","BILLARD CLUB MOULINS"]
[342,"LARDEREAU","ROBERT","LARDEREAU ROBERT","145369D","CLUB DE BILLARD MONTBRISONNAIS"]
[343,"LARESE","PATRICK","LARESE PATRICK","147485K","ACADEMIE DE BILLARD DE CHASSIEU"]
[344,"LARIVE","JANY","LARIVE JANY","138403F","BILLARD CLUB BOURBON"]
[345,"LASSERON","CYRIL","LASSERON CYRIL","135589Z","CLERMONT AUVERGNE BILLARD CLUB"]
[346,"LATORRE","ANDRE","LATORRE ANDRE","101047L","LES SQUALES"]
[347,"LAURENT","JEAN LUC","LAURENT JEAN LUC","015957T","ACADEMIE DE BILLARD DE CHASSIEU"]
[348,"LAURETTA","JOSEPH","LAURETTA JOSEPH","015761F","BILLARD CLUB GRENOBLOIS"]
[349,"LAURIER","GILLES","LAURIER GILLES","141637P","ACADEMIE BILLARD OUEST LYONNAIS"]
[350,"LAVAUD","JEAN MICHEL","LAVAUD JEAN MICHEL","015733D","ACADEMIE BILLARD OUEST LYONNAIS"]
[351,"LE BRIS","STEPHAN","LE BRIS STEPHAN","136272G","BILLARD STELLA THONON"]
[352,"LEBRAY","ANNICK","LEBRAY ANNICK","137838M","CLUB CHAMBERIEN DE BILLARD"]
[353,"LECLERCQ","FREDERIC","LECLERCQ FREDERIC","016086S","BILLARD CLUB DE GAILLARD"]
[354,"LECONNETABLE","CLAUDE","LECONNETABLE CLAUDE","137588W","CLUB DE BILLARD MONTBRISONNAIS"]
[355,"LECROIX","FRANCIS","LECROIX FRANCIS","107510A","B.S.CLERMONTOIS"]
[356,"LEFEBVRE","SERGE","LEFEBVRE SERGE","010984M","BILLARD CLUB BOURBON"]
[357,"LELOUP","ALAIN","LELOUP ALAIN","137589X","CLUB DE BILLARD MONTBRISONNAIS"]
[358,"LEMAIRE","ALBERT","LEMAIRE ALBERT","013561P","BILLARD CLUB GRENOBLOIS"]
[359,"LEPAGE","PATRICK","LEPAGE PATRICK","145661J","CLERMONT AUVERGNE BILLARD CLUB"]
[360,"LEPETIT","FRANCOIS","LEPETIT FRANCOIS","145122Q","SAINT CHAMOND BILLARD CLUB"]
[361,"LHERMINIER","THIERRY","LHERMINIER THIERRY","126050C","BILLARD CLUB ALBERTVILLE"]
[362,"LHOMME","SYLVAIN","LHOMME SYLVAIN","160905X","ACADEMIE DE BILLARD D AUBENAS"]
[363,"LHUILLIER","DANIEL","LHUILLIER DANIEL","150870P","BILLARD CLUB PONTOIS"]
[364,"LIBON","VICTOR","LIBON VICTOR","112506E","AMICALE BILLARD CLUB DE DAVEZIEUX"]
[365,"LIOMIN","BENOIT","LIOMIN BENOIT","162914F","BILLARD CLUB DE GAILLARD"]
[366,"LIVEBARDON","SONIA","LIVEBARDON SONIA","112600U","ACAD. DE BILLARD DE SAINT-ETIENNE"]
[367,"LOBOS MALDONANO","OMAR","LOBOS MALDONANO OMAR","100932A","BILLARD CLUB PONTOIS"]
[368,"LOCCI","OLIVIER","LOCCI OLIVIER","150253T","BILLARD CLUB 109"]
[369,"LOMBREZ","FREDERIC","LOMBREZ FREDERIC","151332R","CHARLEMAGNE SNOOKER CLUB"]
[370,"LONGEREY","CHRISTELLE","LONGEREY CHRISTELLE","134285V","ACADEMIE ANNECIENNE DE BILLARD"]
[371,"LORON","LOUIS","LORON LOUIS","016050I","ACAD. DE BILLARD DE SAINT-ETIENNE"]
[372,"LORTHIOIS","JOHN","LORTHIOIS JOHN","124461Z","BILLARD CLUB ISSOIRE"]
[373,"LUJAN","PIERRE","LUJAN PIERRE","154202L","BILLARD CLUB ROMANAIS PEAGEOIS"]
[374,"MABON","CELINE","MABON CELINE","159910Q","CLUB OMNISPORTS DE SAINT FONS"]
[375,"MADEIRA","FERNANDO","MADEIRA FERNANDO","146266Q","ACADEMIE DE BILLARD DE LA VALSERINE"]
[376,"MAGNIN","JEAN PIERRE","MAGNIN JEAN PIERRE","016205H","BILLARD CLUB PONTOIS"]
[377,"MAILLARD","SERGE","MAILLARD SERGE","128074Y","BILLARD CLUB ST ELOY"]
[378,"MAILLARD","RENE","MAILLARD RENE","147149V","BILLARD CLUB DE VILLEFRANCHE"]
[379,"MAISONNEUVE","LAURENT","MAISONNEUVE LAURENT","124575J","BILLARD CLUB DE VILLEFRANCHE"]
[380,"MAISSE","ROBERT","MAISSE ROBERT","146950D","BILLARD CLUB DE VILLEFRANCHE"]
[381,"MAISSE","ROBERT","MAISSE ROBERT","147398Q","AMICALE BILLARD CLUB DE DAVEZIEUX"]
[382,"MALGOUYARD","JEAN PIERRE","MALGOUYARD JEAN PIERRE","147110C","BILLARD CLUB AIXOIS"]
[383,"MARCHICA","IGOR","MARCHICA IGOR","107687V","BILLARD CLUB 109"]
[384,"MARECHAL","JACQUES","MARECHAL JACQUES","137586U","CLUB DE BILLARD MONTBRISONNAIS"]
[385,"MARIN","GUY","MARIN GUY","144450U","BILLARD CLUB DE GAILLARD"]
[386,"MARION","GERARD",{"$f":"B387&\" \"&C387","v":"MARION GERARD"},"159842R","ACAD. DE BILLARD DE SAINT-ETIENNE"]
[387,"MARKADAS","TITUS","MARKADAS TITUS","109013V","CLUB CHAMBERIEN DE BILLARD"]
[388,"MARLET","PATRICK","MARLET PATRICK","146970A","ACADEMIE DE BILLARD DE LA VALSERINE"]
[389,"MARTELLONI","GUY","MARTELLONI GUY","111359B","ACADEMIE BILLARD OUEST LYONNAIS"]
[390,"MARTIN","OLIVIER","MARTIN OLIVIER","010985N","BILLARD CLUB ST ELOY"]
[391,"MARTIN","ALAIN","MARTIN ALAIN","155616Y","BILLARD CLUB BOURBON"]
[392,"MARTINEZ","SERGE","MARTINEZ SERGE","153695K","ACADEMIE DE BILLARD DE CHASSIEU"]
[393,"MASSELOT","CEDRIC","MASSELOT CEDRIC","162524G","BILLARD CLUB ISSOIRE"]
[394,"MASSON","JOEL","MASSON JOEL","016157L","BILLARD CLUB SAINT ROMANAIS"]
[395,"MASSON","ERIC","MASSON ERIC","120680O","BILLARD CLUB PONTOIS"]
[396,"MATRAS","JEAN MARIE","MATRAS JEAN MARIE","101044I","BILLARD CLUB ROMANAIS PEAGEOIS"]
[397,"MAUDUIT","DAVID","MAUDUIT DAVID","163116A","BILLARD CLUB ROMANAIS PEAGEOIS"]
[398,"MEJEAN","JACQUES","MEJEAN JACQUES","130074W","ACAD. DE BILLARD DE SAINT-ETIENNE"]
[399,"MENS","THOMAS","MENS THOMAS","121499B","CLERMONT AUVERGNE BILLARD CLUB"]
[400,"MERLE","MICHEL","MERLE MICHEL","016484A","BILLARD CLUB DE VILLEFRANCHE"]
[401,"MERMET","JACQUES","MERMET JACQUES","100893N","CLUB CHAMBERIEN DE BILLARD"]
[402,"MERMOZ","THIERRY","MERMOZ THIERRY","103610A","CLERMONT AUVERGNE BILLARD CLUB"]
[403,"MERMOZ","TONY","MERMOZ TONY","104740M","CLERMONT AUVERGNE BILLARD CLUB"]
[404,"MESNIER","JEAN CLAUDE","MESNIER JEAN CLAUDE","133199B","ACADEMIE DE BILLARD DE LA VALSERINE"]
[405,"MEUNIER","MARC","MEUNIER MARC","015816I","BILLARD CLUB DE VILLEFRANCHE"]
[406,"MICHEL","DENIS","MICHEL DENIS","153538P","CLUB CHAMBERIEN DE BILLARD"]
[407,"MIDROUILLET","PATRICK","MIDROUILLET PATRICK","010960O","BILLARD CLUB MONTLUCONNAIS"]
[408,"MIRONNEAU","ERIC","MIRONNEAU ERIC","153351L","BILLARD CLUB ST ELOY"]
[409,"MITEAU","MICHEL","MITEAU MICHEL","119308U","BILLARD CLUB MOULINS"]
[410,"MOINE","ROBERT","MOINE ROBERT","011049Z","B.S.CLERMONTOIS"]
[411,"MOLLE","ALBAN","MOLLE ALBAN","101029T","LES SQUALES"]
[412,"MONIER","BERNARD","MONIER BERNARD","124587V","LE TAPIS VERT ROANNAIS"]
[413,"MONNERET","MARC","MONNERET MARC","138180Q","BILLARD CLUB DE VILLEFRANCHE"]
[414,"MONTEL","MAURICE","MONTEL MAURICE","016109P","BILLARD CLUB SAINT ROMANAIS"]
[415,"MONTMAYEUR","FRANCOIS","MONTMAYEUR FRANCOIS","143894K","CHARLEMAGNE SNOOKER CLUB"]
[416,"MORET","GERARD","MORET GERARD","156145Y","BILLARD CLUB DE VILLEFRANCHE"]
[417,"MORIN","ANTHONY","MORIN ANTHONY","126041T","BILLARD CLUB 109"]
[418,"MORLIN","GUY","MORLIN GUY","135928A","CLUB DE BILLARD MONTBRISONNAIS"]
[419,"MOUGIN","NICOLAS","MOUGIN NICOLAS","137576K","BILLARD CLUB 109"]
[420,"MOULARD","ANDRE","MOULARD ANDRE","129872C","BILLARD CLUB DE LA PLAINE DU FOREZ"]
[421,"MOUNIER","ARMAND","MOUNIER ARMAND","016168W","CLUB DE BILLARD MONTBRISONNAIS"]
[422,"MOUTMIR","HAMZA","MOUTMIR HAMZA","144945V","CLERMONT AUVERGNE BILLARD CLUB"]
[423,"MULLER","SYLVAIN","MULLER SYLVAIN","122566C","CHARLEMAGNE SNOOKER CLUB"]
[424,"MUNOZ","ROMAIN","MUNOZ ROMAIN","139035N","CLUB CHAMBERIEN DE BILLARD"]
[425,"MUSSET","OLIVIER","MUSSET OLIVIER","103682U","BILLARD CLUB PONTOIS"]
[426,"MUZEAU","PATRICK","MUZEAU PATRICK","015851R","BILLARD CLUB ROMANAIS PEAGEOIS"]
[427,"NAKANO","LAURENT","NAKANO LAURENT","119332S","BILLARD CLUB LYONNAIS 8 POOL"]
[428,"NARJOUX","MICHEL","NARJOUX MICHEL","151982Y","ACADEMIE BILLARD OUEST LYONNAIS"]
[429,"NAVEL","ANGELIQUE","NAVEL ANGELIQUE","162464R","BILLARD CLUB PONTOIS"]
[430,"NIBAULT","CLAUDE","NIBAULT CLAUDE","146544I","BILLARD CLUB DE GAILLARD"]
[431,"NOEL","ROLAND","NOEL ROLAND","149690G","ACADEMIE DE BILLARD DE LA VALSERINE"]
[432,"NOUTS","CLAUDE","NOUTS CLAUDE","130071T","B.S.CLERMONTOIS"]
[433,"ODOUARD","DANIEL","ODOUARD DANIEL","117673X","BILLARD CLUB ROMANAIS PEAGEOIS"]
[434,"OGIER","STEPHANE","OGIER STEPHANE","147707B","CHARLEMAGNE SNOOKER CLUB"]
[435,"OLLIVIER","FRANCK","OLLIVIER FRANCK","143526G","LE TAPIS VERT ROANNAIS"]
[436,"ORENES LERMA","JACKY","ORENES LERMA JACKY","155904L","BILLARD CLUB PONTOIS"]
[437,"ORSAL","SERGE","ORSAL SERGE","154378C","ACADEMIE ANNECIENNE DE BILLARD"]
[438,"OTHMANI","SAIF EDDINE","OTHMANI SAIF EDDINE","138986Q","BILLARD CLUB LYONNAIS 8 POOL"]
[439,"OX","KOSTA","OX KOSTA","119127V","ACADEMIE DE BILLARD D AUBENAS"]
[440,"OYONARTE","GERARD","OYONARTE GERARD","162867E","BILLARD CLUB ROMANAIS PEAGEOIS"]
[441,"PACE","MICHEL","PACE MICHEL","011051B","B.S.CLERMONTOIS"]
[442,"PAGES","BERTRAND","PAGES BERTRAND","153140G","CHARLEMAGNE SNOOKER CLUB"]
[443,"PALADEL","NEIL","PALADEL NEIL","155510H","BILLARD STELLA THONON"]
[444,"PALETTE","FABRICE","PALETTE FABRICE","116718E","BILLARD CLUB 109"]
[445,"PANTEL","BERNARD","PANTEL BERNARD","101010A","A.B. DE BOURGOIN-JALLIEU"]
[446,"PAPET","PATRICK","PAPET PATRICK","163046Z","ACADEMIE DE BILLARD DE CHASSIEU"]
[447,"PAPILLON","FREDERIC","PAPILLON FREDERIC","107365L","VALENCE BILLARD CLUB"]
[448,"PAQUIEN","JEAN MICHEL","PAQUIEN JEAN MICHEL","015762G","CLUB CHAMBERIEN DE BILLARD"]
[449,"PARMENTIER","TEDDY","PARMENTIER TEDDY","152146B","BLACKBALL BILLARD CLUB BESAYES 26"]
[450,"PASTOR","BRUNO",{"$f":"B451&\" \"&C451","v":"PASTOR BRUNO"},"102280W","BILLARD CLUB DE GAILLARD"]
[451,"PATTY","ALAIN","PATTY ALAIN","116303F","ACADEMIE ANNECIENNE DE BILLARD"]
[452,"PAUVERT","JEAN LOUIS","PAUVERT JEAN LOUIS","150007B","BILLARD CLUB ROMANAIS PEAGEOIS"]
[453,"PEDROTTI","LIONEL","PEDROTTI LIONEL","162930Y","BILLARD CLUB ROMANAIS PEAGEOIS"]
[454,"PENDZIALEK","CHRISTIAN","PENDZIALEK CHRISTIAN","113890K","BILLARD STELLA THONON"]
[455,"PERBET","ELIOT","PERBET ELIOT","160163Q","BILLARD CLUB LYONNAIS 8 POOL"]
[456,"PERES","CLAUDE","PERES CLAUDE","015936Y","Licenciés indépendants 69"]
[457,"PEREZ","RAYMOND","PEREZ RAYMOND","124581P","CHARLEMAGNE SNOOKER CLUB"]
[458,"PERICAUD","ROLAND","PERICAUD ROLAND","157347E","VALENCE BILLARD CLUB"]
[459,"PERRET","RICHARD","PERRET RICHARD","145631F","CLUB DE BILLARD MONTBRISONNAIS"]
[460,"PERRET","OLIVIER","PERRET OLIVIER","145636K","CLUB DE BILLARD MONTBRISONNAIS"]
[461,"PERRET","LOUISE","PERRET LOUISE","162802J","CLUB DE BILLARD MONTBRISONNAIS"]
[462,"PERRIER","GERARD","PERRIER GERARD","152573Q","SAINT CHAMOND BILLARD CLUB"]
[463,"PERUS","ERIC ALAIN","PERUS ERIC ALAIN","163132S","LES SQUALES"]
[464,"PETIT","CHRISTOPHE","PETIT CHRISTOPHE","158165T","BILLARD STELLA THONON"]
[465,"PHILIBERT","GEORGES","PHILIBERT GEORGES","138176M","BILLARD CLUB DE SAINT-GALMIER"]
[466,"PICANDET","RENE","PICANDET RENE","010991T","BILLARD CLUB ST ELOY"]
[467,"PILLOT","VINCENT","PILLOT VINCENT","145348I","BILLARD CLUB PONTOIS"]
[468,"PINATEL","FRANCOIS","PINATEL FRANCOIS","163102K","CHARLEMAGNE SNOOKER CLUB"]
[469,"PINET","FRANCOIS","PINET FRANCOIS","112468S","BILLARD CLUB ROMANAIS PEAGEOIS"]
[470,"PLAT","PIERRICK","PLAT PIERRICK","159584L","CLUB DE BILLARD MONTBRISONNAIS"]
[471,"PLUVINAGE","JEAN CLAUDE","PLUVINAGE JEAN CLAUDE","015895J","BILLARD STELLA THONON"]
[472,"POCHON","JACQUES","POCHON JACQUES","145374I","BILLARD CLUB ROMANAIS PEAGEOIS"]
[473,"POCINHO","MARIO","POCINHO MARIO","106254S","BILLARD CLUB 109"]
[474,"POGGI","GERARD","POGGI GERARD","140818C","BILLARD CLUB ROMANAIS PEAGEOIS"]
[475,"POIROT","THOMAS","POIROT THOMAS","153780C","BILLARD CLUB ROMANAIS PEAGEOIS"]
[476,"POIX","JEAN LUDOVIC","POIX JEAN LUDOVIC","100936E","BILLARD CLUB PONTOIS"]
[477,"POMMIER","LUDOVIC","POMMIER LUDOVIC","154624V","ACADEMIE DE BILLARD DE CHASSIEU"]
[478,"PONCET","FRANCIS","PONCET FRANCIS","015119N","BILLARD CLUB PONTOIS"]
[479,"PONCET","ROBERT","PONCET ROBERT","162964K","SAINT CHAMOND BILLARD CLUB"]
[480,"PONTRUCHER","PIERRE RICHARD","PONTRUCHER PIERRE RICHARD","011061L","B.S.CLERMONTOIS"]
[481,"PORTES","BERNARD","PORTES BERNARD","146437F","CLUB DE BILLARD MONTBRISONNAIS"]
[482,"PORTUGUES","RICHARD","PORTUGUES RICHARD","132949L","ACADEMIE DE BILLARD DE CHASSIEU"]
[483,"POULY","ANTOINE","POULY ANTOINE","146252C","CLUB CHAMBERIEN DE BILLARD"]
[484,"POZZANI","CEDRIC","POZZANI CEDRIC","130058G","BILLARD CLUB AIXOIS"]
[485,"PRAL","LAURENT","PRAL LAURENT","101033X","BLACKBALL BILLARD CLUB BESAYES 26"]
[486,"PREVIATI","GUY","PREVIATI GUY","145115J","ACADEMIE DE BILLARD DE CHASSIEU"]
[487,"PREYNAT","MAURICE","PREYNAT MAURICE","016498O","ACAD. DE BILLARD DE SAINT-ETIENNE"]
[488,"PRUVOST","JEAN LOUIS","PRUVOST JEAN LOUIS","015944G","CLUB OMNISPORTS DE SAINT FONS"]
[489,"QUENOT","PATRICK","QUENOT PATRICK","154625W","ACADEMIE DE BILLARD DE CHASSIEU"]
[490,"RACHON","CHRISTIAN","RACHON CHRISTIAN","153571A","VALENCE BILLARD CLUB"]
[491,"RAMOND","VANESSA","RAMOND VANESSA","159822V","BIG BEN BLACKBALL"]
[492,"RASCLE","PIERRE","RASCLE PIERRE","130075X","ACAD. DE BILLARD DE SAINT-ETIENNE"]
[493,"RAYMOND","DENIS","RAYMOND DENIS","130103Z","BILLARD CLUB DE GAILLARD"]
[494,"REFASSI","ABDELGHANI","REFASSI ABDELGHANI","153783F","BILLARD CLUB ROMANAIS PEAGEOIS"]
[495,"REIS COELHO","FERNANDO","REIS COELHO FERNANDO","107514E","B.S.CLERMONTOIS"]
[496,"RENAUT","DIDIER","RENAUT DIDIER","132958U","CLUB OMNISPORTS DE SAINT FONS"]
[497,"RENNESSON","RICHARD","RENNESSON RICHARD","129062Y","BILLARD CLUB ROMANAIS PEAGEOIS"]
[498,"REVERCHON","BERNARD","REVERCHON BERNARD","158193Z","CLUB CHAMBERIEN DE BILLARD"]
[499,"RIBES","MAURICE","RIBES MAURICE","016475R","AMICALE BILLARD CLUB DE DAVEZIEUX"]
[500,"RICHET","MORGAN","RICHET MORGAN","159121H","BIG BEN BLACKBALL"]
[501,"RICHIER","ROGER","RICHIER ROGER","155134Z","SAINT CHAMOND BILLARD CLUB"]
[502,"RIGAL","YOHAN","RIGAL YOHAN","162959E","BILLARD CLUB ISSOIRE"]
[503,"RIGAUD","KEVIN","RIGAUD KEVIN","144942S","BILLARD CLUB ST ELOY"]
[504,"RIONDEL","RENE","RIONDEL RENE","015879T","BILLARD CLUB GRENOBLOIS"]
[505,"RIVOLIER","EMILE","RIVOLIER EMILE","156431J","LE TAPIS VERT ROANNAIS"]
[506,"ROBERT","HENRY","ROBERT HENRY","163038Q","B.S.CLERMONTOIS"]
[507,"ROCHE","GUY","ROCHE GUY","107357D","AMICALE BILLARD CLUB DE DAVEZIEUX"]
[508,"RODDIER","PATRICK","RODDIER PATRICK","121509L","B.S.CLERMONTOIS"]
[509,"RODRIGUEZ","STEPHANIE","RODRIGUEZ STEPHANIE","122802E","BILLARD CLUB 109"]
[510,"ROPARS","PATRICK","ROPARS PATRICK","127378E","A.B. DE BOURGOIN-JALLIEU"]
[511,"ROUSSEL","CHRISTOPHE","ROUSSEL CHRISTOPHE","142699L","BILLARD CLUB DE VILLEFRANCHE"]
[512,"ROUSSELOT","JEAN MARC","ROUSSELOT JEAN MARC","155685Y","ACADEMIE ANNECIENNE DE BILLARD"]
[513,"ROUX","JULIEN","ROUX JULIEN","100942K","BILLARD CLUB 109"]
[514,"RUFFET","FREDERIC",{"$f":"B515&\" \"&C515","v":"RUFFET FREDERIC"},"157789K","B.S.CLERMONTOIS"]
[515,"RUZ","SEBASTIEN","RUZ SEBASTIEN","114964S","Licenciés indépendants 69"]
[516,"SABOT","MICHAEL","SABOT MICHAEL","016301Z","CLUB DE BILLARD MONTBRISONNAIS"]
[517,"SABY","FREDERIC","SABY FREDERIC","119751V","BILLARD CLUB DE GAILLARD"]
[518,"SAGNES","JOSE","SAGNES JOSE","159349F","BIG BEN BLACKBALL"]
[519,"SARIAN","PIERRE","SARIAN PIERRE","143028C","ACADEMIE DE BILLARD D AUBENAS"]
[520,"SAULNIER","MATHIEU","SAULNIER MATHIEU","135591B","BIG BEN BLACKBALL"]
[521,"SAUZON","MARC","SAUZON MARC","153597D","BILLARD CLUB ROMANAIS PEAGEOIS"]
[522,"SAVOLDELLI","RENE","SAVOLDELLI RENE","015357R","BILLARD CLUB SAINT ROMANAIS"]
[523,"SAVONET","VALERIE","SAVONET VALERIE","127551V","LES SQUALES"]
[524,"SCHREIBER","ROBERT","SCHREIBER ROBERT","121543T","LE TAPIS VERT ROANNAIS"]
[525,"SEAN","YOU SENG","SEAN YOU SENG","110146K","BILLARD CLUB LYONNAIS 8 POOL"]
[526,"SIBELLIN","GERARD","SIBELLIN GERARD","156280V","ACADEMIE DE BILLARD DE CHASSIEU"]
[527,"SIERRA","JUAN","SIERRA JUAN","155850C","ACADEMIE DE BILLARD DE CHASSIEU"]
[528,"SIMON","ROBERT","SIMON ROBERT","101011B","A.B. DE BOURGOIN-JALLIEU"]
[529,"SINIGAGLIA","JEAN PAUL","SINIGAGLIA JEAN PAUL","147486L","ACADEMIE DE BILLARD DE CHASSIEU"]
[530,"SOEHNLEN","BRUNO","SOEHNLEN BRUNO","142707T","ACADEMIE ANNECIENNE DE BILLARD"]
[531,"SOMAVILLA","CLAUDE","SOMAVILLA CLAUDE","010980I","B.S.CLERMONTOIS"]
[532,"SOMVEILLE","DOMINIQUE","SOMVEILLE DOMINIQUE","162609Z","CLUB CHAMBERIEN DE BILLARD"]
[533,"SORU","IGNACIO","SORU IGNACIO","153543V","CLUB CHAMBERIEN DE BILLARD"]
[534,"SOURBE","HENRI","SOURBE HENRI","016058Q","BILLARD STELLA THONON"]
[535,"SPANGENBERG","ALAIN","SPANGENBERG ALAIN","153073J","BILLARD CLUB GRENOBLOIS"]
[536,"SUARD","FRANCOISE","SUARD FRANCOISE","158168X","BILLARD STELLA THONON"]
[537,"SUCHAUT","ANTOINE","SUCHAUT ANTOINE","136039H","CLUB DE BILLARD MONTBRISONNAIS"]
[538,"SUCHAUT","THIERRY","SUCHAUT THIERRY","138185V","SAINT CHAMOND BILLARD CLUB"]
[539,"SUDARA","BRUNO","SUDARA BRUNO","156581X","CLUB CHAMBERIEN DE BILLARD"]
[540,"SURY","GABRIEL","SURY GABRIEL","153122M","CLUB DE BILLARD MONTBRISONNAIS"]
[541,"TACHOIRE","ADRIEN","TACHOIRE ADRIEN","126321N","ACADEMIE ANNECIENNE DE BILLARD"]
[542,"TAILLARDAT","MICHEL","TAILLARDAT MICHEL","153322E","B.S.CLERMONTOIS"]
[543,"TALLON","JEAN CLAUDE","TALLON JEAN CLAUDE","157200V","BILLARD CLUB MONTLUCONNAIS"]
[544,"TARTARIN","MICHEL","TARTARIN MICHEL","152852T","BILLARD CLUB DE GAILLARD"]
[545,"TASCA","ANDRE","TASCA ANDRE","101079R","BILLARD CLUB 109"]
[546,"TASSET","JEROME","TASSET JEROME","156368Q","CLUB CHAMBERIEN DE BILLARD"]
[547,"TATIER","ERIC","TATIER ERIC","015854U","VALENCE BILLARD CLUB"]
[548,"TAVERNA","DANIEL","TAVERNA DANIEL","117797R","BILLARD CLUB GRENOBLOIS"]
[549,"TERNOY","PASCAL","TERNOY PASCAL","159649G","BILLARD CLUB GRENOBLOIS"]
[550,"TERRADE","MARC","TERRADE MARC","100899T","BILLARD CLUB DE LA PLAINE DU FOREZ"]
[551,"TESSIER","AURELIEN","TESSIER AURELIEN","140833R","BILLARD CLUB 109"]
[552,"THANH","TRAN","THANH TRAN","159858J","BILLARD CLUB ALBERTVILLE"]
[553,"THINON","JEROME","THINON JEROME","146111R","ACADEMIE DE BILLARD D AUBENAS"]
[554,"THIOT","PHILIPPE","THIOT PHILIPPE","157148N","BILLARD CLUB GRENOBLOIS"]
[555,"THIVOLLE","CECILE","THIVOLLE CECILE","162873L","BILLARD CLUB ROMANAIS PEAGEOIS"]
[556,"THIVOLLE","JEAN LOUIS","THIVOLLE JEAN LOUIS","162874M","BILLARD CLUB ROMANAIS PEAGEOIS"]
[557,"TOURAINE","PATRICE","TOURAINE PATRICE","162870H","BILLARD CLUB ROMANAIS PEAGEOIS"]
[558,"TRIPLET","FREDERIC","TRIPLET FREDERIC","162070N","CLUB CHAMBERIEN DE BILLARD"]
[559,"TROQUET","BERNARD","TROQUET BERNARD","137228A","CLUB CHAMBERIEN DE BILLARD"]
[560,"TROTEMANN","PIERRE","TROTEMANN PIERRE","158002R","VALENCE BILLARD CLUB"]
[561,"TSAN","SAP NHI","TSAN SAP NHI","101056U","BILLARD CLUB LYONNAIS 8 POOL"]
[562,"TURCAN","FREDERIC","TURCAN FREDERIC","107037V","BILLARD CLUB ROMANAIS PEAGEOIS"]
[563,"VACHER","JEAN CLAUDE","VACHER JEAN CLAUDE","160749C","BILLARD CLUB DE SAINT-GALMIER"]
[564,"VACHERAND","JEAN PIERRE","VACHERAND JEAN PIERRE","158166V","BILLARD STELLA THONON"]
[565,"VACOSSIN","NICOLAS","VACOSSIN NICOLAS","143251R","CLERMONT AUVERGNE BILLARD CLUB"]
[566,"VACUS","KEVIN","VACUS KEVIN","149397N","CLERMONT AUVERGNE BILLARD CLUB"]
[567,"VADILLO","LAURENT","VADILLO LAURENT","137569D","BLACKBALL BILLARD CLUB BESAYES 26"]
[568,"VADILLO","CHRISTELLE","VADILLO CHRISTELLE","137570E","BLACKBALL BILLARD CLUB BESAYES 26"]
[569,"VALENTIN","JEAN MARC","VALENTIN JEAN MARC","145516U","ACAD. DE BILLARD DE SAINT-ETIENNE"]
[570,"VALLAT","DANIEL","VALLAT DANIEL","016053L","ACAD. DE BILLARD DE SAINT-ETIENNE"]
[571,"VALLET","STEPHANE","VALLET STEPHANE","151475X","BILLARD CLUB PONTOIS"]
[572,"VALLIN","GERARD","VALLIN GERARD","149954T","AMICALE BILLARD CLUB DE DAVEZIEUX"]
[573,"VAN DER HEYDEN","JOHN","VAN DER HEYDEN JOHN","162871J","BILLARD CLUB ROMANAIS PEAGEOIS"]
[574,"VAUDAY","PATRICK","VAUDAY PATRICK","022457T","BILLARD CLUB PONTOIS"]
[575,"VENDITTELLI","FABIO","VENDITTELLI FABIO","100863J","ACADEMIE BILLARD OUEST LYONNAIS"]
[576,"VERDIER","NICOLAS","VERDIER NICOLAS","144938O","BILLARD CLUB ST ELOY"]
[577,"VERDY","MICHEL","VERDY MICHEL","129899D","B.S.CLERMONTOIS"]
[578,"VERNEDAL","LIONEL",{"$f":"B579&\" \"&C579","v":"VERNEDAL LIONEL"},"100019X","BILLARD CLUB DE SAINT-GALMIER"]
[579,"VERNET","DANIEL","VERNET DANIEL","015919H","VALENCE BILLARD CLUB"]
[580,"VERON","PATRICK","VERON PATRICK","151151V","BILLARD CLUB MOULINS"]
[581,"VERPILLIER","ROBERT","VERPILLIER ROBERT","139036O","CLUB CHAMBERIEN DE BILLARD"]
[582,"VIDAL","DANIEL","VIDAL DANIEL","133591D","ACADEMIE DE BILLARD DE CHASSIEU"]
[583,"VILLENEUVE","PATRICK","VILLENEUVE PATRICK","141470E","BILLARD STELLA THONON"]
[584,"VIMAL","ALAIN","VIMAL ALAIN","162918K","BILLARD CLUB DE VILLEFRANCHE"]
[585,"VINAY","MICHEL","VINAY MICHEL","112529B","BILLARD CLUB ROMANAIS PEAGEOIS"]
[586,"VINCENT","CHRISTIAN","VINCENT CHRISTIAN","134038I","BILLARD CLUB MOULINS"]
[587,"VINOT","FRANCOIS","VINOT FRANCOIS","151045E","BILLARD CLUB GRENOBLOIS"]
[588,"VIOSSAT","DAVID","VIOSSAT DAVID","101045J","BILLARD CLUB ROMANAIS PEAGEOIS"]
[589,"VIOT","MICHEL","VIOT MICHEL","119773R","BILLARD CLUB ROMANAIS PEAGEOIS"]
[590,"VIRGA","JOEL","VIRGA JOEL","123367X","CLERMONT AUVERGNE BILLARD CLUB"]
[591,"VIRICEL","BRUNO","VIRICEL BRUNO","150312H","BILLARD CLUB DE SAINT-GALMIER"]
[592,"VIRICEL","BERNARD","VIRICEL BERNARD","162965L","SAINT CHAMOND BILLARD CLUB"]
[593,"VIRTZ","MARC","VIRTZ MARC","159885N","CHARLEMAGNE SNOOKER CLUB"]
[594,"VRAUX","JACQUES","VRAUX JACQUES","133657R","BILLARD CLUB ROMANAIS PEAGEOIS"]
[595,"WEILL","GILBERT","WEILL GILBERT","126051D","BILLARD CLUB ALBERTVILLE"]
[596,"WILLIAMS","ARIANE","WILLIAMS ARIANE","155590V","BILLARD CLUB AIXOIS"]
[597,"WOIGNIER","ALBERT","WOIGNIER ALBERT","148310G","BILLARD CLUB ROMANAIS PEAGEOIS"]
[598,"ZAPOTOCKY","JEAN","ZAPOTOCKY JEAN","122472M","BILLARD CLUB DE SAINT-GALMIER"]

{"sheet":"Liste Joueurs","index":1,"n_rows":141,"n_cols":7,"rows_kept":141,"cut":false,"hidden":false,"merged":[]}
["A","Nom","Prénom",null,"Concatenation","Présent","Horaires "]
["F","TEBBANI AZIZ",null,1,{"$f":"B2&\" \"&C2","v":"TEBBANI AZIZ "},null,"13h00"]
[0,"DUDIT FABIEN",null,2,{"$f":"B3&\" \"&C3","v":"DUDIT FABIEN "},null,"13h00"]
[1,"SOPIC NICOLAS",null,3,"SOPIC NICOLAS ",null,"13h00"]
[2,"ROBEZ FLORENT",null,4,"ROBEZ FLORENT ",null,"13h00"]
[3,"BACCAM BOUNLIENG",null,5,"BACCAM BOUNLIENG ",null,"13h00"]
[null,"URAY JIMMY",null,6,"URAY JIMMY ",null,"13h00"]
["A","CHIEZE MIREILLE",null,7,"CHIEZE MIREILLE ",null,"13h00"]
["F","LACROIX DYLAN",null,8,"LACROIX DYLAN ",null,"13h00"]
[0,"NGUYEN MICHEL",null,9,{"$f":"B10&\" \"&C10","v":"NGUYEN MICHEL "},null,"10h30"]
[1,"POTIQUET SEBASTIEN",null,10,"POTIQUET SEBASTIEN ",null,"10h30"]
[2,"LETOURNEUR SEBASTIEN",null,11,"LETOURNEUR SEBASTIEN ",null,"10h30"]
[3,"PARDO RAMON",null,12,"PARDO RAMON ",null,"10h30"]
[null,"KLEIN STEPHANE",null,13,"KLEIN STEPHANE ",null,"10h30"]
["F","MOREL SYLVAIN",null,14,"MOREL SYLVAIN ",null,"10h30"]
["A","LE GOFF THIERRY",null,15,"LE GOFF THIERRY ",null,"10h30"]
[0,"GARNIER NICOLAS",null,16,"GARNIER NICOLAS ",null,"10h30"]
[1,"VAPILLON DANIEL",null,17,"VAPILLON DANIEL ",null,"9H00"]
[2,"REDON VALERIE",null,18,"REDON VALERIE ",null,"9H00"]
[3,"ROZIER MYRIAM",null,19,"ROZIER MYRIAM ",null,"9H00"]
[4,"DI BELLA STEPHANIE",null,20,"DI BELLA STEPHANIE ",null,"9H00"]
[null,"BACCAM HELENE",null,21,"BACCAM HELENE ",null,"9H00"]
["F","HISIGER CHARLOTTE",null,22,{"$f":"B23&\" \"&C23","v":"HISIGER CHARLOTTE "},null,"9H00"]
["A","HERRY MIREILLE",null,23,"HERRY MIREILLE ",null,"9H00"]
[0,"MIRTO EVELYNE",null,24,"MIRTO EVELYNE ",null,"9H00"]
[1,"BRUNET MAURICE",null,25,"BRUNET MAURICE ",null,"9H00"]
[2,"HISIGER KELLY",null,26,"HISIGER KELLY ",null,"9H00"]
[3,"MANDY NATHALIE",null,27,"MANDY NATHALIE ",null,"9H00"]
[4,"VALLOT ROMAIN",null,28,"VALLOT ROMAIN ",null,"9H00"]
[null,"BRENDEL CHRISTIAN",null,29,"BRENDEL CHRISTIAN ",null,"9H00"]
["F","VALLOT PATRICE",null,30,"VALLOT PATRICE ",null,"9H00"]
["A","LACROIX VALERIE",null,31,"LACROIX VALERIE ",null,"9H00"]
[0,"RIAD KAABECHE",null,32,"RIAD KAABECHE ",null,"9H00"]
[1,"CABANET FLORENCE",null,33,"CABANET FLORENCE ",null,"9H00"]
[2,"CHAIR MOURAD",null,34,"CHAIR MOURAD ",null,"9H00"]
[3,"THENET JESSIE",null,35,"THENET JESSIE ",null,"9H00"]
[4,null,null,36," ",null,"9H00"]
[null,null,null,37," ",null,"9H00"]
["F",null,null,38," ",null,"9H00"]
["A",null,null,39," ",null,"9H00"]
[0,null,null,40," ",null,"9H00"]
[1,null,null,41," ",null,"9H00"]
[2,null,null,42," ",null,"9H00"]
[3,null,null,43," ",null,"9H00"]
[4,null,null,44," ",null,"9H00"]
[5,null,null,45," ",null,"9H00"]
[null,null,null,46," ",null,"9H00"]
["F",null,null,47," ",null,"9H00"]
["A",null,null,48," ",null,"9H00"]
[0]
[1]
[2]
[3]
[4]
[]
[]
[1]
[2,null,null,null,{"$f":"B58&\" \"&C58","v":" "}]
[3]
[4]
[5]
[6]
[7]
[8]
[9]
[10,null,null,null,{"$f":"B66&\" \"&C66","v":" "}]
[11]
[12]
[13]
[14]
[15]
[16]
[17]
[18]
[19]
[20]
[21]
[22]
[23]
[24]
["A"]
["B"]
["C"]
["D"]
["E"]
["F"]
["G"]
["H"]
["I"]
["J"]
["K"]
["L"]
["M"]
["N"]
["O"]
["P"]
["Q"]
[]
[]
[]
[]
[]
[]
[]
[]
[]
[]
[]
[]
[]
[]
[]
[]
[]
[]
[]
[]
[]
[]
[]
[]
[]
[]
[]
[]
[]
[]
[]
[]
[]
[]
[]
[]
[]
[]
[]
[]
[]
[]
[]
["DAMIENFFB8POOL"]

{"sheet":"Calcul","index":2,"n_rows":50,"n_cols":5,"rows_kept":50,"cut":false,"hidden":true,"merged":[[17,2,17,3],[0,3,0,4]]}
["Classement","Tête de \nSérie","Horaires","Joueurs"]
[1,"TSA","13h00",null,{"$f":"'Liste Joueurs'!E2","v":"TEBBANI AZIZ "}]
[2,"TSA","13h00",null,{"$f":"'Liste Joueurs'!E3","v":"DUDIT FABIEN "}]
[3,"TSA","13h00",null,{"$f":"'Liste Joueurs'!E4","v":"SOPIC NICOLAS "}]
[4,"TSA","13h00",null,{"$f":"'Liste Joueurs'!E5","v":"ROBEZ FLORENT "}]
[5,"TSA","13h00",null,{"$f":"'Liste Joueurs'!E6","v":"BACCAM BOUNLIENG "}]
[6,"TSA","13h00",null,{"$f":"'Liste Joueurs'!E7","v":"URAY JIMMY "}]
[7,"TSA","13h00",null,{"$f":"'Liste Joueurs'!E8","v":"CHIEZE MIREILLE "}]
[8,"TSA","13h00",null,{"$f":"'Liste Joueurs'!E9","v":"LACROIX DYLAN "}]
[9,"TSB","10h30",null,{"$f":"'Liste Joueurs'!E10","v":"NGUYEN MICHEL "}]
[10,"TSB","10h30",null,{"$f":"'Liste Joueurs'!E11","v":"POTIQUET SEBASTIEN "}]
[11,"TSB","10h30",null,{"$f":"'Liste Joueurs'!E12","v":"LETOURNEUR SEBASTIEN "}]
[12,"TSB","10h30",null,{"$f":"'Liste Joueurs'!E13","v":"PARDO RAMON "}]
[13,"TSB","10h30",null,{"$f":"'Liste Joueurs'!E14","v":"KLEIN STEPHANE "}]
[14,"TSB","10h30",null,{"$f":"'Liste Joueurs'!E15","v":"MOREL SYLVAIN "}]
[15,"TSB","10h30",null,{"$f":"'Liste Joueurs'!E16","v":"LE GOFF THIERRY "}]
[16,"TSB","10h30",null,{"$f":"'Liste Joueurs'!E17","v":"GARNIER NICOLAS "}]
[null,"Classement\nHors TS","Poule",null,"Horaires 9H00"]
[17,{"$f":"SUM(A19-16)","v":1},"A",1,{"$f":"'Liste Joueurs'!E18","v":"VAPILLON DANIEL "}]
[18,{"$f":"SUM(A20-16)","v":2},"B",1,{"$f":"'Liste Joueurs'!E19","v":"REDON VALERIE "}]
[19,3,"C",1,{"$f":"'Liste Joueurs'!E20","v":"ROZIER MYRIAM "}]
[20,4,"D",1,{"$f":"'Liste Joueurs'!E21","v":"DI BELLA STEPHANIE "}]
[21,5,"D",2,{"$f":"'Liste Joueurs'!E22","v":"BACCAM HELENE "}]
[22,6,"C",2,{"$f":"'Liste Joueurs'!E23","v":"HISIGER CHARLOTTE "}]
[23,7,"B",2,{"$f":"'Liste Joueurs'!E24","v":"HERRY MIREILLE "}]
[24,8,"A",2,{"$f":"'Liste Joueurs'!E25","v":"MIRTO EVELYNE "}]
[25,9,"A",3,{"$f":"'Liste Joueurs'!E26","v":"BRUNET MAURICE "}]
[26,10,"B",3,{"$f":"'Liste Joueurs'!E27","v":"HISIGER KELLY "}]
[27,11,"C",3,{"$f":"'Liste Joueurs'!E28","v":"MANDY NATHALIE "}]
[28,12,"D",3,{"$f":"'Liste Joueurs'!E29","v":"VALLOT ROMAIN "}]
[29,13,"D",4,{"$f":"'Liste Joueurs'!E30","v":"BRENDEL CHRISTIAN "}]
[30,14,"C",4,{"$f":"'Liste Joueurs'!E31","v":"VALLOT PATRICE "}]
[31,15,"B",4,{"$f":"'Liste Joueurs'!E32","v":"LACROIX VALERIE "}]
[32,16,"A",4,{"$f":"'Liste Joueurs'!E33","v":"RIAD KAABECHE "}]
[33,17,"A",5,{"$f":"'Liste Joueurs'!E34","v":"CABANET FLORENCE "}]
[34,18,"B",5,{"$f":"'Liste Joueurs'!E35","v":"CHAIR MOURAD "}]
[35,19,"C",5,{"$f":"'Liste Joueurs'!E36","v":"THENET JESSIE "}]
[36,20,"D",5,{"$f":"'Liste Joueurs'!E37","v":" "}]
[37,21,"D",6,{"$f":"'Liste Joueurs'!E38","v":" "}]
[38,22,"C",6,{"$f":"'Liste Joueurs'!E39","v":" "}]
[39,23,"B",6,{"$f":"'Liste Joueurs'!E40","v":" "}]
[40,24,"A",6,{"$f":"'Liste Joueurs'!E41","v":" "}]
[41,25,"A",7,{"$f":"'Liste Joueurs'!E42","v":" "}]
[42,26,"B",7,{"$f":"'Liste Joueurs'!E43","v":" "}]
[43,27,"C",7,{"$f":"'Liste Joueurs'!E44","v":" "}]
[44,28,"D",7,{"$f":"'Liste Joueurs'!E45","v":" "}]
[45,29,"D",8,{"$f":"'Liste Joueurs'!E46","v":" "}]
[46,30,"C",8,{"$f":"'Liste Joueurs'!E47","v":" "}]
[47,31,"B",8,{"$f":"'Liste Joueurs'!E48","v":" "}]
[48,32,"A",8,{"$f":"'Liste Joueurs'!E49","v":" "}]

{"sheet":"Poules","index":3,"n_rows":28,"n_cols":7,"rows_kept":28,"cut":false,"hidden":false,"merged":[[0,1,0,4],[26,6,26,7],[27,6,27,7],[28,6,28,7],[24,6,24,7],[22,6,22,7],[23,6,23,7],[21,6,21,7],[20,1,20,7],[25,6,25,7],[11,3,11,4],[11,5,11,6]]}
[null,"Poule de 8 joueurs pour le 2 X KO"]
[null,"Poule A/1","Poule B/2","Poule C/3 ","Poule D/4"]
["Joueur 1",{"$f":"P_A1","v":"VAPILLON DANIEL "},{"$f":"P_B1","v":"REDON VALERIE "},{"$f":"P_C1","v":"ROZIER MYRIAM "},{"$f":"P_D1","v":"DI BELLA STEPHANIE "}]
["Joueur 2",{"$f":"P_A8","v":" "},{"$f":"P_B8","v":" "},{"$f":"P_C8","v":" "},{"$f":"P_D8","v":" "}]
["Joueur 3",{"$f":"P_A5","v":"CABANET FLORENCE "},{"$f":"P_B5","v":"CHAIR MOURAD "},{"$f":"P_C5","v":"THENET JESSIE "},{"$f":"P_D5","v":" "}]
["Joueur 4",{"$f":"P_A4","v":"RIAD KAABECHE "},{"$f":"P_B4","v":"LACROIX VALERIE "},{"$f":"P_C4","v":"VALLOT PATRICE "},{"$f":"P_D4","v":"BRENDEL CHRISTIAN "}]
["Joueur 5",{"$f":"P_A3","v":"BRUNET MAURICE "},{"$f":"P_B3","v":"HISIGER KELLY "},{"$f":"P_C3","v":"MANDY NATHALIE "},{"$f":"P_D3","v":"VALLOT ROMAIN "}]
["Joueur 6",{"$f":"P_A6","v":" "},{"$f":"P_B6","v":" "},{"$f":"P_C6","v":" "},{"$f":"P_D6","v":" "}]
["Joueur 7",{"$f":"P_A7","v":" "},{"$f":"P_B7","v":" "},{"$f":"P_C7","v":" "},{"$f":"P_D7","v":" "}]
["Joueur 8",{"$f":"P_A2","v":"MIRTO EVELYNE "},{"$f":"P_B2","v":"HERRY MIREILLE "},{"$f":"P_C2","v":"HISIGER CHARLOTTE "},{"$f":"P_D2","v":"BACCAM HELENE "}]
[]
["Ordre",null,null,"Casse Ferme",null,"Reprise Ferme"]
[1]
[8]
[5]
[4]
[3]
[6]
[7]
[2]
[null,"ABSENT LE 11/10/2015"]
[null,"Nom","Prénom",null,"Concatenation","Présent","Excuses"]
[null,null,null,null,null,null,"N/A"]
[null,null,null,null,null,null,"N/A"]
[null,null,null,null,null,null,"N/A"]
[null,null,null,null,null,null,"N/A"]
[null,null,null,null,null,null,"N/A"]
[null,null,null,null,null,null,"N/A"]

{"sheet":"1","index":4,"n_rows":21,"n_cols":59,"rows_kept":21,"cut":false,"hidden":false,"merged":[[11,43,11,46],[20,10,20,18],[0,10,0,18],[0,21,2,24],[9,17,10,17],[1,43,1,46],[10,21,10,22],[3,21,3,22],[12,21,12,22]]}
[null,null,null,null,null,null,null,null,null,null,"MATCHS EN 3 PARTIES GAGNANTES"]
[null,null,null,null,null,null,null,null,null,null,null,null,null,null,null,null,null,null,null,null,null,null,null,null,null,null,null,null,null,null,null,null,null,null,null,null,null,null,null,null,null,null,null,"QUALIFIES"]
[null,null,null,null,null,null,null,null,null,null,null,"P1",null,{"$f":"P_A1","v":"VAPILLON DANIEL "},0,null,null,"G1",null,null,null,null,null,null,null,null,null,null,null,"G","P","G","P","G","P","G","P","G","P","G","P","Ga",null,null,"NOM","Ga",null,null,null,null,null,null,1,{"$f":"V8","v":""},{"$f":"QP1_AG","v":""},"A","G11",{"$f":"IF(OR(F6=\"F\",F6=\"A\"),G6,IF(OR(F10=\"F\",F10=\"A\"),G10,IF(F6=F10,\"\",(IF(F6>F10,G10,G6)))))","v":""},{"$f":"IF(AND(F6=\"A\",F10=\"A\"),H10,IF(F6=\"A\",H6,IF(F10=\"A\",H10,IF(F6=F10,\"\",(IF(F6>H10,F6+H6-F10,F10+H10-F6))))))","v":""}]
[null,null,null,null,null,null,null,null,null,null,{"$f":"IF(OR(AND(P3=\"F\",P5=\"F\"),AND(P3=\"A\",P5=\"A\")),N5,IF(OR(P3=\"F\",P3=\"A\"),N3,IF(OR(P5=\"F\",P5=\"A\"),N5,IF(P3=P5,\"\",(IF(P3<P5,N3,N5))))))","v":""},{"$f":"IF(OR(AND(P3=\"F\",P5=\"F\"),AND(P3=\"A\",P5=\"A\")),O5,IF(OR(P3=\"F\",P3=\"A\"),O3,IF(OR(P5=\"F\",P5=\"A\"),O5,IF(P3=P5,\"\",(IF(P3<P5,P3-P5,P5-P3))))))","v":""},null,"Match 1 - Billard num  :",null,null,null,{"$f":"IF(OR(AND(P3=\"F\",P5=\"F\"),AND(P3=\"A\",P5=\"A\")),N3,IF(OR(P3=\"F\",P3=\"A\"),N5,IF(OR(P5=\"F\",P5=\"A\"),N3,IF(P3=P5,\"\",(IF(P3>P5,N3,N5))))))","v":""},{"$f":"IF(OR(AND(P3=\"F\",P5=\"F\"),AND(P3=\"A\",P5=\"A\")),O3,IF(OR(P3=\"F\",P3=\"A\"),O5,IF(OR(P5=\"F\",P5=\"A\"),O3,IF(P3=P5,\"\",(IF(P3>P5,P3-P5,P5-P3))))))","v":""},null,null,"Finale",null,null,null,null,1,{"$f":"IF(V6=\"\",\"\",IF(V6=R4,R4,R8))","v":""},{"$f":"N3","v":"VAPILLON DANIEL "},{"$f":"IF(AC4=N3,IF(P5=\"F\",\"\",P3),0)","v":0},{"$f":"IF(AC4=N3,IF(P3=\"F\",\"\",P5),0)","v":0},{"$f":"IF(AC4=R4,IF(T8=\"F\",\"\",T4),0)","v":0},{"$f":"IF(AC4=R4,IF(T4=\"F\",\"\",T8),0)","v":0},{"$f":"IF(AC4=K4,IF(J8=\"F\",\"\",J4),0)","v":0},{"$f":"IF(AC4=K4,IF(J4=\"F\",\"\",J8),0)","v":0},{"$f":"IF(AC4=G6,IF(F10=\"F\",\"\",F6),0)","v":0},{"$f":"IF(AC4=G6,IF(F6=\"F\",\"\",F10),0)","v":0},{"$f":"IF(AC4=G20,IF(F16=\"F\",\"\",F20),0)","v":0},{"$f":"IF(AC4=G20,IF(F20=\"F\",\"\",F16),0)","v":0},{"$f":"SUM(AD4,AF4,AH4,AJ4,AL4)","v":0},0,{"$f":"AN4-AO4","v":0},null,null,{"$f":"AB4","v":""},{"$f":"IF(AS4=\"\",\"\",(VLOOKUP(AS4,AC4:AP17,14,FALSE)))","v":""},null,null,null,null,null,null,2,{"$f":"V17","v":""},{"$f":"W17","v":""},"E","G13",{"$f":"IF(AND(F16=\"A\",F20=\"A\"),G20,IF(F16=\"A\",G16,IF(F20=\"A\",G20,IF(F16=F20,\"\",(IF(F16>F20,G20,G16))))))","v":""},{"$f":"IF(AND(F16=\"A\",F20=\"A\"),H20,IF(F16=\"A\",H16,IF(F20=\"A\",H20,IF(F16=F20,\"\",(IF(F16>H20,H20+F20-F16,H16+F16-F20))))))","v":""}]
[null,null,null,null,null,null,null,"G7",null,null,null,null,null,{"$f":"P_A8","v":" "},0,null,null,null,null,null,null,"G5",null,null,null,null,3,{"$f":"IF(B8=\"\",\"\",IF(B8=G6,G6,G10))","v":""},{"$f":"N5","v":" "},{"$f":"IF(AC5=N5,IF(P3=\"F\",\"\",P5),0)","v":0},{"$f":"IF(AC5=N5,IF(P5=\"F\",\"\",P3),0)","v":0},{"$f":"IF(AC5=R4,IF(T8=\"F\",\"\",T4),0)","v":0},{"$f":"IF(AC5=R4,IF(T4=\"F\",\"\",T8),0)","v":0},{"$f":"IF(AC5=K4,IF(J8=\"F\",\"\",J4),0)","v":0},{"$f":"IF(AC5=K4,IF(J4=\"F\",\"\",J8),0)","v":0},{"$f":"IF(AC5=G6,IF(F10=\"F\",\"\",F6),0)","v":0},{"$f":"IF(AC5=G6,IF(F6=\"F\",\"\",F10),0)","v":0},{"$f":"IF(AC5=G20,IF(F16=\"F\",\"\",F20),0)","v":0},{"$f":"IF(AC5=G20,IF(F20=\"F\",\"\",F16),0)","v":0},0,0,{"$f":"AN5-AO5","v":0},null,null,{"$f":"AB14","v":""},{"$f":"IF(AS5=\"\",\"\",(VLOOKUP(AS5,AC4:AP17,14,FALSE)))","v":""},null,null,null,null,null,null,3,{"$f":"IF((V15=V17),V19,V15)","v":""},{"$f":"IF(OR(X15=\"F\",X19=\"A\"),W15,IF(OR(X15=\"A\",X19=\"F\"),W19,IF(X15=X19,\"\",(IF(X15>X19,X15-X19+W15,X19-X15+W19)))))","v":""},null,"P13"]
[null,null,null,null,null,null,{"$f":"IF(OR(J4=\"F\",J4=\"A\"),K8,IF(OR(J8=\"F\",J8=\"A\"),K4,IF(J4=J8,\"\",(IF(J4>J8,K4,K8)))))","v":""},{"$f":"IF(OR(J4=\"F\",J4=\"A\"),L8,IF(OR(J8=\"F\",J8=\"A\"),L4,IF(J4=J8,\"\",(IF(J4>J8,J4-J8+L4,J8-J4+L8)))))","v":""},null,null,"Match 7 - Billard",null,null,null,null,null,null,"Match 5 - Billard num  :",null,null,null,{"$f":"IF(OR(T4=\"F\",T4=\"A\"),R8,IF(OR(T8=\"F\",T8=\"A\"),R4,IF(T4=T8,\"\",(IF(T4>T8,R4,R8)))))","v":""},{"$f":"IF(OR(T4=\"F\",T4=\"A\"),S8,IF(OR(T8=\"F\",T8=\"A\"),S4,IF(T4=T8,\"\",(IF(T4>T8,T4-T8+S4,T8-T4+S8)))))","v":""},null,null,null,5,{"$f":"IF(B8=\"\",\"\",IF(B8=G6,G10,G6))","v":""},{"$f":"N7","v":"CABANET FLORENCE "},{"$f":"IF(AC6=N7,IF(P9=\"F\",\"\",P7),0)","v":0},{"$f":"IF(AC6=N7,IF(P7=\"F\",\"\",P9),0)","v":0},{"$f":"IF(AC6=R8,IF(T4=\"F\",\"\",T8),0)","v":0},{"$f":"IF(AC6=R8,IF(T8=\"F\",\"\",T4),0)","v":0},{"$f":"IF(AC6=K8,IF(J4=\"F\",\"\",J8),0)","v":0},{"$f":"IF(AC6=K8,IF(J8=\"F\",\"\",J4),0)","v":0},{"$f":"IF(AC6=G6,IF(F10=\"F\",\"\",F6),0)","v":0},{"$f":"IF(AC6=G6,IF(F6=\"F\",\"\",F10),0)","v":0},{"$f":"IF(AC6=G20,IF(F16=\"F\",\"\",F20),0)","v":0},{"$f":"IF(AC6=G20,IF(F20=\"F\",\"\",F16),0)","v":0},0,0,{"$f":"AN6-AO6","v":0},null,null,{"$f":"AB5","v":""},{"$f":"IF(AS6=\"\",\"\",(VLOOKUP(AS6,AC4:AP17,14,FALSE)))","v":""},null,null,null,null,null,null,4,{"$f":"IF(AND(D8=\"A\",D18=\"A\"),B18,IF(D8=\"A\",B8,IF(D18=\"A\",D18,IF(D8=D18,\"\",(IF(D8>D18,B18,B8))))))","v":""},{"$f":"IF(AND(D8=\"A\",D18=\"A\"),C18,IF(D8=\"A\",C8,IF(D18=\"A\",C18,IF(D8=D18,\"\",(IF(D8>D18,C18+D18-D8,C8+D8-D18))))))","v":""},null,null,{"$f":"IF(OR(J4=\"F\",J4=\"A\"),K4,IF(OR(J8=\"F\",J8=\"A\"),K4,IF(J4=J8,\"\",(IF(J4>J8,K8,K4)))))","v":""},{"$f":"IF(AND(J4=\"A\",J8=\"A\"),J4,IF(J4=\"A\",J4,IF(J8=\"A\",L8,IF(J4=J8,\"\",(IF(J4>J8,L8+J8-J4,L4+J4-J8))))))","v":""}]
[null,null,"G9",null,null,null,null,null,null,null,null,null,null,{"$f":"P_A5","v":"CABANET FLORENCE "},0,null,null,null,null,null,null,"Match 11 - Billard num  :",null,null,null,null,7,{"$f":"IF(G6=\"\",\"\",IF(G6=K4,K8,K4))","v":""},{"$f":"N9","v":"RIAD KAABECHE "},{"$f":"IF(AC7=N9,IF(P7=\"F\",\"\",P9),0)","v":0},{"$f":"IF(AC7=N9,IF(P9=\"F\",\"\",P7),0)","v":0},{"$f":"IF(AC7=R8,IF(T4=\"F\",\"\",T8),0)","v":0},{"$f":"IF(AC7=R8,IF(T8=\"F\",\"\",T4),0)","v":0},{"$f":"IF(AC7=K8,IF(J4=\"F\",\"\",J8),0)","v":0},{"$f":"IF(AC7=K8,IF(J8=\"F\",\"\",J4),0)","v":0},{"$f":"IF(AC7=G6,IF(F10=\"F\",\"\",F6),0)","v":0},{"$f":"IF(AC7=G6,IF(F6=\"F\",\"\",F10),0)","v":0},{"$f":"IF(AC7=G20,IF(F16=\"F\",\"\",F20),0)","v":0},{"$f":"IF(AC7=G20,IF(F20=\"F\",\"\",F16),0)","v":0},0,0,{"$f":"AN7-AO7","v":0},null,null,{"$f":"AB15","v":""},{"$f":"IF(AS7=\"\",\"\",(VLOOKUP(AS7,AC4:AP17,14,FALSE)))","v":""},null,null,null,null,null,null,5,{"$f":"IF(BF3<>\"\",BF3,(BG3=BG4,BF3,(IF(BG3>BG4,BF3,BF4))))","v":{"$error":"#VALUE!"}},{"$f":"(IF(BF4<>\"\",IF(BG3<BG4,BG3,BG4)))","v":false},null,null,{"$f":"IF(OR(J14=\"F\",J14=\"A\"),K14,IF(OR(J18=\"F\",J18=\"A\"),K18,IF(J14=J18,\"\",(IF(J14>J18,K18,K14)))))","v":""},{"$f":"IF(AND(J14=\"A\",J18=\"A\"),L14,IF(J14=\"A\",L14,IF(J18=\"A\",L18,IF(J14=J18,\"\",(IF(J14>J18,L18+J18-J14,L14+J14-J18))))))","v":""}]
[null,{"$f":"IF(OR(F6=\"F\",F6=\"A\"),G10,IF(OR(F10=\"F\",F10=\"A\"),G6,IF(F6=F10,\"\",(IF(F6>F10,G6,G10)))))","v":""},{"$f":"IF(OR(F6=\"F\",F6=\"A\"),H10,IF(OR(F10=\"F\",F10=\"A\"),H6,IF(F6=F10,\"\",(IF(F6>F10,F6-F10+H6,F10-F6+H10)))))","v":""},null,null,null,"Match 9 - Billard num  :",null,null,null,{"$f":"IF(OR(AND(P7=\"F\",P9=\"F\"),AND(P7=\"A\",P9=\"A\")),N9,IF(OR(P7=\"F\",P7=\"A\"),N7,IF(OR(P9=\"F\",P9=\"A\"),N9,IF(P7=P9,\"\",(IF(P7<P9,N7,N9))))))","v":""},{"$f":"IF(OR(AND(P7=\"F\",P9=\"F\"),AND(P7=\"A\",P9=\"A\")),O9,IF(OR(P7=\"F\",P7=\"A\"),O7,IF(OR(P9=\"F\",P9=\"A\"),O9,IF(P7=P9,\"\",(IF(P7<P9,P7-P9,P9-P7))))))","v":""},null,"Match 2 - Billard num  :",null,null,null,{"$f":"IF(OR(AND(P7=\"F\",P9=\"F\"),AND(P7=\"A\",P9=\"A\")),N7,IF(OR(P7=\"F\",P7=\"A\"),N9,IF(OR(P9=\"F\",P9=\"A\"),N7,IF(P7=P9,\"\",(IF(P7>P9,N7,N9))))))","v":""},{"$f":"IF(OR(AND(P7=\"F\",P9=\"F\"),AND(P7=\"A\",P9=\"A\")),O7,IF(OR(P7=\"F\",P7=\"A\"),O9,IF(OR(P9=\"F\",P9=\"A\"),O7,IF(P7=P9,\"\",(IF(P7>P9,P7-P9,P9-P7))))))","v":""},null,null,{"$f":"IF(OR(AND(X6=\"F\",X10=\"F\"),AND(X6=\"A\",X10=\"A\")),V6,IF(OR(X6=\"F\",X10=\"A\"),V10,IF(OR(X10=\"F\",X10=\"A\"),V6,IF(X6=X10,\"\",(IF(X6>X10,V6,V10))))))","v":""},{"$f":"IF(OR(X6=\"F\",X10=\"A\"),W6,IF(OR(X6=\"A\",X10=\"F\"),W10,IF(X6=X10,\"\",(IF(X6>X10,X6-X10+W6,X10-X6+W10)))))","v":""},null,"A",null,null,null,null,null,null,null,null,null,null,null,null,null,null,null,null,null,null,null,null,null,null,null,null,null,null,null,6,{"$f":"IF(BF4<>\"\",BF4,(BG3=BG4,BF4,(IF(BG3>BG4,BF4,BF3))))","v":{"$error":"#VALUE!"}},{"$f":"IF(BG3>BG4,BG3,BG4)","v":""}]
[null,null,null,"  ",null,null,null,null,null,null,null,"P2",null,{"$f":"P_A4","v":"RIAD KAABECHE "},0,null,null,"G2",null,null,null,"G6",null,null,null,null,null,null,null,null,null,null,null,null,null,null,null,null,null,null,null,null,null,null,null,null,null,null,null,null,null,null,7,{"$f":"IF(BG6=\"A\",BF7,IF(BG6>BG7,BF6,BF7))","v":""},{"$f":"IF(BG6=\"A\",BG7,IF(BG6>BG7,BG6,BG7))","v":""}]
[null,null,null,null,null,null,{"$f":"IF(OR(T14=\"F\",T14=\"A\"),R14,IF(OR(T18=\"F\",T18=\"A\"),R18,IF(T14=T18,\"\",(IF(T14<T18,R14,R18)))))","v":""},{"$f":"IF(OR(T14=\"F\",T14=\"A\"),S14,IF(OR(T18=\"F\",T18=\"A\"),S18,IF(T14=T18,\"\",(IF(T14<T18,T14-T18+S14,T18-T14+S18)))))","v":""},null,null,null,null,null,null,null,null,null,null,null,null,null,{"$f":"IF(OR(T14=\"F\",T14=\"A\"),R18,IF(OR(T18=\"F\",T18=\"A\"),R14,IF(T14=T18,\"\",(IF(T14>T18,R14,R18)))))","v":""},{"$f":"IF(OR(T14=\"F\",T14=\"A\"),S18,IF(OR(T18=\"F\",T18=\"A\"),S14,IF(T14=T18,\"\",(IF(T14>T18,T14-T18+S14,T18-T14+S18)))))","v":""},null,null,null,null,null,null,null,null,null,null,null,null,null,null,null,null,null,null,null,null,null,null,null,null,null,null,null,null,null,8,{"$f":"IF(BG6=\"A\",BF6,IF(BG6>BG7,BF7,BF6))","v":""},{"$f":"IF(BG6=\"A\",BG6,IF(BG6>BG7,BG7,BG6))","v":""}]
[null,null,null,null,null,null,null,"P6"]
[null,{"$f":"IF(OR(D8=\"F\",D8=\"A\"),K18,IF(OR(D18=\"F\",D18=\"A\"),K8,IF(D8=D18,\"\",(IF(D8>D18,B8,B18)))))","v":""},{"$f":"IF(OR(D8=\"F\",D8=\"A\"),C18,IF(OR(D18=\"F\",D18=\"A\"),C8,IF(D8=D18,\"\",(IF(D8>D18,D8-D18+C8,D18-D8+C18)))))","v":""},null,null,null,null,null,null,null,null,null,null,null,null,null,null,null,null,null,null,null,null,null,null,null,null,null,null,null,null,null,null,null,null,null,null,null,null,null,null,null,null,"ELIMINES"]
[null,"Match 12 - Billard num  :",null,null,null,null,null,null,null,null,null,"P3",null,{"$f":"P_A3","v":"BRUNET MAURICE "},0,null,null,"G3",null,null,null,"Petite Finale",null,null,null,null,null,null,null,"G","P","G","P","G","P","G","P","G","P","G","P","Ga",null,null,"NOM","Ga"]
[null,null,null,null,null,null,null,null,null,null,{"$f":"IF(OR(AND(P13=\"F\",P15=\"F\"),AND(P13=\"A\",P15=\"A\")),N15,IF(OR(P13=\"F\",P13=\"A\"),N13,IF(OR(P15=\"F\",P15=\"A\"),N15,IF(P13=P15,\"\",(IF(P13<P15,N13,N15))))))","v":""},{"$f":"IF(OR(AND(P13=\"F\",P15=\"F\"),AND(P13=\"A\",P15=\"A\")),O15,IF(OR(P13=\"F\",P13=\"A\"),O13,IF(OR(P15=\"F\",P15=\"A\"),O15,IF(P13=P15,\"\",(IF(P13<P15,P13-P15,P15-P13))))))","v":""},null,"Match 3 - Billard num  :",null,null,null,{"$f":"IF(OR(AND(P13=\"F\",P15=\"F\"),AND(P13=\"A\",P15=\"A\")),N13,IF(OR(P13=\"F\",P13=\"A\"),N15,IF(OR(P15=\"F\",P15=\"A\"),N13,IF(P13=P15,\"\",(IF(P13>P15,N13,N15))))))","v":""},{"$f":"IF(OR(AND(P13=\"F\",P15=\"F\"),AND(P13=\"A\",P15=\"A\")),O13,IF(OR(P13=\"F\",P13=\"A\"),O15,IF(OR(P15=\"F\",P15=\"A\"),O13,IF(P13=P15,\"\",(IF(P13>P15,P13-P15,P15-P13))))))","v":""},null,null,"P11",null,null,null,null,2,{"$f":"IF(V10=\"\",\"\",IF(V10=R14,R14,R18))","v":""},{"$f":"N13","v":"BRUNET MAURICE "},{"$f":"IF(AC14=N13,IF(P15=\"F\",\"\",P13),0)","v":0},{"$f":"IF(AC14=N13,IF(P13=\"F\",\"\",P15),0)","v":0},{"$f":"IF(AC14=R14,IF(T18=\"F\",\"\",T14),0)","v":0},{"$f":"IF(AC14=R14,IF(T14=\"F\",\"\",T18),0)","v":0},{"$f":"IF(AC14=K14,IF(J18=\"F\",\"\",J14),0)","v":0},{"$f":"IF(AC14=K14,IF(J14=\"F\",\"\",J18),0)","v":0},{"$f":"IF(AC14=G16,IF(F20=\"F\",\"\",F16),0)","v":0},{"$f":"IF(AC14=G16,IF(F16=\"F\",\"\",F20),0)","v":0},{"$f":"IF(AC14=G10,IF(F6=\"F\",\"\",F10),0)","v":0},{"$f":"IF(AC14=G10,IF(F10=\"F\",\"\",F6),0)","v":0},{"$f":"SUM(AD14,AF14,AH14,AJ14,AL14)","v":0},0,{"$f":"AN14-AO14","v":0},null,null,{"$f":"AB6","v":""},{"$f":"IF(AS14=\"\",\"\",(VLOOKUP(AS14,AC4:AP17,14,FALSE)))","v":""}]
[null,null,null,null,null,null,null,"G8",null,null,null,null,null,{"$f":"P_A6","v":" "},0,null,null,null,null,null,null,{"$f":"IF(OR(AND(X6=\"F\",X10=\"F\"),AND(X6=\"A\",X10=\"A\")),V10,IF(OR(X6=\"F\",X6=\"A\"),V6,IF(OR(X10=\"F\",X10=\"A\"),V10,IF(X6=X10,\"\",(IF(X6<X10,V6,V10))))))","v":""},{"$f":"(IF(X6=X10,\"\",IF(X6>X10,X10-X6+X6,X6-X10+W6)))","v":""},null,null,null,4,{"$f":"IF(B18=\"\",\"\",IF(B18=G16,G16,G20))","v":""},{"$f":"N15","v":" "},{"$f":"IF(AC15=N15,IF(P13=\"F\",\"\",P15),0)","v":0},{"$f":"IF(AC15=N15,IF(P15=\"F\",\"\",P13),0)","v":0},{"$f":"IF(AC15=R14,IF(T18=\"F\",\"\",T14),0)","v":0},{"$f":"IF(AC15=R14,IF(T14=\"F\",\"\",T18),0)","v":0},{"$f":"IF(AC15=K14,IF(J18=\"F\",\"\",J14),0)","v":0},{"$f":"IF(AC15=K14,IF(J14=\"F\",\"\",J18),0)","v":0},{"$f":"IF(AC15=G16,IF(F20=\"F\",\"\",F16),0)","v":0},{"$f":"IF(AC15=G16,IF(F16=\"F\",\"\",F20),0)","v":0},{"$f":"IF(AC15=G10,IF(F6=\"F\",\"\",F10),0)","v":0},{"$f":"IF(AC15=G10,IF(F10=\"F\",\"\",F6),0)","v":0},0,0,{"$f":"AN15-AO15","v":0},null,null,{"$f":"AB16","v":""},{"$f":"IF(AS15=\"\",\"\",(VLOOKUP(AS15,AC4:AP17,14,FALSE)))","v":""}]
[null,null,null,null,null,null,{"$f":"IF(OR(J14=\"F\",J14=\"A\"),K18,IF(OR(J18=\"F\",J18=\"A\"),K14,IF(J14=J18,\"\",(IF(J14>J18,K14,K18)))))","v":""},{"$f":"IF(OR(J14=\"F\",J14=\"A\"),L18,IF(OR(J18=\"F\",J18=\"A\"),L14,IF(J14=J18,\"\",(IF(J14>J18,J14-J18+L14,J18-J14+L18)))))","v":""},null,null,"Match 8 - Billard num  :",null,null,null,null,null,null,"Match 6 - Billard num  :",null,null,null,"Match 13 - Billard num  :",null,null,null,null,6,{"$f":"IF(B18=\"\",\"\",IF(B18=G16,G20,G16))","v":""},{"$f":"N17","v":" "},{"$f":"IF(AC16=N17,IF(P19=\"F\",\"\",P17),0)","v":0},{"$f":"IF(AC16=N17,IF(P17=\"F\",\"\",P19),0)","v":0},{"$f":"IF(AC16=R18,IF(T14=\"F\",\"\",T18),0)","v":0},{"$f":"IF(AC16=R18,IF(T18=\"F\",\"\",T14),0)","v":0},{"$f":"IF(AC16=K18,IF(J14=\"F\",\"\",J18),0)","v":0},{"$f":"IF(AC16=K18,IF(J18=\"F\",\"\",J14),0)","v":0},{"$f":"IF(AC16=G16,IF(F20=\"F\",\"\",F16),0)","v":0},{"$f":"IF(AC16=G16,IF(F16=\"F\",\"\",F20),0)","v":0},{"$f":"IF(AC16=G10,IF(F6=\"F\",\"\",F10),0)","v":0},{"$f":"IF(AC16=G10,IF(F10=\"F\",\"\",F6),0)","v":0},0,0,{"$f":"AN16-AO16","v":0},null,null,{"$f":"AB7","v":""},{"$f":"IF(AS16=\"\",\"\",(VLOOKUP(AS16,AC4:AP17,14,FALSE)))","v":""}]
[null,null,"G10",null,null,null,null,null,null,null,null,null,null,{"$f":"P_A7","v":" "},0,null,null,null,null,null,null,{"$f":"IF(X15=X19,\"\",IF(X15>X19,V15,V19))","v":""},{"$f":"IF(OR(X15=\"F\",X19=\"A\"),W15,IF(OR(X15=\"A\",X19=\"F\"),W19,IF(X15=X19,\"\",(IF(X15>X19,X15-X19+W15,X19-X15+W19)))))","v":""},null,"E",null,8,{"$f":"IF(G16=\"\",\"\",IF(G16=K14,K18,K14))","v":""},{"$f":"N19","v":"MIRTO EVELYNE "},{"$f":"IF(AC17=N19,IF(P17=\"F\",\"\",P19),0)","v":0},{"$f":"IF(AC17=N19,IF(P19=\"F\",\"\",P17),0)","v":0},{"$f":"IF(AC17=R18,IF(T14=\"F\",\"\",T18),0)","v":0},{"$f":"IF(AC17=R18,IF(T18=\"F\",\"\",T14),0)","v":0},{"$f":"IF(AC17=K18,IF(J14=\"F\",\"\",J18),0)","v":0},{"$f":"IF(AC17=K18,IF(J18=\"F\",\"\",J14),0)","v":0},{"$f":"IF(AC17=G16,IF(F20=\"F\",\"\",F16),0)","v":0},{"$f":"IF(AC17=G16,IF(F16=\"F\",\"\",F20),0)","v":0},{"$f":"IF(AC17=G10,IF(F6=\"F\",\"\",F10),0)","v":0},{"$f":"IF(AC17=G10,IF(F10=\"F\",\"\",F6),0)","v":0},0,0,{"$f":"AN17-AO17","v":0},null,null,{"$f":"AB17","v":""},{"$f":"IF(AS17=\"\",\"\",(VLOOKUP(AS17,AC4:AP17,14,FALSE)))","v":""}]
[null,{"$f":"IF(OR(F16=\"F\",F16=\"A\"),G20,IF(OR(F20=\"F\",F20=\"A\"),G16,IF(F16=F20,\"\",(IF(F16>F20,G16,G20)))))","v":""},{"$f":"IF(OR(F16=\"F\",F16=\"A\"),H20,IF(OR(F20=\"F\",F20=\"A\"),H16,IF(F16=F20,\"\",(IF(F16>F20,F16-F20+H16,F20-F16+H20)))))","v":""},null,null,null,"Match 10 - Billard num  :",null,null,null,{"$f":"IF(OR(AND(P17=\"F\",P19=\"F\"),AND(P17=\"A\",P19=\"A\")),N19,IF(OR(P17=\"F\",P17=\"A\"),N17,IF(OR(P19=\"F\",P19=\"A\"),N19,IF(P17=P19,\"\",(IF(P17<P19,N17,N19))))))","v":""},{"$f":"IF(OR(AND(P17=\"F\",P19=\"F\"),AND(P17=\"A\",P19=\"A\")),O19,IF(OR(P17=\"F\",P17=\"A\"),O17,IF(OR(P19=\"F\",P19=\"A\"),O19,IF(P17=P19,\"\",(IF(P17<P19,P17-P19,P19-P17))))))","v":""},null,"Match 4 - Billard num  :",null,null,null,{"$f":"IF(OR(AND(P17=\"F\",P19=\"F\"),AND(P17=\"A\",P19=\"A\")),N17,IF(OR(P17=\"F\",P17=\"A\"),N19,IF(OR(P19=\"F\",P19=\"A\"),N17,IF(P17=P19,\"\",(IF(P17>P19,N17,N19))))))","v":""},{"$f":"IF(OR(AND(P17=\"F\",P19=\"F\"),AND(P17=\"A\",P19=\"A\")),O17,IF(OR(P17=\"F\",P17=\"A\"),O19,IF(OR(P19=\"F\",P19=\"A\"),O17,IF(P17=P19,\"\",(IF(P17>P19,P17-P19,P19-P17))))))","v":""},null,null,"G12"]
[null,null,null,null,null,null,null,null,null,null,null,"P4",null,{"$f":"P_A2","v":"MIRTO EVELYNE "},0,null,null,"G4",null,null,null,{"$f":"B12","v":""},{"$f":"C12","v":""}]
[null,null,null,null,null,null,{"$f":"IF(OR(T4=\"F\",T4=\"A\"),R4,IF(OR(T8=\"F\",T8=\"A\"),R8,IF(T4=T8,\"\",(IF(T4<T8,R4,R8)))))","v":""},{"$f":"IF(OR(T4=\"F\",T4=\"A\"),S4,IF(OR(T8=\"F\",T8=\"A\"),S8,IF(T4=T8,\"\",(IF(T4<T8,T4-T8+S4,T8-T4+S8)))))","v":""}]
[null,null,null,null,null,null,null,"P5"]

{"sheet":"2","index":5,"n_rows":24,"n_cols":59,"rows_kept":24,"cut":false,"hidden":false,"merged":[[11,43,11,46],[12,21,12,22],[20,10,20,18],[0,10,0,18],[0,21,2,24],[1,43,1,46],[3,21,3,22],[9,17,10,17],[10,21,10,22]]}
[null,null,null,null,null,null,null,null,null,null,"MATCHS EN 3 PARTIES GAGNANTES"]
[null,null,null,null,null,null,null,null,null,null,null,null,null,null,null,null,null,null,null,null,null,null,null,null,null,null,null,null,null,null,null,null,null,null,null,null,null,null,null,null,null,null,null,"QUALIFIES"]
[null,null,null,null,null,null,null,null,null,null,null,"P1",null,{"$f":"P_B1","v":"REDON VALERIE "},0,null,null,"G1",null,null,null,null,null,null,null,null,null,null,null,"G","P","G","P","G","P","G","P","G","P","G","P","Ga",null,null,"NOM","Ga",null,null,null,null,null,null,1,{"$f":"V8","v":""},{"$f":"W8","v":""},"B","G11",{"$f":"IF(OR(F6=\"F\",F6=\"A\"),G6,IF(OR(F10=\"F\",F10=\"A\"),G10,IF(F6=F10,\"\",(IF(F6>F10,G10,G6)))))","v":""},{"$f":"IF(AND(F6=\"A\",F10=\"A\"),H10,IF(F6=\"A\",H6,IF(F10=\"A\",H10,IF(F6=F10,\"\",(IF(F6>H10,F6+H6-F10,F10+H10-F6))))))","v":""}]
[null,null,null,null,null,null,null,null,null,null,{"$f":"IF(OR(AND(P3=\"F\",P5=\"F\"),AND(P3=\"A\",P5=\"A\")),N5,IF(OR(P3=\"F\",P3=\"A\"),N3,IF(OR(P5=\"F\",P5=\"A\"),N5,IF(P3=P5,\"\",(IF(P3<P5,N3,N5))))))","v":""},{"$f":"IF(OR(AND(P3=\"F\",P5=\"F\"),AND(P3=\"A\",P5=\"A\")),O5,IF(OR(P3=\"F\",P3=\"A\"),O3,IF(OR(P5=\"F\",P5=\"A\"),O5,IF(P3=P5,\"\",(IF(P3<P5,P3-P5,P5-P3))))))","v":""},null,"Match 1 - Billard num  :",null,null,null,{"$f":"IF(OR(AND(P3=\"F\",P5=\"F\"),AND(P3=\"A\",P5=\"A\")),N3,IF(OR(P3=\"F\",P3=\"A\"),N5,IF(OR(P5=\"F\",P5=\"A\"),N3,IF(P3=P5,\"\",(IF(P3>P5,N3,N5))))))","v":""},{"$f":"IF(OR(AND(P3=\"F\",P5=\"F\"),AND(P3=\"A\",P5=\"A\")),O3,IF(OR(P3=\"F\",P3=\"A\"),O5,IF(OR(P5=\"F\",P5=\"A\"),O3,IF(P3=P5,\"\",(IF(P3>P5,P3-P5,P5-P3))))))","v":""},null,null,"Finale",null,null,null,null,1,{"$f":"IF(V6=\"\",\"\",IF(V6=R4,R4,R8))","v":""},{"$f":"N3","v":"REDON VALERIE "},{"$f":"IF(AC4=N3,IF(P5=\"F\",\"\",P3),0)","v":0},{"$f":"IF(AC4=N3,IF(P3=\"F\",\"\",P5),0)","v":0},{"$f":"IF(AC4=R4,IF(T8=\"F\",\"\",T4),0)","v":0},{"$f":"IF(AC4=R4,IF(T4=\"F\",\"\",T8),0)","v":0},{"$f":"IF(AC4=K4,IF(J8=\"F\",\"\",J4),0)","v":0},{"$f":"IF(AC4=K4,IF(J4=\"F\",\"\",J8),0)","v":0},{"$f":"IF(AC4=G6,IF(F10=\"F\",\"\",F6),0)","v":0},{"$f":"IF(AC4=G6,IF(F6=\"F\",\"\",F10),0)","v":0},{"$f":"IF(AC4=G20,IF(F16=\"F\",\"\",F20),0)","v":0},{"$f":"IF(AC4=G20,IF(F20=\"F\",\"\",F16),0)","v":0},{"$f":"SUM(AD4,AF4,AH4,AJ4,AL4)","v":0},0,{"$f":"AN4-AO4","v":0},null,null,{"$f":"AB4","v":""},{"$f":"IF(AS4=\"\",\"\",(VLOOKUP(AS4,AC4:AP17,14,FALSE)))","v":""},null,null,null,null,null,null,2,{"$f":"V17","v":""},{"$f":"W17","v":""},"E","G13",{"$f":"IF(AND(F16=\"A\",F20=\"A\"),G20,IF(F16=\"A\",G16,IF(F20=\"A\",G20,IF(F16=F20,\"\",(IF(F16>F20,G20,G16))))))","v":""},{"$f":"IF(AND(F16=\"A\",F20=\"A\"),H20,IF(F16=\"A\",H16,IF(F20=\"A\",H20,IF(F16=F20,\"\",(IF(F16>H20,H20+F20-F16,H16+F16-F20))))))","v":""}]
[null,null,null,null,null,null,null,"G7",null,null,null,null,null,{"$f":"P_B8","v":" "},0,null,null,null,null,null,null,"G5",null,null,null,null,3,{"$f":"IF(B8=\"\",\"\",IF(B8=G6,G6,G10))","v":""},{"$f":"N5","v":" "},{"$f":"IF(AC5=N5,IF(P3=\"F\",\"\",P5),0)","v":0},{"$f":"IF(AC5=N5,IF(P5=\"F\",\"\",P3),0)","v":0},{"$f":"IF(AC5=R4,IF(T8=\"F\",\"\",T4),0)","v":0},{"$f":"IF(AC5=R4,IF(T4=\"F\",\"\",T8),0)","v":0},{"$f":"IF(AC5=K4,IF(J8=\"F\",\"\",J4),0)","v":0},{"$f":"IF(AC5=K4,IF(J4=\"F\",\"\",J8),0)","v":0},{"$f":"IF(AC5=G6,IF(F10=\"F\",\"\",F6),0)","v":0},{"$f":"IF(AC5=G6,IF(F6=\"F\",\"\",F10),0)","v":0},{"$f":"IF(AC5=G20,IF(F16=\"F\",\"\",F20),0)","v":0},{"$f":"IF(AC5=G20,IF(F20=\"F\",\"\",F16),0)","v":0},0,0,{"$f":"AN5-AO5","v":0},null,null,{"$f":"AB14","v":""},{"$f":"IF(AS5=\"\",\"\",(VLOOKUP(AS5,AC4:AP17,14,FALSE)))","v":""},null,null,null,null,null,null,3,{"$f":"IF((V15=V17),V19,V15)","v":""},{"$f":"IF(AND(X6=\"A\",X10=\"A\"),W10,IF(X6=\"A\",W6,IF(X10=\"A\",W10,IF(X6=X10,\"\",(IF(X6>X10,W10+X10-X6,W6+X6-X10))))))","v":""},null,"P13"]
[null,null,null,null,null,null,{"$f":"IF(OR(J4=\"F\",J4=\"A\"),K8,IF(OR(J8=\"F\",J8=\"A\"),K4,IF(J4=J8,\"\",(IF(J4>J8,K4,K8)))))","v":""},{"$f":"IF(OR(J4=\"F\",J4=\"A\"),L8,IF(OR(J8=\"F\",J8=\"A\"),L4,IF(J4=J8,\"\",(IF(J4>J8,J4-J8+L4,J8-J4+L8)))))","v":""},null,null,"Match 7 - Billard",null,null,null,null,null,null,"Match 5 - Billard num  :",null,null,null,{"$f":"IF(OR(T4=\"F\",T4=\"A\"),R8,IF(OR(T8=\"F\",T8=\"A\"),R4,IF(T4=T8,\"\",(IF(T4>T8,R4,R8)))))","v":""},{"$f":"IF(OR(T4=\"F\",T4=\"A\"),S8,IF(OR(T8=\"F\",T8=\"A\"),S4,IF(T4=T8,\"\",(IF(T4>T8,T4-T8+S4,T8-T4+S8)))))","v":""},null,null,null,5,{"$f":"IF(B8=\"\",\"\",IF(B8=G6,G10,G6))","v":""},{"$f":"N7","v":"CHAIR MOURAD "},{"$f":"IF(AC6=N7,IF(P9=\"F\",\"\",P7),0)","v":0},{"$f":"IF(AC6=N7,IF(P7=\"F\",\"\",P9),0)","v":0},{"$f":"IF(AC6=R8,IF(T4=\"F\",\"\",T8),0)","v":0},{"$f":"IF(AC6=R8,IF(T8=\"F\",\"\",T4),0)","v":0},{"$f":"IF(AC6=K8,IF(J4=\"F\",\"\",J8),0)","v":0},{"$f":"IF(AC6=K8,IF(J8=\"F\",\"\",J4),0)","v":0},{"$f":"IF(AC6=G6,IF(F10=\"F\",\"\",F6),0)","v":0},{"$f":"IF(AC6=G6,IF(F6=\"F\",\"\",F10),0)","v":0},{"$f":"IF(AC6=G20,IF(F16=\"F\",\"\",F20),0)","v":0},{"$f":"IF(AC6=G20,IF(F20=\"F\",\"\",F16),0)","v":0},0,0,{"$f":"AN6-AO6","v":0},null,null,{"$f":"AB5","v":""},{"$f":"IF(AS6=\"\",\"\",(VLOOKUP(AS6,AC4:AP17,14,FALSE)))","v":""},null,null,null,null,null,null,4,{"$f":"IF(AND(D8=\"A\",D18=\"A\"),B18,IF(D8=\"A\",B8,IF(D18=\"A\",D18,IF(D8=D18,\"\",(IF(D8>D18,B18,B8))))))","v":""},{"$f":"IF(AND(D8=\"A\",D18=\"A\"),C18,IF(D8=\"A\",C8,IF(D18=\"A\",C18,IF(D8=D18,\"\",(IF(D8>D18,C18+D18-D8,C8+D8-D18))))))","v":""},null,null,{"$f":"IF(OR(J4=\"F\",J4=\"A\"),K4,IF(OR(J8=\"F\",J8=\"A\"),K4,IF(J4=J8,\"\",(IF(J4>J8,K8,K4)))))","v":""},{"$f":"IF(AND(J4=\"A\",J8=\"A\"),J4,IF(J4=\"A\",J4,IF(J8=\"A\",L8,IF(J4=J8,\"\",(IF(J4>J8,L8+J8-J4,L4+J4-J8))))))","v":""}]
[null,null,"G9",null,null,null,null,null,null,null,null,null,null,{"$f":"P_B5","v":"CHAIR MOURAD "},0,null,null,null,null,null,null,"Match 11 - Billard num  :",null,null,null,null,7,{"$f":"IF(G6=\"\",\"\",IF(G6=K4,K8,K4))","v":""},{"$f":"N9","v":"LACROIX VALERIE "},{"$f":"IF(AC7=N9,IF(P7=\"F\",\"\",P9),0)","v":0},{"$f":"IF(AC7=N9,IF(P9=\"F\",\"\",P7),0)","v":0},{"$f":"IF(AC7=R8,IF(T4=\"F\",\"\",T8),0)","v":0},{"$f":"IF(AC7=R8,IF(T8=\"F\",\"\",T4),0)","v":0},{"$f":"IF(AC7=K8,IF(J4=\"F\",\"\",J8),0)","v":0},{"$f":"IF(AC7=K8,IF(J8=\"F\",\"\",J4),0)","v":0},{"$f":"IF(AC7=G6,IF(F10=\"F\",\"\",F6),0)","v":0},{"$f":"IF(AC7=G6,IF(F6=\"F\",\"\",F10),0)","v":0},{"$f":"IF(AC7=G20,IF(F16=\"F\",\"\",F20),0)","v":0},{"$f":"IF(AC7=G20,IF(F20=\"F\",\"\",F16),0)","v":0},0,0,{"$f":"AN7-AO7","v":0},null,null,{"$f":"AB15","v":""},{"$f":"IF(AS7=\"\",\"\",(VLOOKUP(AS7,AC4:AP17,14,FALSE)))","v":""},null,null,null,null,null,null,5,{"$f":"IF(BF3<>\"\",BF3,(BG3=BG4,BF3,(IF(BG3>BG4,BF3,BF4))))","v":{"$error":"#VALUE!"}},{"$f":"(IF(BF4<>\"\",IF(BG3<BG4,BG3,BG4)))","v":false},null,null,{"$f":"IF(OR(J14=\"F\",J14=\"A\"),K14,IF(OR(J18=\"F\",J18=\"A\"),K18,IF(J14=J18,\"\",(IF(J14>J18,K18,K14)))))","v":""},{"$f":"IF(AND(J14=\"A\",J18=\"A\"),L14,IF(J14=\"A\",L14,IF(J18=\"A\",L18,IF(J14=J18,\"\",(IF(J14>J18,L18+J18-J14,L14+J14-J18))))))","v":""}]
[null,{"$f":"IF(OR(F6=\"F\",F6=\"A\"),G10,IF(OR(F10=\"F\",F10=\"A\"),G6,IF(F6=F10,\"\",(IF(F6>F10,G6,G10)))))","v":""},{"$f":"IF(OR(F6=\"F\",F6=\"A\"),H10,IF(OR(F10=\"F\",F10=\"A\"),H6,IF(F6=F10,\"\",(IF(F6>F10,F6-F10+H6,F10-F6+H10)))))","v":""},null,null,null,"Match 9 - Billard num  :",null,null,null,{"$f":"IF(OR(AND(P7=\"F\",P9=\"F\"),AND(P7=\"A\",P9=\"A\")),N9,IF(OR(P7=\"F\",P7=\"A\"),N7,IF(OR(P9=\"F\",P9=\"A\"),N9,IF(P7=P9,\"\",(IF(P7<P9,N7,N9))))))","v":""},{"$f":"IF(OR(AND(P7=\"F\",P9=\"F\"),AND(P7=\"A\",P9=\"A\")),O9,IF(OR(P7=\"F\",P7=\"A\"),O7,IF(OR(P9=\"F\",P9=\"A\"),O9,IF(P7=P9,\"\",(IF(P7<P9,P7-P9,P9-P7))))))","v":""},null,"Match 2 - Billard num  :",null,null,null,{"$f":"IF(OR(AND(P7=\"F\",P9=\"F\"),AND(P7=\"A\",P9=\"A\")),N7,IF(OR(P7=\"F\",P7=\"A\"),N9,IF(OR(P9=\"F\",P9=\"A\"),N7,IF(P7=P9,\"\",(IF(P7>P9,N7,N9))))))","v":""},{"$f":"IF(OR(AND(P7=\"F\",P9=\"F\"),AND(P7=\"A\",P9=\"A\")),O7,IF(OR(P7=\"F\",P7=\"A\"),O9,IF(OR(P9=\"F\",P9=\"A\"),O7,IF(P7=P9,\"\",(IF(P7>P9,P7-P9,P9-P7))))))","v":""},null,null,{"$f":"IF(OR(AND(X6=\"F\",X10=\"F\"),AND(X6=\"A\",X10=\"A\")),V6,IF(OR(X6=\"F\",X10=\"A\"),V10,IF(OR(X10=\"F\",X10=\"A\"),V6,IF(X6=X10,\"\",(IF(X6>X10,V6,V10))))))","v":""},{"$f":"IF(OR(X6=\"F\",X10=\"A\"),W6,IF(OR(X6=\"A\",X10=\"F\"),W10,IF(X6=X10,\"\",(IF(X6>X10,X6-X10+W6,X10-X6+W10)))))","v":""},null,"B",null,null,null,null,null,null,null,null,null,null,null,null,null,null,null,null,null,null,null,null,null,null,null,null,null,null,null,6,{"$f":"IF(BF4<>\"\",BF4,(BG3=BG4,BF4,(IF(BG3>BG4,BF4,BF3))))","v":{"$error":"#VALUE!"}},{"$f":"IF(BG3>BG4,BG3,BG4)","v":""}]
[null,null,null,"  ",null,null,null,null,null,null,null,"P2",null,{"$f":"P_B4","v":"LACROIX VALERIE "},0,null,null,"G2",null,null,null,"G6",null,null,null,null,null,null,null,null,null,null,null,null,null,null,null,null,null,null,null,null,null,null,null,null,null,null,null,null,null,null,7,{"$f":"IF(BG6=\"A\",BF7,IF(BG6>BG7,BF6,BF7))","v":""},{"$f":"IF(BG6=\"A\",BG7,IF(BG6>BG7,BG6,BG7))","v":""}]
[null,null,null,null,null,null,{"$f":"IF(OR(T14=\"F\",T14=\"A\"),R14,IF(OR(T18=\"F\",T18=\"A\"),R18,IF(T14=T18,\"\",(IF(T14<T18,R14,R18)))))","v":""},{"$f":"IF(OR(T14=\"F\",T14=\"A\"),S14,IF(OR(T18=\"F\",T18=\"A\"),S18,IF(T14=T18,\"\",(IF(T14<T18,T14-T18+S14,T18-T14+S18)))))","v":""},null,null,null,null,null,null,null,null,null,null,null,null,null,{"$f":"IF(OR(T14=\"F\",T14=\"A\"),R18,IF(OR(T18=\"F\",T18=\"A\"),R14,IF(T14=T18,\"\",(IF(T14>T18,R14,R18)))))","v":""},{"$f":"IF(OR(T14=\"F\",T14=\"A\"),S18,IF(OR(T18=\"F\",T18=\"A\"),S14,IF(T14=T18,\"\",(IF(T14>T18,T14-T18+S14,T18-T14+S18)))))","v":""},null,null,null,null,null,null,null,null,null,null,null,null,null,null,null,null,null,null,null,null,null,null,null,null,null,null,null,null,null,8,{"$f":"IF(BG6=\"A\",BF6,IF(BG6>BG7,BF7,BF6))","v":""},{"$f":"IF(BG6=\"A\",BG6,IF(BG6>BG7,BG7,BG6))","v":""}]
[null,null,null,null,null,null,null,"P6"]
[null,{"$f":"IF(OR(D8=\"F\",D8=\"A\"),K18,IF(OR(D18=\"F\",D18=\"A\"),K8,IF(D8=D18,\"\",(IF(D8>D18,B8,B18)))))","v":""},{"$f":"IF(OR(D8=\"F\",D8=\"A\"),C18,IF(OR(D18=\"F\",D18=\"A\"),C8,IF(D8=D18,\"\",(IF(D8>D18,D8-D18+C8,D18-D8+C18)))))","v":""},null,null,null,null,null,null,null,null,null,null,null,null,null,null,null,null,null,null,null,null,null,null,null,null,null,null,null,null,null,null,null,null,null,null,null,null,null,null,null,null,"ELIMINES"]
[null,"Match 12 - Billard num  :",null,null,null,null,null,null,null,null,null,"P3",null,{"$f":"P_B3","v":"HISIGER KELLY "},0,null,null,"G3",null,null,null,"Petite Finale",null,null,null,null,null,null,null,"G","P","G","P","G","P","G","P","G","P","G","P","Ga",null,null,"NOM","Ga"]
[null,null,null,null,null,null,null,null,null,null,{"$f":"IF(OR(AND(P13=\"F\",P15=\"F\"),AND(P13=\"A\",P15=\"A\")),N15,IF(OR(P13=\"F\",P13=\"A\"),N13,IF(OR(P15=\"F\",P15=\"A\"),N15,IF(P13=P15,\"\",(IF(P13<P15,N13,N15))))))","v":""},{"$f":"IF(OR(AND(P13=\"F\",P15=\"F\"),AND(P13=\"A\",P15=\"A\")),O15,IF(OR(P13=\"F\",P13=\"A\"),O13,IF(OR(P15=\"F\",P15=\"A\"),O15,IF(P13=P15,\"\",(IF(P13<P15,P13-P15,P15-P13))))))","v":""},null,"Match 3 - Billard num  :",null,null,null,{"$f":"IF(OR(AND(P13=\"F\",P15=\"F\"),AND(P13=\"A\",P15=\"A\")),N13,IF(OR(P13=\"F\",P13=\"A\"),N15,IF(OR(P15=\"F\",P15=\"A\"),N13,IF(P13=P15,\"\",(IF(P13>P15,N13,N15))))))","v":""},{"$f":"IF(OR(AND(P13=\"F\",P15=\"F\"),AND(P13=\"A\",P15=\"A\")),O13,IF(OR(P13=\"F\",P13=\"A\"),O15,IF(OR(P15=\"F\",P15=\"A\"),O13,IF(P13=P15,\"\",(IF(P13>P15,P13-P15,P15-P13))))))","v":""},null,null,"P11",null,null,null,null,2,{"$f":"IF(V10=\"\",\"\",IF(V10=R14,R14,R18))","v":""},{"$f":"N13","v":"HISIGER KELLY "},{"$f":"IF(AC14=N13,IF(P15=\"F\",\"\",P13),0)","v":0},{"$f":"IF(AC14=N13,IF(P13=\"F\",\"\",P15),0)","v":0},{"$f":"IF(AC14=R14,IF(T18=\"F\",\"\",T14),0)","v":0},{"$f":"IF(AC14=R14,IF(T14=\"F\",\"\",T18),0)","v":0},{"$f":"IF(AC14=K14,IF(J18=\"F\",\"\",J14),0)","v":0},{"$f":"IF(AC14=K14,IF(J14=\"F\",\"\",J18),0)","v":0},{"$f":"IF(AC14=G16,IF(F20=\"F\",\"\",F16),0)","v":0},{"$f":"IF(AC14=G16,IF(F16=\"F\",\"\",F20),0)","v":0},{"$f":"IF(AC14=G10,IF(F6=\"F\",\"\",F10),0)","v":0},{"$f":"IF(AC14=G10,IF(F10=\"F\",\"\",F6),0)","v":0},{"$f":"SUM(AD14,AF14,AH14,AJ14,AL14)","v":0},0,{"$f":"AN14-AO14","v":0},null,null,{"$f":"AB6","v":""},{"$f":"IF(AS14=\"\",\"\",(VLOOKUP(AS14,AC4:AP17,14,FALSE)))","v":""}]
[null,null,null,null,null,null,null,"G8",null,null,null,null,null,{"$f":"P_B6","v":" "},0,null,null,null,null,null,null,{"$f":"IF(OR(AND(X6=\"F\",X10=\"F\"),AND(X6=\"A\",X10=\"A\")),V10,IF(OR(X6=\"F\",X6=\"A\"),V6,IF(OR(X10=\"F\",X10=\"A\"),V10,IF(X6=X10,\"\",(IF(X6<X10,V6,V10))))))","v":""},{"$f":"(IF(X6=X10,\"\",IF(X6>X10,X10-X6+X6,X6-X10+W6)))","v":""},null,null,null,4,{"$f":"IF(B18=\"\",\"\",IF(B18=G16,G16,G20))","v":""},{"$f":"N15","v":" "},{"$f":"IF(AC15=N15,IF(P13=\"F\",\"\",P15),0)","v":0},{"$f":"IF(AC15=N15,IF(P15=\"F\",\"\",P13),0)","v":0},{"$f":"IF(AC15=R14,IF(T18=\"F\",\"\",T14),0)","v":0},{"$f":"IF(AC15=R14,IF(T14=\"F\",\"\",T18),0)","v":0},{"$f":"IF(AC15=K14,IF(J18=\"F\",\"\",J14),0)","v":0},{"$f":"IF(AC15=K14,IF(J14=\"F\",\"\",J18),0)","v":0},{"$f":"IF(AC15=G16,IF(F20=\"F\",\"\",F16),0)","v":0},{"$f":"IF(AC15=G16,IF(F16=\"F\",\"\",F20),0)","v":0},{"$f":"IF(AC15=G10,IF(F6=\"F\",\"\",F10),0)","v":0},{"$f":"IF(AC15=G10,IF(F10=\"F\",\"\",F6),0)","v":0},0,0,{"$f":"AN15-AO15","v":0},null,null,{"$f":"AB16","v":""},{"$f":"IF(AS15=\"\",\"\",(VLOOKUP(AS15,AC4:AP17,14,FALSE)))","v":""}]
[null,null,null,null,null,null,{"$f":"IF(OR(J14=\"F\",J14=\"A\"),K18,IF(OR(J18=\"F\",J18=\"A\"),K14,IF(J14=J18,\"\",(IF(J14>J18,K14,K18)))))","v":""},{"$f":"IF(OR(J14=\"F\",J14=\"A\"),L18,IF(OR(J18=\"F\",J18=\"A\"),L14,IF(J14=J18,\"\",(IF(J14>J18,J14-J18+L14,J18-J14+L18)))))","v":""},null,null,"Match 8 - Billard num  :",null,null,null,null,null,null,"Match 6 - Billard num  :",null,null,null,"Match 13 - Billard num  :",null,null,null,null,6,{"$f":"IF(B18=\"\",\"\",IF(B18=G16,G20,G16))","v":""},{"$f":"N17","v":" "},{"$f":"IF(AC16=N17,IF(P19=\"F\",\"\",P17),0)","v":0},{"$f":"IF(AC16=N17,IF(P17=\"F\",\"\",P19),0)","v":0},{"$f":"IF(AC16=R18,IF(T14=\"F\",\"\",T18),0)","v":0},{"$f":"IF(AC16=R18,IF(T18=\"F\",\"\",T14),0)","v":0},{"$f":"IF(AC16=K18,IF(J14=\"F\",\"\",J18),0)","v":0},{"$f":"IF(AC16=K18,IF(J18=\"F\",\"\",J14),0)","v":0},{"$f":"IF(AC16=G16,IF(F20=\"F\",\"\",F16),0)","v":0},{"$f":"IF(AC16=G16,IF(F16=\"F\",\"\",F20),0)","v":0},{"$f":"IF(AC16=G10,IF(F6=\"F\",\"\",F10),0)","v":0},{"$f":"IF(AC16=G10,IF(F10=\"F\",\"\",F6),0)","v":0},0,0,{"$f":"AN16-AO16","v":0},null,null,{"$f":"AB7","v":""},{"$f":"IF(AS16=\"\",\"\",(VLOOKUP(AS16,AC4:AP17,14,FALSE)))","v":""}]
[null,null,"G10",null,null,null,null,null,null,null,null,null,null,{"$f":"P_B7","v":" "},0,null,null,null,null,null,null,{"$f":"IF(X15=X19,\"\",IF(X15>X19,V15,V19))","v":""},{"$f":"IF(OR(X15=\"F\",X19=\"A\"),W15,IF(OR(X15=\"A\",X19=\"F\"),W19,IF(X15=X19,\"\",(IF(X15>X19,X15-X19+W15,X19-X15+W19)))))","v":""},null,"F",null,8,{"$f":"IF(G16=\"\",\"\",IF(G16=K14,K18,K14))","v":""},{"$f":"N19","v":"HERRY MIREILLE "},{"$f":"IF(AC17=N19,IF(P17=\"F\",\"\",P19),0)","v":0},{"$f":"IF(AC17=N19,IF(P19=\"F\",\"\",P17),0)","v":0},{"$f":"IF(AC17=R18,IF(T14=\"F\",\"\",T18),0)","v":0},{"$f":"IF(AC17=R18,IF(T18=\"F\",\"\",T14),0)","v":0},{"$f":"IF(AC17=K18,IF(J14=\"F\",\"\",J18),0)","v":0},{"$f":"IF(AC17=K18,IF(J18=\"F\",\"\",J14),0)","v":0},{"$f":"IF(AC17=G16,IF(F20=\"F\",\"\",F16),0)","v":0},{"$f":"IF(AC17=G16,IF(F16=\"F\",\"\",F20),0)","v":0},{"$f":"IF(AC17=G10,IF(F6=\"F\",\"\",F10),0)","v":0},{"$f":"IF(AC17=G10,IF(F10=\"F\",\"\",F6),0)","v":0},0,0,{"$f":"AN17-AO17","v":0},null,null,{"$f":"AB17","v":""},{"$f":"IF(AS17=\"\",\"\",(VLOOKUP(AS17,AC4:AP17,14,FALSE)))","v":""}]
[null,{"$f":"IF(OR(F16=\"F\",F16=\"A\"),G20,IF(OR(F20=\"F\",F20=\"A\"),G16,IF(F16=F20,\"\",(IF(F16>F20,G16,G20)))))","v":""},{"$f":"IF(OR(F16=\"F\",F16=\"A\"),H20,IF(OR(F20=\"F\",F20=\"A\"),H16,IF(F16=F20,\"\",(IF(F16>F20,F16-F20+H16,F20-F16+H20)))))","v":""},null,null,null,"Match 10 - Billard num  :",null,null,null,{"$f":"IF(OR(AND(P17=\"F\",P19=\"F\"),AND(P17=\"A\",P19=\"A\")),N19,IF(OR(P17=\"F\",P17=\"A\"),N17,IF(OR(P19=\"F\",P19=\"A\"),N19,IF(P17=P19,\"\",(IF(P17<P19,N17,N19))))))","v":""},{"$f":"IF(OR(AND(P17=\"F\",P19=\"F\"),AND(P17=\"A\",P19=\"A\")),O19,IF(OR(P17=\"F\",P17=\"A\"),O17,IF(OR(P19=\"F\",P19=\"A\"),O19,IF(P17=P19,\"\",(IF(P17<P19,P17-P19,P19-P17))))))","v":""},null,"Match 4 - Billard num  :",null,null,null,{"$f":"IF(OR(AND(P17=\"F\",P19=\"F\"),AND(P17=\"A\",P19=\"A\")),N17,IF(OR(P17=\"F\",P17=\"A\"),N19,IF(OR(P19=\"F\",P19=\"A\"),N17,IF(P17=P19,\"\",(IF(P17>P19,N17,N19))))))","v":""},{"$f":"IF(OR(AND(P17=\"F\",P19=\"F\"),AND(P17=\"A\",P19=\"A\")),O17,IF(OR(P17=\"F\",P17=\"A\"),O19,IF(OR(P19=\"F\",P19=\"A\"),O17,IF(P17=P19,\"\",(IF(P17>P19,P17-P19,P19-P17))))))","v":""},null,null,"G12"]
[null,null,null,null,null,null,null,null,null,null,null,"P4",null,{"$f":"P_B2","v":"HERRY MIREILLE "},0,null,null,"G4",null,null,null,{"$f":"B12","v":""},{"$f":"C12","v":""}]
[null,null,null,null,null,null,{"$f":"IF(OR(T4=\"F\",T4=\"A\"),R4,IF(OR(T8=\"F\",T8=\"A\"),R8,IF(T4=T8,\"\",(IF(T4<T8,R4,R8)))))","v":""},{"$f":"IF(OR(T4=\"F\",T4=\"A\"),S4,IF(OR(T8=\"F\",T8=\"A\"),S8,IF(T4=T8,\"\",(IF(T4<T8,T4-T8+S4,T8-T4+S8)))))","v":""}]
[null,null,null,null,null,null,null,"P5"]
[]
[]
[null,null,null,null,null,null,null,null,null,null,{"$f":"P_B1","v":"REDON VALERIE "}]

{"sheet":"3","index":6,"n_rows":21,"n_cols":59,"rows_kept":21,"cut":false,"hidden":false,"merged":[[11,43,11,46],[12,21,12,22],[20,10,20,18],[0,10,0,18],[0,21,2,24],[1,43,1,46],[3,21,3,22],[9,17,10,17],[10,21,10,22]]}
[null,null,null,null,null,null,null,null,null,null,"MATCHS EN 3 PARTIES GAGNANTES"]
[null,null,null,null,null,null,null,null,null,null,null,null,null,null,null,null,null,null,null,null,null,null,null,null,null,null,null,null,null,null,null,null,null,null,null,null,null,null,null,null,null,null,null,"QUALIFIES"]
[null,null,null,null,null,null,null,null,null,null,null,"P1",null,{"$f":"P_C1","v":"ROZIER MYRIAM "},0,null,null,"G1",null,null,null,null,null,null,null,null,null,null,null,"G","P","G","P","G","P","G","P","G","P","G","P","Ga",null,null,"NOM","Ga",null,null,null,null,null,null,1,{"$f":"V8","v":""},{"$f":"W8","v":""},"C","G11",{"$f":"IF(OR(F6=\"F\",F6=\"A\"),G6,IF(OR(F10=\"F\",F10=\"A\"),G10,IF(F6=F10,\"\",(IF(F6>F10,G10,G6)))))","v":""},{"$f":"IF(AND(F6=\"A\",F10=\"A\"),H10,IF(F6=\"A\",H6,IF(F10=\"A\",H10,IF(F6=F10,\"\",(IF(F6>H10,F6+H6-F10,F10+H10-F6))))))","v":""}]
[null,null,null,null,null,null,null,null,null,null,{"$f":"IF(OR(AND(P3=\"F\",P5=\"F\"),AND(P3=\"A\",P5=\"A\")),N5,IF(OR(P3=\"F\",P3=\"A\"),N3,IF(OR(P5=\"F\",P5=\"A\"),N5,IF(P3=P5,\"\",(IF(P3<P5,N3,N5))))))","v":""},{"$f":"IF(OR(AND(P3=\"F\",P5=\"F\"),AND(P3=\"A\",P5=\"A\")),O5,IF(OR(P3=\"F\",P3=\"A\"),O3,IF(OR(P5=\"F\",P5=\"A\"),O5,IF(P3=P5,\"\",(IF(P3<P5,P3-P5,P5-P3))))))","v":""},null,"Match 1 - Billard num  :",null,null,null,{"$f":"IF(OR(AND(P3=\"F\",P5=\"F\"),AND(P3=\"A\",P5=\"A\")),N3,IF(OR(P3=\"F\",P3=\"A\"),N5,IF(OR(P5=\"F\",P5=\"A\"),N3,IF(P3=P5,\"\",(IF(P3>P5,N3,N5))))))","v":""},{"$f":"IF(OR(AND(P3=\"F\",P5=\"F\"),AND(P3=\"A\",P5=\"A\")),O3,IF(OR(P3=\"F\",P3=\"A\"),O5,IF(OR(P5=\"F\",P5=\"A\"),O3,IF(P3=P5,\"\",(IF(P3>P5,P3-P5,P5-P3))))))","v":""},null,null,"Finale",null,null,null,null,1,{"$f":"IF(V6=\"\",\"\",IF(V6=R4,R4,R8))","v":""},{"$f":"N3","v":"ROZIER MYRIAM "},{"$f":"IF(AC4=N3,IF(P5=\"F\",\"\",P3),0)","v":0},{"$f":"IF(AC4=N3,IF(P3=\"F\",\"\",P5),0)","v":0},{"$f":"IF(AC4=R4,IF(T8=\"F\",\"\",T4),0)","v":0},{"$f":"IF(AC4=R4,IF(T4=\"F\",\"\",T8),0)","v":0},{"$f":"IF(AC4=K4,IF(J8=\"F\",\"\",J4),0)","v":0},{"$f":"IF(AC4=K4,IF(J4=\"F\",\"\",J8),0)","v":0},{"$f":"IF(AC4=G6,IF(F10=\"F\",\"\",F6),0)","v":0},{"$f":"IF(AC4=G6,IF(F6=\"F\",\"\",F10),0)","v":0},{"$f":"IF(AC4=G20,IF(F16=\"F\",\"\",F20),0)","v":0},{"$f":"IF(AC4=G20,IF(F20=\"F\",\"\",F16),0)","v":0},{"$f":"SUM(AD4,AF4,AH4,AJ4,AL4)","v":0},0,{"$f":"AN4-AO4","v":0},null,null,{"$f":"AB4","v":""},{"$f":"IF(AS4=\"\",\"\",(VLOOKUP(AS4,AC4:AP17,14,FALSE)))","v":""},null,null,null,null,null,null,2,{"$f":"V17","v":""},{"$f":"W17","v":""},"G","G13",{"$f":"IF(AND(F16=\"A\",F20=\"A\"),G20,IF(F16=\"A\",G16,IF(F20=\"A\",G20,IF(F16=F20,\"\",(IF(F16>F20,G20,G16))))))","v":""},{"$f":"IF(AND(F16=\"A\",F20=\"A\"),H20,IF(F16=\"A\",H16,IF(F20=\"A\",H20,IF(F16=F20,\"\",(IF(F16>H20,H20+F20-F16,H16+F16-F20))))))","v":""}]
[null,null,null,null,null,null,null,"G7",null,null,null,null,null,{"$f":"P_C8","v":" "},0,null,null,null,null,null,null,"G5",null,null,null,null,3,{"$f":"IF(B8=\"\",\"\",IF(B8=G6,G6,G10))","v":""},{"$f":"N5","v":" "},{"$f":"IF(AC5=N5,IF(P3=\"F\",\"\",P5),0)","v":0},{"$f":"IF(AC5=N5,IF(P5=\"F\",\"\",P3),0)","v":0},{"$f":"IF(AC5=R4,IF(T8=\"F\",\"\",T4),0)","v":0},{"$f":"IF(AC5=R4,IF(T4=\"F\",\"\",T8),0)","v":0},{"$f":"IF(AC5=K4,IF(J8=\"F\",\"\",J4),0)","v":0},{"$f":"IF(AC5=K4,IF(J4=\"F\",\"\",J8),0)","v":0},{"$f":"IF(AC5=G6,IF(F10=\"F\",\"\",F6),0)","v":0},{"$f":"IF(AC5=G6,IF(F6=\"F\",\"\",F10),0)","v":0},{"$f":"IF(AC5=G20,IF(F16=\"F\",\"\",F20),0)","v":0},{"$f":"IF(AC5=G20,IF(F20=\"F\",\"\",F16),0)","v":0},0,0,{"$f":"AN5-AO5","v":0},null,null,{"$f":"AB14","v":""},{"$f":"IF(AS5=\"\",\"\",(VLOOKUP(AS5,AC4:AP17,14,FALSE)))","v":""},null,null,null,null,null,null,3,{"$f":"IF((V15=V17),V19,V15)","v":""},{"$f":"IF(AND(X6=\"A\",X10=\"A\"),W10,IF(X6=\"A\",W6,IF(X10=\"A\",W10,IF(X6=X10,\"\",(IF(X6>X10,W10+X10-X6,W6+X6-X10))))))","v":""},null,"P13"]
[null,null,null,null,null,null,{"$f":"IF(OR(J4=\"F\",J4=\"A\"),K8,IF(OR(J8=\"F\",J8=\"A\"),K4,IF(J4=J8,\"\",(IF(J4>J8,K4,K8)))))","v":""},{"$f":"IF(OR(J4=\"F\",J4=\"A\"),L8,IF(OR(J8=\"F\",J8=\"A\"),L4,IF(J4=J8,\"\",(IF(J4>J8,J4-J8+L4,J8-J4+L8)))))","v":""},null,null,"Match 7 - Billard",null,null,null,null,null,null,"Match 5 - Billard num  :",null,null,null,{"$f":"IF(OR(T4=\"F\",T4=\"A\"),R8,IF(OR(T8=\"F\",T8=\"A\"),R4,IF(T4=T8,\"\",(IF(T4>T8,R4,R8)))))","v":""},{"$f":"IF(OR(T4=\"F\",T4=\"A\"),S8,IF(OR(T8=\"F\",T8=\"A\"),S4,IF(T4=T8,\"\",(IF(T4>T8,T4-T8+S4,T8-T4+S8)))))","v":""},null,null,null,5,{"$f":"IF(B8=\"\",\"\",IF(B8=G6,G10,G6))","v":""},{"$f":"N7","v":"THENET JESSIE "},{"$f":"IF(AC6=N7,IF(P9=\"F\",\"\",P7),0)","v":0},{"$f":"IF(AC6=N7,IF(P7=\"F\",\"\",P9),0)","v":0},{"$f":"IF(AC6=R8,IF(T4=\"F\",\"\",T8),0)","v":0},{"$f":"IF(AC6=R8,IF(T8=\"F\",\"\",T4),0)","v":0},{"$f":"IF(AC6=K8,IF(J4=\"F\",\"\",J8),0)","v":0},{"$f":"IF(AC6=K8,IF(J8=\"F\",\"\",J4),0)","v":0},{"$f":"IF(AC6=G6,IF(F10=\"F\",\"\",F6),0)","v":0},{"$f":"IF(AC6=G6,IF(F6=\"F\",\"\",F10),0)","v":0},{"$f":"IF(AC6=G20,IF(F16=\"F\",\"\",F20),0)","v":0},{"$f":"IF(AC6=G20,IF(F20=\"F\",\"\",F16),0)","v":0},0,0,{"$f":"AN6-AO6","v":0},null,null,{"$f":"AB5","v":""},{"$f":"IF(AS6=\"\",\"\",(VLOOKUP(AS6,AC4:AP17,14,FALSE)))","v":""},null,null,null,null,null,null,4,{"$f":"IF(AND(D8=\"A\",D18=\"A\"),B18,IF(D8=\"A\",B8,IF(D18=\"A\",D18,IF(D8=D18,\"\",(IF(D8>D18,B18,B8))))))","v":""},{"$f":"IF(AND(D8=\"A\",D18=\"A\"),C18,IF(D8=\"A\",C8,IF(D18=\"A\",C18,IF(D8=D18,\"\",(IF(D8>D18,C18+D18-D8,C8+D8-D18))))))","v":""},null,null,{"$f":"IF(OR(J4=\"F\",J4=\"A\"),K4,IF(OR(J8=\"F\",J8=\"A\"),K4,IF(J4=J8,\"\",(IF(J4>J8,K8,K4)))))","v":""},{"$f":"IF(AND(J4=\"A\",J8=\"A\"),J4,IF(J4=\"A\",J4,IF(J8=\"A\",L8,IF(J4=J8,\"\",(IF(J4>J8,L8+J8-J4,L4+J4-J8))))))","v":""}]
[null,null,"G9",null,null,null,null,null,null,null,null,null,null,{"$f":"P_C5","v":"THENET JESSIE "},0,null,null,null,null,null,null,"Match 11 - Billard num  :",null,null,null,null,7,{"$f":"IF(G6=\"\",\"\",IF(G6=K4,K8,K4))","v":""},{"$f":"N9","v":"VALLOT PATRICE "},{"$f":"IF(AC7=N9,IF(P7=\"F\",\"\",P9),0)","v":0},{"$f":"IF(AC7=N9,IF(P9=\"F\",\"\",P7),0)","v":0},{"$f":"IF(AC7=R8,IF(T4=\"F\",\"\",T8),0)","v":0},{"$f":"IF(AC7=R8,IF(T8=\"F\",\"\",T4),0)","v":0},{"$f":"IF(AC7=K8,IF(J4=\"F\",\"\",J8),0)","v":0},{"$f":"IF(AC7=K8,IF(J8=\"F\",\"\",J4),0)","v":0},{"$f":"IF(AC7=G6,IF(F10=\"F\",\"\",F6),0)","v":0},{"$f":"IF(AC7=G6,IF(F6=\"F\",\"\",F10),0)","v":0},{"$f":"IF(AC7=G20,IF(F16=\"F\",\"\",F20),0)","v":0},{"$f":"IF(AC7=G20,IF(F20=\"F\",\"\",F16),0)","v":0},0,0,{"$f":"AN7-AO7","v":0},null,null,{"$f":"AB15","v":""},{"$f":"IF(AS7=\"\",\"\",(VLOOKUP(AS7,AC4:AP17,14,FALSE)))","v":""},null,null,null,null,null,null,5,{"$f":"IF(BF3<>\"\",BF3,(BG3=BG4,BF3,(IF(BG3>BG4,BF3,BF4))))","v":{"$error":"#VALUE!"}},{"$f":"(IF(BF4<>\"\",IF(BG3<BG4,BG3,BG4)))","v":false},null,null,{"$f":"IF(OR(J14=\"F\",J14=\"A\"),K14,IF(OR(J18=\"F\",J18=\"A\"),K18,IF(J14=J18,\"\",(IF(J14>J18,K18,K14)))))","v":""},{"$f":"IF(AND(J14=\"A\",J18=\"A\"),L14,IF(J14=\"A\",L14,IF(J18=\"A\",L18,IF(J14=J18,\"\",(IF(J14>J18,L18+J18-J14,L14+J14-J18))))))","v":""}]
[null,{"$f":"IF(OR(F6=\"F\",F6=\"A\"),G10,IF(OR(F10=\"F\",F10=\"A\"),G6,IF(F6=F10,\"\",(IF(F6>F10,G6,G10)))))","v":""},{"$f":"IF(OR(F6=\"F\",F6=\"A\"),H10,IF(OR(F10=\"F\",F10=\"A\"),H6,IF(F6=F10,\"\",(IF(F6>F10,F6-F10+H6,F10-F6+H10)))))","v":""},null,null,null,"Match 9 - Billard num  :",null,null,null,{"$f":"IF(OR(AND(P7=\"F\",P9=\"F\"),AND(P7=\"A\",P9=\"A\")),N9,IF(OR(P7=\"F\",P7=\"A\"),N7,IF(OR(P9=\"F\",P9=\"A\"),N9,IF(P7=P9,\"\",(IF(P7<P9,N7,N9))))))","v":""},{"$f":"IF(OR(AND(P7=\"F\",P9=\"F\"),AND(P7=\"A\",P9=\"A\")),O9,IF(OR(P7=\"F\",P7=\"A\"),O7,IF(OR(P9=\"F\",P9=\"A\"),O9,IF(P7=P9,\"\",(IF(P7<P9,P7-P9,P9-P7))))))","v":""},null,"Match 2 - Billard num  :",null,null,null,{"$f":"IF(OR(AND(P7=\"F\",P9=\"F\"),AND(P7=\"A\",P9=\"A\")),N7,IF(OR(P7=\"F\",P7=\"A\"),N9,IF(OR(P9=\"F\",P9=\"A\"),N7,IF(P7=P9,\"\",(IF(P7>P9,N7,N9))))))","v":""},{"$f":"IF(OR(AND(P7=\"F\",P9=\"F\"),AND(P7=\"A\",P9=\"A\")),O7,IF(OR(P7=\"F\",P7=\"A\"),O9,IF(OR(P9=\"F\",P9=\"A\"),O7,IF(P7=P9,\"\",(IF(P7>P9,P7-P9,P9-P7))))))","v":""},null,null,{"$f":"IF(OR(AND(X6=\"F\",X10=\"F\"),AND(X6=\"A\",X10=\"A\")),V6,IF(OR(X6=\"F\",X10=\"A\"),V10,IF(OR(X10=\"F\",X10=\"A\"),V6,IF(X6=X10,\"\",(IF(X6>X10,V6,V10))))))","v":""},{"$f":"IF(OR(X15=\"F\",X19=\"A\"),W15,IF(OR(X15=\"A\",X19=\"F\"),W19,IF(X19=X15,\"\",(IF(X15>X19,X15-W19+W17,X19-X15+W19)))))","v":""},null,"C",null,null,null,null,null,null,null,null,null,null,null,null,null,null,null,null,null,null,null,null,null,null,null,null,null,null,null,6,{"$f":"IF(BF4<>\"\",BF4,(BG3=BG4,BF4,(IF(BG3>BG4,BF4,BF3))))","v":{"$error":"#VALUE!"}},{"$f":"IF(BG3>BG4,BG3,BG4)","v":""}]
[null,null,null,"  ",null,null,null,null,null,null,null,"P2",null,{"$f":"P_C4","v":"VALLOT PATRICE "},0,null,null,"G2",null,null,null,"G6",null,null,null,null,null,null,null,null,null,null,null,null,null,null,null,null,null,null,null,null,null,null,null,null,null,null,null,null,null,null,7,{"$f":"IF(BG6=\"A\",BF7,IF(BG6>BG7,BF6,BF7))","v":""},{"$f":"IF(BG6=\"A\",BG7,IF(BG6>BG7,BG6,BG7))","v":""}]
[null,null,null,null,null,null,{"$f":"IF(OR(T14=\"F\",T14=\"A\"),R14,IF(OR(T18=\"F\",T18=\"A\"),R18,IF(T14=T18,\"\",(IF(T14<T18,R14,R18)))))","v":""},{"$f":"IF(OR(T14=\"F\",T14=\"A\"),S14,IF(OR(T18=\"F\",T18=\"A\"),S18,IF(T14=T18,\"\",(IF(T14<T18,T14-T18+S14,T18-T14+S18)))))","v":""},null,null,null,null,null,null,null,null,null,null,null,null,null,{"$f":"IF(OR(T14=\"F\",T14=\"A\"),R18,IF(OR(T18=\"F\",T18=\"A\"),R14,IF(T14=T18,\"\",(IF(T14>T18,R14,R18)))))","v":""},{"$f":"IF(OR(T14=\"F\",T14=\"A\"),S18,IF(OR(T18=\"F\",T18=\"A\"),S14,IF(T14=T18,\"\",(IF(T14>T18,T14-T18+S14,T18-T14+S18)))))","v":""},null,null,null,null,null,null,null,null,null,null,null,null,null,null,null,null,null,null,null,null,null,null,null,null,null,null,null,null,null,8,{"$f":"IF(BG6=\"A\",BF6,IF(BG6>BG7,BF7,BF6))","v":""},{"$f":"IF(BG6=\"A\",BG6,IF(BG6>BG7,BG7,BG6))","v":""}]
[null,null,null,null,null,null,null,"P6"]
[null,{"$f":"IF(OR(D8=\"F\",D8=\"A\"),K18,IF(OR(D18=\"F\",D18=\"A\"),K8,IF(D8=D18,\"\",(IF(D8>D18,B8,B18)))))","v":""},{"$f":"IF(OR(D8=\"F\",D8=\"A\"),C18,IF(OR(D18=\"F\",D18=\"A\"),C8,IF(D8=D18,\"\",(IF(D8>D18,D8-D18+C8,D18-D8+C18)))))","v":""},null,null,null,null,null,null,null,null,null,null,null,null,null,null,null,null,null,null,null,null,null,null,null,null,null,null,null,null,null,null,null,null,null,null,null,null,null,null,null,null,"ELIMINES"]
[null,"Match 12 - Billard num  :",null,null,null,null,null,null,null,null,null,"P3",null,{"$f":"P_C3","v":"MANDY NATHALIE "},0,null,null,"G3",null,null,null,"Petite Finale",null,null,null,null,null,null,null,"G","P","G","P","G","P","G","P","G","P","G","P","Ga",null,null,"NOM","Ga"]
[null,null,null,null,null,null,null,null,null,null,{"$f":"IF(OR(AND(P13=\"F\",P15=\"F\"),AND(P13=\"A\",P15=\"A\")),N15,IF(OR(P13=\"F\",P13=\"A\"),N13,IF(OR(P15=\"F\",P15=\"A\"),N15,IF(P13=P15,\"\",(IF(P13<P15,N13,N15))))))","v":""},{"$f":"IF(OR(AND(P13=\"F\",P15=\"F\"),AND(P13=\"A\",P15=\"A\")),O15,IF(OR(P13=\"F\",P13=\"A\"),O13,IF(OR(P15=\"F\",P15=\"A\"),O15,IF(P13=P15,\"\",(IF(P13<P15,P13-P15,P15-P13))))))","v":""},null,"Match 3 - Billard num  :",null,null,null,{"$f":"IF(OR(AND(P13=\"F\",P15=\"F\"),AND(P13=\"A\",P15=\"A\")),N13,IF(OR(P13=\"F\",P13=\"A\"),N15,IF(OR(P15=\"F\",P15=\"A\"),N13,IF(P13=P15,\"\",(IF(P13>P15,N13,N15))))))","v":""},{"$f":"IF(OR(AND(P13=\"F\",P15=\"F\"),AND(P13=\"A\",P15=\"A\")),O13,IF(OR(P13=\"F\",P13=\"A\"),O15,IF(OR(P15=\"F\",P15=\"A\"),O13,IF(P13=P15,\"\",(IF(P13>P15,P13-P15,P15-P13))))))","v":""},null,null,"P11",null,null,null,null,2,{"$f":"IF(V10=\"\",\"\",IF(V10=R14,R14,R18))","v":""},{"$f":"N13","v":"MANDY NATHALIE "},{"$f":"IF(AC14=N13,IF(P15=\"F\",\"\",P13),0)","v":0},{"$f":"IF(AC14=N13,IF(P13=\"F\",\"\",P15),0)","v":0},{"$f":"IF(AC14=R14,IF(T18=\"F\",\"\",T14),0)","v":0},{"$f":"IF(AC14=R14,IF(T14=\"F\",\"\",T18),0)","v":0},{"$f":"IF(AC14=K14,IF(J18=\"F\",\"\",J14),0)","v":0},{"$f":"IF(AC14=K14,IF(J14=\"F\",\"\",J18),0)","v":0},{"$f":"IF(AC14=G16,IF(F20=\"F\",\"\",F16),0)","v":0},{"$f":"IF(AC14=G16,IF(F16=\"F\",\"\",F20),0)","v":0},{"$f":"IF(AC14=G10,IF(F6=\"F\",\"\",F10),0)","v":0},{"$f":"IF(AC14=G10,IF(F10=\"F\",\"\",F6),0)","v":0},{"$f":"SUM(AD14,AF14,AH14,AJ14,AL14)","v":0},0,{"$f":"AN14-AO14","v":0},null,null,{"$f":"AB6","v":""},{"$f":"IF(AS14=\"\",\"\",(VLOOKUP(AS14,AC4:AP17,14,FALSE)))","v":""}]
[null,null,null,null,null,null,null,"G8",null,null,null,null,null,{"$f":"P_C6","v":" "},0,null,null,null,null,null,null,{"$f":"IF(OR(AND(X6=\"F\",X10=\"F\"),AND(X6=\"A\",X10=\"A\")),V10,IF(OR(X6=\"F\",X6=\"A\"),V6,IF(OR(X10=\"F\",X10=\"A\"),V10,IF(X6=X10,\"\",(IF(X6<X10,V6,V10))))))","v":""},{"$f":"(IF(X6=X10,\"\",IF(X6>X10,X10-X6+X6,X6-X10+W6)))","v":""},null,null,null,4,{"$f":"IF(B18=\"\",\"\",IF(B18=G16,G16,G20))","v":""},{"$f":"N15","v":" "},{"$f":"IF(AC15=N15,IF(P13=\"F\",\"\",P15),0)","v":0},{"$f":"IF(AC15=N15,IF(P15=\"F\",\"\",P13),0)","v":0},{"$f":"IF(AC15=R14,IF(T18=\"F\",\"\",T14),0)","v":0},{"$f":"IF(AC15=R14,IF(T14=\"F\",\"\",T18),0)","v":0},{"$f":"IF(AC15=K14,IF(J18=\"F\",\"\",J14),0)","v":0},{"$f":"IF(AC15=K14,IF(J14=\"F\",\"\",J18),0)","v":0},{"$f":"IF(AC15=G16,IF(F20=\"F\",\"\",F16),0)","v":0},{"$f":"IF(AC15=G16,IF(F16=\"F\",\"\",F20),0)","v":0},{"$f":"IF(AC15=G10,IF(F6=\"F\",\"\",F10),0)","v":0},{"$f":"IF(AC15=G10,IF(F10=\"F\",\"\",F6),0)","v":0},0,0,{"$f":"AN15-AO15","v":0},null,null,{"$f":"AB16","v":""},{"$f":"IF(AS15=\"\",\"\",(VLOOKUP(AS15,AC4:AP17,14,FALSE)))","v":""}]
[null,null,null,null,null,null,{"$f":"IF(OR(J14=\"F\",J14=\"A\"),K18,IF(OR(J18=\"F\",J18=\"A\"),K14,IF(J14=J18,\"\",(IF(J14>J18,K14,K18)))))","v":""},{"$f":"IF(OR(J14=\"F\",J14=\"A\"),L18,IF(OR(J18=\"F\",J18=\"A\"),L14,IF(J14=J18,\"\",(IF(J14>J18,J14-J18+L14,J18-J14+L18)))))","v":""},null,null,"Match 8 - Billard num  :",null,null,null,null,null,null,"Match 6 - Billard num  :",null,null,null,"Match 13 - Billard num  :",null,null,null,null,6,{"$f":"IF(B18=\"\",\"\",IF(B18=G16,G20,G16))","v":""},{"$f":"N17","v":" "},{"$f":"IF(AC16=N17,IF(P19=\"F\",\"\",P17),0)","v":0},{"$f":"IF(AC16=N17,IF(P17=\"F\",\"\",P19),0)","v":0},{"$f":"IF(AC16=R18,IF(T14=\"F\",\"\",T18),0)","v":0},{"$f":"IF(AC16=R18,IF(T18=\"F\",\"\",T14),0)","v":0},{"$f":"IF(AC16=K18,IF(J14=\"F\",\"\",J18),0)","v":0},{"$f":"IF(AC16=K18,IF(J18=\"F\",\"\",J14),0)","v":0},{"$f":"IF(AC16=G16,IF(F20=\"F\",\"\",F16),0)","v":0},{"$f":"IF(AC16=G16,IF(F16=\"F\",\"\",F20),0)","v":0},{"$f":"IF(AC16=G10,IF(F6=\"F\",\"\",F10),0)","v":0},{"$f":"IF(AC16=G10,IF(F10=\"F\",\"\",F6),0)","v":0},0,0,{"$f":"AN16-AO16","v":0},null,null,{"$f":"AB7","v":""},{"$f":"IF(AS16=\"\",\"\",(VLOOKUP(AS16,AC4:AP17,14,FALSE)))","v":""}]
[null,null,"G10",null,null,null,null,null,null,null,null,null,null,{"$f":"P_C7","v":" "},0,null,null,null,null,null,null,{"$f":"IF(X15=X19,\"\",IF(X15>X19,V15,V19))","v":""},{"$f":"IF(OR(X15=\"F\",X19=\"A\"),W15,IF(OR(X15=\"A\",X19=\"F\"),W19,IF(X15=X19,\"\",(IF(X15>X19,X15-X19+W15,X19-X15+W19)))))","v":""},null,"G",null,8,{"$f":"IF(G16=\"\",\"\",IF(G16=K14,K18,K14))","v":""},{"$f":"N19","v":"HISIGER CHARLOTTE "},{"$f":"IF(AC17=N19,IF(P17=\"F\",\"\",P19),0)","v":0},{"$f":"IF(AC17=N19,IF(P19=\"F\",\"\",P17),0)","v":0},{"$f":"IF(AC17=R18,IF(T14=\"F\",\"\",T18),0)","v":0},{"$f":"IF(AC17=R18,IF(T18=\"F\",\"\",T14),0)","v":0},{"$f":"IF(AC17=K18,IF(J14=\"F\",\"\",J18),0)","v":0},{"$f":"IF(AC17=K18,IF(J18=\"F\",\"\",J14),0)","v":0},{"$f":"IF(AC17=G16,IF(F20=\"F\",\"\",F16),0)","v":0},{"$f":"IF(AC17=G16,IF(F16=\"F\",\"\",F20),0)","v":0},{"$f":"IF(AC17=G10,IF(F6=\"F\",\"\",F10),0)","v":0},{"$f":"IF(AC17=G10,IF(F10=\"F\",\"\",F6),0)","v":0},0,0,{"$f":"AN17-AO17","v":0},null,null,{"$f":"AB17","v":""},{"$f":"IF(AS17=\"\",\"\",(VLOOKUP(AS17,AC4:AP17,14,FALSE)))","v":""}]
[null,{"$f":"IF(OR(F16=\"F\",F16=\"A\"),G20,IF(OR(F20=\"F\",F20=\"A\"),G16,IF(F16=F20,\"\",(IF(F16>F20,G16,G20)))))","v":""},{"$f":"IF(OR(F16=\"F\",F16=\"A\"),H20,IF(OR(F20=\"F\",F20=\"A\"),H16,IF(F16=F20,\"\",(IF(F16>F20,F16-F20+H16,F20-F16+H20)))))","v":""},null,null,null,"Match 10 - Billard num  :",null,null,null,{"$f":"IF(OR(AND(P17=\"F\",P19=\"F\"),AND(P17=\"A\",P19=\"A\")),N19,IF(OR(P17=\"F\",P17=\"A\"),N17,IF(OR(P19=\"F\",P19=\"A\"),N19,IF(P17=P19,\"\",(IF(P17<P19,N17,N19))))))","v":""},{"$f":"IF(OR(AND(P17=\"F\",P19=\"F\"),AND(P17=\"A\",P19=\"A\")),O19,IF(OR(P17=\"F\",P17=\"A\"),O17,IF(OR(P19=\"F\",P19=\"A\"),O19,IF(P17=P19,\"\",(IF(P17<P19,P17-P19,P19-P17))))))","v":""},null,"Match 4 - Billard num  :",null,null,null,{"$f":"IF(OR(AND(P17=\"F\",P19=\"F\"),AND(P17=\"A\",P19=\"A\")),N17,IF(OR(P17=\"F\",P17=\"A\"),N19,IF(OR(P19=\"F\",P19=\"A\"),N17,IF(P17=P19,\"\",(IF(P17>P19,N17,N19))))))","v":""},{"$f":"IF(OR(AND(P17=\"F\",P19=\"F\"),AND(P17=\"A\",P19=\"A\")),O17,IF(OR(P17=\"F\",P17=\"A\"),O19,IF(OR(P19=\"F\",P19=\"A\"),O17,IF(P17=P19,\"\",(IF(P17>P19,P17-P19,P19-P17))))))","v":""},null,null,"G12"]
[null,null,null,null,null,null,null,null,null,null,null,"P4",null,{"$f":"P_C2","v":"HISIGER CHARLOTTE "},0,null,null,"G4",null,null,null,{"$f":"B12","v":""},{"$f":"C12","v":""},"F"]
[null,null,null,null,null,null,{"$f":"IF(OR(T4=\"F\",T4=\"A\"),R4,IF(OR(T8=\"F\",T8=\"A\"),R8,IF(T4=T8,\"\",(IF(T4<T8,R4,R8)))))","v":""},{"$f":"IF(OR(T4=\"F\",T4=\"A\"),S4,IF(OR(T8=\"F\",T8=\"A\"),S8,IF(T4=T8,\"\",(IF(T4<T8,T4-T8+S4,T8-T4+S8)))))","v":""}]
[null,null,null,null,null,null,null,"P5"]

{"sheet":"4","index":7,"n_rows":21,"n_cols":59,"rows_kept":21,"cut":false,"hidden":false,"merged":[[11,43,11,46],[12,21,12,22],[20,10,20,18],[0,10,0,18],[0,21,2,24],[1,43,1,46],[3,21,3,22],[9,17,10,17],[10,21,10,22]]}
[null,null,null,null,null,null,null,null,null,null,"MATCHS EN 3 PARTIES GAGNANTES"]
[null,null,null,null,null,null,null,null,null,null,null,null,null,null,null,null,null,null,null,null,null,null,null,null,null,null,null,null,null,null,null,null,null,null,null,null,null,null,null,null,null,null,null,"QUALIFIES"]
[null,null,null,null,null,null,null,null,null,null,null,"P1",null,{"$f":"P_D1","v":"DI BELLA STEPHANIE "},0,null,null,"G1",null,null,null,null,null,null,null,null,null,null,null,"G","P","G","P","G","P","G","P","G","P","G","P","Ga",null,null,"NOM","Ga",null,null,null,null,null,null,1,{"$f":"V8","v":""},{"$f":"W8","v":""},"D","G11",{"$f":"IF(OR(F6=\"F\",F6=\"A\"),G6,IF(OR(F10=\"F\",F10=\"A\"),G10,IF(F6=F10,\"\",(IF(F6>F10,G10,G6)))))","v":""},{"$f":"IF(AND(F6=\"A\",F10=\"A\"),H10,IF(F6=\"A\",H6,IF(F10=\"A\",H10,IF(F6=F10,\"\",(IF(F6>H10,F6+H6-F10,F10+H10-F6))))))","v":""}]
[null,null,null,null,null,null,null,null,null,null,{"$f":"IF(OR(AND(P3=\"F\",P5=\"F\"),AND(P3=\"A\",P5=\"A\")),N5,IF(OR(P3=\"F\",P3=\"A\"),N3,IF(OR(P5=\"F\",P5=\"A\"),N5,IF(P3=P5,\"\",(IF(P3<P5,N3,N5))))))","v":""},{"$f":"IF(OR(AND(P3=\"F\",P5=\"F\"),AND(P3=\"A\",P5=\"A\")),O5,IF(OR(P3=\"F\",P3=\"A\"),O3,IF(OR(P5=\"F\",P5=\"A\"),O5,IF(P3=P5,\"\",(IF(P3<P5,P3-P5,P5-P3))))))","v":""},null,"Match 1 - Billard num  :",null,null,null,{"$f":"IF(OR(AND(P3=\"F\",P5=\"F\"),AND(P3=\"A\",P5=\"A\")),N3,IF(OR(P3=\"F\",P3=\"A\"),N5,IF(OR(P5=\"F\",P5=\"A\"),N3,IF(P3=P5,\"\",(IF(P3>P5,N3,N5))))))","v":""},{"$f":"IF(OR(AND(P3=\"F\",P5=\"F\"),AND(P3=\"A\",P5=\"A\")),O3,IF(OR(P3=\"F\",P3=\"A\"),O5,IF(OR(P5=\"F\",P5=\"A\"),O3,IF(P3=P5,\"\",(IF(P3>P5,P3-P5,P5-P3))))))","v":""},null,null,"Finale",null,null,null,null,1,{"$f":"IF(V6=\"\",\"\",IF(V6=R4,R4,R8))","v":""},{"$f":"N3","v":"DI BELLA STEPHANIE "},{"$f":"IF(AC4=N3,IF(P5=\"F\",\"\",P3),0)","v":0},{"$f":"IF(AC4=N3,IF(P3=\"F\",\"\",P5),0)","v":0},{"$f":"IF(AC4=R4,IF(T8=\"F\",\"\",T4),0)","v":0},{"$f":"IF(AC4=R4,IF(T4=\"F\",\"\",T8),0)","v":0},{"$f":"IF(AC4=K4,IF(J8=\"F\",\"\",J4),0)","v":0},{"$f":"IF(AC4=K4,IF(J4=\"F\",\"\",J8),0)","v":0},{"$f":"IF(AC4=G6,IF(F10=\"F\",\"\",F6),0)","v":0},{"$f":"IF(AC4=G6,IF(F6=\"F\",\"\",F10),0)","v":0},{"$f":"IF(AC4=G20,IF(F16=\"F\",\"\",F20),0)","v":0},{"$f":"IF(AC4=G20,IF(F20=\"F\",\"\",F16),0)","v":0},{"$f":"SUM(AD4,AF4,AH4,AJ4,AL4)","v":0},0,{"$f":"AN4-AO4","v":0},null,null,{"$f":"AB4","v":""},{"$f":"IF(AS4=\"\",\"\",(VLOOKUP(AS4,AC4:AP17,14,FALSE)))","v":""},null,null,null,null,null,null,2,{"$f":"V17","v":""},{"$f":"W17","v":""},"H","G13",{"$f":"IF(AND(F16=\"A\",F20=\"A\"),G20,IF(F16=\"A\",G16,IF(F20=\"A\",G20,IF(F16=F20,\"\",(IF(F16>F20,G20,G16))))))","v":""},{"$f":"IF(AND(F16=\"A\",F20=\"A\"),H20,IF(F16=\"A\",H16,IF(F20=\"A\",H20,IF(F16=F20,\"\",(IF(F16>H20,H20+F20-F16,H16+F16-F20))))))","v":""}]
[null,null,null,null,null,null,null,"G7",null,null,null,null,null,{"$f":"P_D8","v":" "},0,null,null,null,null,null,null,"G5",null,null,null,null,3,{"$f":"IF(B8=\"\",\"\",IF(B8=G6,G6,G10))","v":""},{"$f":"N5","v":" "},{"$f":"IF(AC5=N5,IF(P3=\"F\",\"\",P5),0)","v":0},{"$f":"IF(AC5=N5,IF(P5=\"F\",\"\",P3),0)","v":0},{"$f":"IF(AC5=R4,IF(T8=\"F\",\"\",T4),0)","v":0},{"$f":"IF(AC5=R4,IF(T4=\"F\",\"\",T8),0)","v":0},{"$f":"IF(AC5=K4,IF(J8=\"F\",\"\",J4),0)","v":0},{"$f":"IF(AC5=K4,IF(J4=\"F\",\"\",J8),0)","v":0},{"$f":"IF(AC5=G6,IF(F10=\"F\",\"\",F6),0)","v":0},{"$f":"IF(AC5=G6,IF(F6=\"F\",\"\",F10),0)","v":0},{"$f":"IF(AC5=G20,IF(F16=\"F\",\"\",F20),0)","v":0},{"$f":"IF(AC5=G20,IF(F20=\"F\",\"\",F16),0)","v":0},0,0,{"$f":"AN5-AO5","v":0},null,null,{"$f":"AB14","v":""},{"$f":"IF(AS5=\"\",\"\",(VLOOKUP(AS5,AC4:AP17,14,FALSE)))","v":""},null,null,null,null,null,null,3,{"$f":"IF((V15=V17),V19,V15)","v":""},{"$f":"IF(AND(X6=\"A\",X10=\"A\"),W10,IF(X6=\"A\",W6,IF(X10=\"A\",W10,IF(X6=X10,\"\",(IF(X6>X10,W10+X10-X6,W6+X6-X10))))))","v":""},null,"P13"]
[null,null,null,null,null,null,{"$f":"IF(OR(J4=\"F\",J4=\"A\"),K8,IF(OR(J8=\"F\",J8=\"A\"),K4,IF(J4=J8,\"\",(IF(J4>J8,K4,K8)))))","v":""},{"$f":"IF(OR(J4=\"F\",J4=\"A\"),L8,IF(OR(J8=\"F\",J8=\"A\"),L4,IF(J4=J8,\"\",(IF(J4>J8,J4-J8+L4,J8-J4+L8)))))","v":""},null,null,"Match 7 - Billard",null,null,null,null,null,null,"Match 5 - Billard num  :",null,null,null,{"$f":"IF(OR(T4=\"F\",T4=\"A\"),R8,IF(OR(T8=\"F\",T8=\"A\"),R4,IF(T4=T8,\"\",(IF(T4>T8,R4,R8)))))","v":""},{"$f":"IF(OR(T4=\"F\",T4=\"A\"),S8,IF(OR(T8=\"F\",T8=\"A\"),S4,IF(T4=T8,\"\",(IF(T4>T8,T4-T8+S4,T8-T4+S8)))))","v":""},null,null,null,5,{"$f":"IF(B8=\"\",\"\",IF(B8=G6,G10,G6))","v":""},{"$f":"N7","v":" "},{"$f":"IF(AC6=N7,IF(P9=\"F\",\"\",P7),0)","v":0},{"$f":"IF(AC6=N7,IF(P7=\"F\",\"\",P9),0)","v":0},{"$f":"IF(AC6=R8,IF(T4=\"F\",\"\",T8),0)","v":0},{"$f":"IF(AC6=R8,IF(T8=\"F\",\"\",T4),0)","v":0},{"$f":"IF(AC6=K8,IF(J4=\"F\",\"\",J8),0)","v":0},{"$f":"IF(AC6=K8,IF(J8=\"F\",\"\",J4),0)","v":0},{"$f":"IF(AC6=G6,IF(F10=\"F\",\"\",F6),0)","v":0},{"$f":"IF(AC6=G6,IF(F6=\"F\",\"\",F10),0)","v":0},{"$f":"IF(AC6=G20,IF(F16=\"F\",\"\",F20),0)","v":0},{"$f":"IF(AC6=G20,IF(F20=\"F\",\"\",F16),0)","v":0},0,0,{"$f":"AN6-AO6","v":0},null,null,{"$f":"AB5","v":""},{"$f":"IF(AS6=\"\",\"\",(VLOOKUP(AS6,AC4:AP17,14,FALSE)))","v":""},null,null,null,null,null,null,4,{"$f":"IF(AND(D8=\"A\",D18=\"A\"),B18,IF(D8=\"A\",B8,IF(D18=\"A\",D18,IF(D8=D18,\"\",(IF(D8>D18,B18,B8))))))","v":""},{"$f":"IF(AND(D8=\"A\",D18=\"A\"),C18,IF(D8=\"A\",C8,IF(D18=\"A\",C18,IF(D8=D18,\"\",(IF(D8>D18,C18+D18-D8,C8+D8-D18))))))","v":""},null,null,{"$f":"IF(OR(J4=\"F\",J4=\"A\"),K4,IF(OR(J8=\"F\",J8=\"A\"),K4,IF(J4=J8,\"\",(IF(J4>J8,K8,K4)))))","v":""},{"$f":"IF(AND(J4=\"A\",J8=\"A\"),J4,IF(J4=\"A\",J4,IF(J8=\"A\",L8,IF(J4=J8,\"\",(IF(J4>J8,L8+J8-J4,L4+J4-J8))))))","v":""}]
[null,null,"G9",null,null,null,null,null,null,null,null,null,null,{"$f":"P_D5","v":" "},0,null,null,null,null,null,null,"Match 11 - Billard num  :",null,null,null,null,7,{"$f":"IF(G6=\"\",\"\",IF(G6=K4,K8,K4))","v":""},{"$f":"N9","v":"BRENDEL CHRISTIAN "},{"$f":"IF(AC7=N9,IF(P7=\"F\",\"\",P9),0)","v":0},{"$f":"IF(AC7=N9,IF(P9=\"F\",\"\",P7),0)","v":0},{"$f":"IF(AC7=R8,IF(T4=\"F\",\"\",T8),0)","v":0},{"$f":"IF(AC7=R8,IF(T8=\"F\",\"\",T4),0)","v":0},{"$f":"IF(AC7=K8,IF(J4=\"F\",\"\",J8),0)","v":0},{"$f":"IF(AC7=K8,IF(J8=\"F\",\"\",J4),0)","v":0},{"$f":"IF(AC7=G6,IF(F10=\"F\",\"\",F6),0)","v":0},{"$f":"IF(AC7=G6,IF(F6=\"F\",\"\",F10),0)","v":0},{"$f":"IF(AC7=G20,IF(F16=\"F\",\"\",F20),0)","v":0},{"$f":"IF(AC7=G20,IF(F20=\"F\",\"\",F16),0)","v":0},0,0,{"$f":"AN7-AO7","v":0},null,null,{"$f":"AB15","v":""},{"$f":"IF(AS7=\"\",\"\",(VLOOKUP(AS7,AC4:AP17,14,FALSE)))","v":""},null,null,null,null,null,null,5,{"$f":"IF(BF3<>\"\",BF3,(BG3=BG4,BF3,(IF(BG3>BG4,BF3,BF4))))","v":{"$error":"#VALUE!"}},{"$f":"(IF(BF4<>\"\",IF(BG3<BG4,BG3,BG4)))","v":false},null,null,{"$f":"IF(OR(J14=\"F\",J14=\"A\"),K14,IF(OR(J18=\"F\",J18=\"A\"),K18,IF(J14=J18,\"\",(IF(J14>J18,K18,K14)))))","v":""},{"$f":"IF(AND(J14=\"A\",J18=\"A\"),L14,IF(J14=\"A\",L14,IF(J18=\"A\",L18,IF(J14=J18,\"\",(IF(J14>J18,L18+J18-J14,L14+J14-J18))))))","v":""}]
[null,{"$f":"IF(OR(F6=\"F\",F6=\"A\"),G10,IF(OR(F10=\"F\",F10=\"A\"),G6,IF(F6=F10,\"\",(IF(F6>F10,G6,G10)))))","v":""},{"$f":"IF(OR(F6=\"F\",F6=\"A\"),H10,IF(OR(F10=\"F\",F10=\"A\"),H6,IF(F6=F10,\"\",(IF(F6>F10,F6-F10+H6,F10-F6+H10)))))","v":""},null,null,null,"Match 9 - Billard num  :",null,null,null,{"$f":"IF(OR(AND(P7=\"F\",P9=\"F\"),AND(P7=\"A\",P9=\"A\")),N9,IF(OR(P7=\"F\",P7=\"A\"),N7,IF(OR(P9=\"F\",P9=\"A\"),N9,IF(P7=P9,\"\",(IF(P7<P9,N7,N9))))))","v":""},{"$f":"IF(OR(AND(P7=\"F\",P9=\"F\"),AND(P7=\"A\",P9=\"A\")),O9,IF(OR(P7=\"F\",P7=\"A\"),O7,IF(OR(P9=\"F\",P9=\"A\"),O9,IF(P7=P9,\"\",(IF(P7<P9,P7-P9,P9-P7))))))","v":""},null,"Match 2 - Billard num  :",null,null,null,{"$f":"IF(OR(AND(P7=\"F\",P9=\"F\"),AND(P7=\"A\",P9=\"A\")),N7,IF(OR(P7=\"F\",P7=\"A\"),N9,IF(OR(P9=\"F\",P9=\"A\"),N7,IF(P7=P9,\"\",(IF(P7>P9,N7,N9))))))","v":""},{"$f":"IF(OR(AND(P7=\"F\",P9=\"F\"),AND(P7=\"A\",P9=\"A\")),O7,IF(OR(P7=\"F\",P7=\"A\"),O9,IF(OR(P9=\"F\",P9=\"A\"),O7,IF(P7=P9,\"\",(IF(P7>P9,P7-P9,P9-P7))))))","v":""},null,null,{"$f":"IF(OR(AND(X6=\"F\",X10=\"F\"),AND(X6=\"A\",X10=\"A\")),V6,IF(OR(X6=\"F\",X10=\"A\"),V10,IF(OR(X10=\"F\",X10=\"A\"),V6,IF(X6=X10,\"\",(IF(X6>X10,V6,V10))))))","v":""},{"$f":"IF(OR(X6=\"F\",X10=\"A\"),W6,IF(OR(X6=\"A\",X10=\"F\"),W10,IF(X6=X10,\"\",(IF(X6>X10,X6-X10+W6,X10-X6+W10)))))","v":""},null,"D",null,null,null,null,null,null,null,null,null,null,null,null,null,null,null,null,null,null,null,null,null,null,null,null,null,null,null,6,{"$f":"IF(BF4<>\"\",BF4,(BG3=BG4,BF4,(IF(BG3>BG4,BF4,BF3))))","v":{"$error":"#VALUE!"}},{"$f":"IF(BG3>BG4,BG3,BG4)","v":""}]
[null,null,null,"  ",null,null,null,null,null,null,null,"P2",null,{"$f":"P_D4","v":"BRENDEL CHRISTIAN "},0,null,null,"G2",null,null,null,"G6",null,null,null,null,null,null,null,null,null,null,null,null,null,null,null,null,null,null,null,null,null,null,null,null,null,null,null,null,null,null,7,{"$f":"IF(BG6=\"A\",BF7,IF(BG6>BG7,BF6,BF7))","v":""},{"$f":"IF(BG6=\"A\",BG7,IF(BG6>BG7,BG6,BG7))","v":""}]
[null,null,null,null,null,null,{"$f":"IF(OR(T14=\"F\",T14=\"A\"),R14,IF(OR(T18=\"F\",T18=\"A\"),R18,IF(T14=T18,\"\",(IF(T14<T18,R14,R18)))))","v":""},{"$f":"IF(OR(T14=\"F\",T14=\"A\"),S14,IF(OR(T18=\"F\",T18=\"A\"),S18,IF(T14=T18,\"\",(IF(T14<T18,T14-T18+S14,T18-T14+S18)))))","v":""},null,null,null,null,null,null,null,null,null,null,null,null,null,{"$f":"IF(OR(T14=\"F\",T14=\"A\"),R18,IF(OR(T18=\"F\",T18=\"A\"),R14,IF(T14=T18,\"\",(IF(T14>T18,R14,R18)))))","v":""},{"$f":"IF(OR(T14=\"F\",T14=\"A\"),S18,IF(OR(T18=\"F\",T18=\"A\"),S14,IF(T14=T18,\"\",(IF(T14>T18,T14-T18+S14,T18-T14+S18)))))","v":""},null,null,null,null,null,null,null,null,null,null,null,null,null,null,null,null,null,null,null,null,null,null,null,null,null,null,null,null,null,8,{"$f":"IF(BG6=\"A\",BF6,IF(BG6>BG7,BF7,BF6))","v":""},{"$f":"IF(BG6=\"A\",BG6,IF(BG6>BG7,BG7,BG6))","v":""}]
[null,null,null,null,null,null,null,"P6"]
[null,{"$f":"IF(OR(D8=\"F\",D8=\"A\"),K18,IF(OR(D18=\"F\",D18=\"A\"),K8,IF(D8=D18,\"\",(IF(D8>D18,B8,B18)))))","v":""},{"$f":"IF(OR(D8=\"F\",D8=\"A\"),C18,IF(OR(D18=\"F\",D18=\"A\"),C8,IF(D8=D18,\"\",(IF(D8>D18,D8-D18+C8,D18-D8+C18)))))","v":""},null,null,null,null,null,null,null,null,null,null,null,null,null,null,null,null,null,null,null,null,null,null,null,null,null,null,null,null,null,null,null,null,null,null,null,null,null,null,null,null,"ELIMINES"]
[null,"Match 12 - Billard num  :",null,null,null,null,null,null,null,null,null,"P3",null,{"$f":"P_D3","v":"VALLOT ROMAIN "},0,null,null,"G3",null,null,null,"Petite Finale",null,null,null,null,null,null,null,"G","P","G","P","G","P","G","P","G","P","G","P","Ga",null,null,"NOM","Ga"]
[null,null,null,null,null,null,null,null,null,null,{"$f":"IF(OR(AND(P13=\"F\",P15=\"F\"),AND(P13=\"A\",P15=\"A\")),N15,IF(OR(P13=\"F\",P13=\"A\"),N13,IF(OR(P15=\"F\",P15=\"A\"),N15,IF(P13=P15,\"\",(IF(P13<P15,N13,N15))))))","v":""},{"$f":"IF(OR(AND(P13=\"F\",P15=\"F\"),AND(P13=\"A\",P15=\"A\")),O15,IF(OR(P13=\"F\",P13=\"A\"),O13,IF(OR(P15=\"F\",P15=\"A\"),O15,IF(P13=P15,\"\",(IF(P13<P15,P13-P15,P15-P13))))))","v":""},null,"Match 3 - Billard num  :",null,null,null,{"$f":"IF(OR(AND(P13=\"F\",P15=\"F\"),AND(P13=\"A\",P15=\"A\")),N13,IF(OR(P13=\"F\",P13=\"A\"),N15,IF(OR(P15=\"F\",P15=\"A\"),N13,IF(P13=P15,\"\",(IF(P13>P15,N13,N15))))))","v":""},{"$f":"IF(OR(AND(P13=\"F\",P15=\"F\"),AND(P13=\"A\",P15=\"A\")),O13,IF(OR(P13=\"F\",P13=\"A\"),O15,IF(OR(P15=\"F\",P15=\"A\"),O13,IF(P13=P15,\"\",(IF(P13>P15,P13-P15,P15-P13))))))","v":""},null,null,"P11",null,null,null,null,2,{"$f":"IF(V10=\"\",\"\",IF(V10=R14,R14,R18))","v":""},{"$f":"N13","v":"VALLOT ROMAIN "},{"$f":"IF(AC14=N13,IF(P15=\"F\",\"\",P13),0)","v":0},{"$f":"IF(AC14=N13,IF(P13=\"F\",\"\",P15),0)","v":0},{"$f":"IF(AC14=R14,IF(T18=\"F\",\"\",T14),0)","v":0},{"$f":"IF(AC14=R14,IF(T14=\"F\",\"\",T18),0)","v":0},{"$f":"IF(AC14=K14,IF(J18=\"F\",\"\",J14),0)","v":0},{"$f":"IF(AC14=K14,IF(J14=\"F\",\"\",J18),0)","v":0},{"$f":"IF(AC14=G16,IF(F20=\"F\",\"\",F16),0)","v":0},{"$f":"IF(AC14=G16,IF(F16=\"F\",\"\",F20),0)","v":0},{"$f":"IF(AC14=G10,IF(F6=\"F\",\"\",F10),0)","v":0},{"$f":"IF(AC14=G10,IF(F10=\"F\",\"\",F6),0)","v":0},{"$f":"SUM(AD14,AF14,AH14,AJ14,AL14)","v":0},0,{"$f":"AN14-AO14","v":0},null,null,{"$f":"AB6","v":""},{"$f":"IF(AS14=\"\",\"\",(VLOOKUP(AS14,AC4:AP17,14,FALSE)))","v":""}]
[null,null,null,null,null,null,null,"G8",null,null,null,null,null,{"$f":"P_D6","v":" "},0,null,null,null,null,null,null,{"$f":"IF(OR(AND(X6=\"F\",X10=\"F\"),AND(X6=\"A\",X10=\"A\")),V10,IF(OR(X6=\"F\",X6=\"A\"),V6,IF(OR(X10=\"F\",X10=\"A\"),V10,IF(X6=X10,\"\",(IF(X6<X10,V6,V10))))))","v":""},{"$f":"(IF(X6=X10,\"\",IF(X6>X10,X10-X6+X6,X6-X10+W6)))","v":""},null,null,null,4,{"$f":"IF(B18=\"\",\"\",IF(B18=G16,G16,G20))","v":""},{"$f":"N15","v":" "},{"$f":"IF(AC15=N15,IF(P13=\"F\",\"\",P15),0)","v":0},{"$f":"IF(AC15=N15,IF(P15=\"F\",\"\",P13),0)","v":0},{"$f":"IF(AC15=R14,IF(T18=\"F\",\"\",T14),0)","v":0},{"$f":"IF(AC15=R14,IF(T14=\"F\",\"\",T18),0)","v":0},{"$f":"IF(AC15=K14,IF(J18=\"F\",\"\",J14),0)","v":0},{"$f":"IF(AC15=K14,IF(J14=\"F\",\"\",J18),0)","v":0},{"$f":"IF(AC15=G16,IF(F20=\"F\",\"\",F16),0)","v":0},{"$f":"IF(AC15=G16,IF(F16=\"F\",\"\",F20),0)","v":0},{"$f":"IF(AC15=G10,IF(F6=\"F\",\"\",F10),0)","v":0},{"$f":"IF(AC15=G10,IF(F10=\"F\",\"\",F6),0)","v":0},0,0,{"$f":"AN15-AO15","v":0},null,null,{"$f":"AB16","v":""},{"$f":"IF(AS15=\"\",\"\",(VLOOKUP(AS15,AC4:AP17,14,FALSE)))","v":""}]
[null,null,null,null,null,null,{"$f":"IF(OR(J14=\"F\",J14=\"A\"),K18,IF(OR(J18=\"F\",J18=\"A\"),K14,IF(J14=J18,\"\",(IF(J14>J18,K14,K18)))))","v":""},{"$f":"IF(OR(J14=\"F\",J14=\"A\"),L18,IF(OR(J18=\"F\",J18=\"A\"),L14,IF(J14=J18,\"\",(IF(J14>J18,J14-J18+L14,J18-J14+L18)))))","v":""},null,null,"Match 8 - Billard num  :",null,null,null,null,null,null,"Match 6 - Billard num  :",null,null,null,"Match 13 - Billard num  :",null,null,null,null,6,{"$f":"IF(B18=\"\",\"\",IF(B18=G16,G20,G16))","v":""},{"$f":"N17","v":" "},{"$f":"IF(AC16=N17,IF(P19=\"F\",\"\",P17),0)","v":0},{"$f":"IF(AC16=N17,IF(P17=\"F\",\"\",P19),0)","v":0},{"$f":"IF(AC16=R18,IF(T14=\"F\",\"\",T18),0)","v":0},{"$f":"IF(AC16=R18,IF(T18=\"F\",\"\",T14),0)","v":0},{"$f":"IF(AC16=K18,IF(J14=\"F\",\"\",J18),0)","v":0},{"$f":"IF(AC16=K18,IF(J18=\"F\",\"\",J14),0)","v":0},{"$f":"IF(AC16=G16,IF(F20=\"F\",\"\",F16),0)","v":0},{"$f":"IF(AC16=G16,IF(F16=\"F\",\"\",F20),0)","v":0},{"$f":"IF(AC16=G10,IF(F6=\"F\",\"\",F10),0)","v":0},{"$f":"IF(AC16=G10,IF(F10=\"F\",\"\",F6),0)","v":0},0,0,{"$f":"AN16-AO16","v":0},null,null,{"$f":"AB7","v":""},{"$f":"IF(AS16=\"\",\"\",(VLOOKUP(AS16,AC4:AP17,14,FALSE)))","v":""}]
[null,null,"G10",null,null,null,null,null,null,null,null,null,null,{"$f":"P_D7","v":" "},0,null,null,null,null,null,null,{"$f":"IF(X15=X19,\"\",IF(X15>X19,V15,V19))","v":""},{"$f":"IF(OR(X15=\"F\",X19=\"A\"),W15,IF(OR(X15=\"A\",X19=\"F\"),W19,IF(X15=X19,\"\",(IF(X15>X19,X15-X19+W15,X19-X15+W19)))))","v":""},null,"H",null,8,{"$f":"IF(G16=\"\",\"\",IF(G16=K14,K18,K14))","v":""},{"$f":"N19","v":"BACCAM HELENE "},{"$f":"IF(AC17=N19,IF(P17=\"F\",\"\",P19),0)","v":0},{"$f":"IF(AC17=N19,IF(P19=\"F\",\"\",P17),0)","v":0},{"$f":"IF(AC17=R18,IF(T14=\"F\",\"\",T18),0)","v":0},{"$f":"IF(AC17=R18,IF(T18=\"F\",\"\",T14),0)","v":0},{"$f":"IF(AC17=K18,IF(J14=\"F\",\"\",J18),0)","v":0},{"$f":"IF(AC17=K18,IF(J18=\"F\",\"\",J14),0)","v":0},{"$f":"IF(AC17=G16,IF(F20=\"F\",\"\",F16),0)","v":0},{"$f":"IF(AC17=G16,IF(F16=\"F\",\"\",F20),0)","v":0},{"$f":"IF(AC17=G10,IF(F6=\"F\",\"\",F10),0)","v":0},{"$f":"IF(AC17=G10,IF(F10=\"F\",\"\",F6),0)","v":0},0,0,{"$f":"AN17-AO17","v":0},null,null,{"$f":"AB17","v":""},{"$f":"IF(AS17=\"\",\"\",(VLOOKUP(AS17,AC4:AP17,14,FALSE)))","v":""}]
[null,{"$f":"IF(OR(F16=\"F\",F16=\"A\"),G20,IF(OR(F20=\"F\",F20=\"A\"),G16,IF(F16=F20,\"\",(IF(F16>F20,G16,G20)))))","v":""},{"$f":"IF(OR(F16=\"F\",F16=\"A\"),H20,IF(OR(F20=\"F\",F20=\"A\"),H16,IF(F16=F20,\"\",(IF(F16>F20,F16-F20+H16,F20-F16+H20)))))","v":""},null,null,null,"Match 10 - Billard num  :",null,null,null,{"$f":"IF(OR(AND(P17=\"F\",P19=\"F\"),AND(P17=\"A\",P19=\"A\")),N19,IF(OR(P17=\"F\",P17=\"A\"),N17,IF(OR(P19=\"F\",P19=\"A\"),N19,IF(P17=P19,\"\",(IF(P17<P19,N17,N19))))))","v":""},{"$f":"IF(OR(AND(P17=\"F\",P19=\"F\"),AND(P17=\"A\",P19=\"A\")),O19,IF(OR(P17=\"F\",P17=\"A\"),O17,IF(OR(P19=\"F\",P19=\"A\"),O19,IF(P17=P19,\"\",(IF(P17<P19,P17-P19,P19-P17))))))","v":""},null,"Match 4 - Billard num  :",null,null,null,{"$f":"IF(OR(AND(P17=\"F\",P19=\"F\"),AND(P17=\"A\",P19=\"A\")),N17,IF(OR(P17=\"F\",P17=\"A\"),N19,IF(OR(P19=\"F\",P19=\"A\"),N17,IF(P17=P19,\"\",(IF(P17>P19,N17,N19))))))","v":""},{"$f":"IF(OR(AND(P17=\"F\",P19=\"F\"),AND(P17=\"A\",P19=\"A\")),O17,IF(OR(P17=\"F\",P17=\"A\"),O19,IF(OR(P19=\"F\",P19=\"A\"),O17,IF(P17=P19,\"\",(IF(P17>P19,P17-P19,P19-P17))))))","v":""},null,null,"G12"]
[null,null,null,null,null,null,null,null,null,null,null,"P4",null,{"$f":"P_D2","v":"BACCAM HELENE "},0,null,null,"G4",null,null,null,{"$f":"B12","v":""},{"$f":"C12","v":""}]
[null,null,null,null,null,null,{"$f":"IF(OR(T4=\"F\",T4=\"A\"),R4,IF(OR(T8=\"F\",T8=\"A\"),R8,IF(T4=T8,\"\",(IF(T4<T8,R4,R8)))))","v":""},{"$f":"IF(OR(T4=\"F\",T4=\"A\"),S4,IF(OR(T8=\"F\",T8=\"A\"),S8,IF(T4=T8,\"\",(IF(T4<T8,T4-T8+S4,T8-T4+S8)))))","v":""}]
[null,null,null,null,null,null,null,"P5"]

{"sheet":"Final","index":8,"n_rows":46,"n_cols":56,"rows_kept":46,"cut":false,"hidden":false,"merged":[[1,18,1,20],[1,24,1,26],[1,30,1,32],[0,11,0,13],[1,11,1,13],[0,30,0,32],[0,24,0,26],[0,18,0,20],[2,11,2,13],[2,3,2,5],[30,16,30,17],[0,3,0,5],[1,3,1,5]]}
[null,null,null,"1/16 de finale",null,null,null,null,null,null,null,"1/8 de finale",null,null,null,null,null,null,"1/4 de finale",null,null,null,null,null,"1/2 finale",null,null,null,null,null,"Finale"]
[null,null,null,"(4 manches)",null,null,null,null,null,null,null,"(4 manches)",null,null,null,null,null,null,"(4 manches)",null,null,null,null,null,"(4 manches)",null,null,null,null,null,"(5 manches)"]
[null,null,null,"Entrée des TSB",null,null,null,null,null,null,null,"Entrée des TSA"]
[]
[]
[null,null,null,null,null,"GA","CF","RF","N°",null,null,null,null,"GA","CF","RF","N°"]
[null,null,"TSB (16)",{"$f":"TSB_8","v":"GARNIER NICOLAS "},0,null,null,null,null,null,"TSA (1)",{"$f":"TSA_1","v":"TEBBANI AZIZ "},0,null,null,null,null,null,null,null,"GA","CF","RF"]
[null,null,"A",{"$f":"P1_1","v":""},{"$f":"P1_1G","v":""},null,null,null,null,null,null,{"$f":"IF(OR(AND(F7=\"F\",F8=\"F\"),AND(F7=\"A\",F8=\"A\")),D7,IF(OR(F7=\"F\",F7=\"A\"),D8,IF(OR(F8=\"F\",F8=\"A\"),D7,IF(F7=F8,\"\",(IF(F7>F8,D7,D8))))))","v":""},{"$f":"IF(OR(AND(F7=\"F\",F8=\"F\"),AND(F7=\"A\",F8=\"A\")),E7,IF(OR(F7=\"F\",F7=\"A\"),E8,IF(OR(F8=\"F\",F8=\"A\"),E7,IF(F7=F8,\"\",(IF(F7>F8,F7-F8,F8-F7+E8))))))","v":""},null,null,null,null,null,{"$f":"IF(AND(N7=\"A\",N8=\"A\"),L7,IF(N7=\"A\",L8,IF(N8=\"A\",L7,IF(N7=N8,\"\",(IF(N7>N8,L7,L8))))))","v":""},{"$f":"IF(OR(AND(N7=\"F\",N8=\"F\"),AND(N7=\"A\",N8=\"A\")),M8,IF(OR(N7=\"F\",N7=\"A\"),M8,IF(OR(N8=\"F\",N8=\"A\"),M7,IF(N7=N8,\"\",(IF(N7>N8,N7-M8,N8-N7+M8))))))","v":""},null,null,null,null,null,null,"GA","CF","RF"]
[null,null,null,null,null,null,null,null,null,null,null,null,null,null,null,null,null,null,"Billard N°",null,null,null,null,null,{"$f":"IF(AND(U8=\"A\",U10=\"A\"),S8,IF(U8=\"A\",S10,IF(U10=\"A\",S8,IF(U8=U10,\"\",(IF(U8>U10,S8,S10))))))","v":""},{"$f":"IF(OR(AND(U8=\"F\",U10=\"F\"),AND(U8=\"A\",U10=\"A\")),T10,IF(OR(U8=\"F\",U8=\"A\"),T10,IF(OR(U10=\"F\",U10=\"A\"),T8,IF(U8=U10,\"\",(IF(U8>U10,U8-U10,U10-U8+T10))))))","v":""}]
[null,null,"TSB (9)",{"$f":"TSB_1","v":"NGUYEN MICHEL "},0,null,null,null,null,null,"TSA (8)",{"$f":"TSA_8","v":"LACROIX DYLAN "},0,null,null,null,null,null,{"$f":"IF(AND(N10=\"A\",N11=\"A\"),L10,IF(N10=\"A\",L11,IF(N11=\"A\",L10,IF(N10=N11,\"\",(IF(N10>N11,L10,L11))))))","v":""},{"$f":"IF(OR(AND(N10=\"F\",N11=\"F\"),AND(N10=\"A\",N11=\"A\")),M11,IF(OR(N10=\"F\",N10=\"A\"),M11,IF(OR(N11=\"F\",N11=\"A\"),M10,IF(N10=N11,\"\",(IF(N10>N11,N10-M11,N11-N11+M10))))))","v":""}]
[null,null,"H",{"$f":"P4_2","v":""},{"$f":"P4_2G","v":""},null,null,null,null,null,null,{"$f":"IF(OR(AND(F10=\"F\",F11=\"F\"),AND(F10=\"A\",F11=\"A\")),D10,IF(OR(F10=\"F\",F10=\"A\"),D11,IF(OR(F11=\"F\",F11=\"A\"),D10,IF(F10=F11,\"\",(IF(F10>F11,D10,D11))))))","v":""},{"$f":"IF(OR(AND(F10=\"F\",F11=\"F\"),AND(F10=\"A\",F11=\"A\")),E10,IF(OR(F10=\"F\",F10=\"A\"),E11,IF(OR(F11=\"F\",F11=\"A\"),E10,IF(F10=F11,\"\",(IF(F10>F11,F10-F11,F11-F10+E11))))))","v":""},null,null,null,null,null,null,null,null,null,null,null,null,"N°",null,null,null,null,null,null,"GA","CF","RF"]
[null,null,null,null,null,null,null,null,null,null,null,null,null,null,null,null,null,null,null,null,null,null,null,null,"Billard N°",null,null,null,null,null,{"$f":"IF(AND(AA9=\"A\",AA15=\"A\"),Y9,IF(AA9=\"A\",Y15,IF(AA15=\"A\",Y9,IF(AA9=AA15,\"\",(IF(AA9>AA15,Y9,Y15))))))","v":""},{"$f":"IF(OR(AND(AA9=\"F\",AA15=\"F\"),AND(AA9=\"A\",AA15=\"A\")),Z15,IF(OR(AA9=\"F\",AA9=\"A\"),Z15,IF(OR(AA15=\"F\",AA15=\"A\"),Z9,IF(AA9=AA15,\"\",(IF(AA9>AA15,AA9-AA15+Z9,AA15-AA9+Z15))))))","v":""}]
[null,null,"TSB (12)",{"$f":"TSB_4","v":"PARDO RAMON "},0,null,null,null,null,null,"TSA n°5",{"$f":"TSA_5","v":"BACCAM BOUNLIENG "},0,null,null,null,null,null,null,null,"GA","CF","RF"]
[null,null,"F",{"$f":"P2_2","v":""},{"$f":"P2_2G","v":""},null,null,null,null,null,null,{"$f":"IF(OR(AND(F13=\"F\",F14=\"F\"),AND(F13=\"A\",F14=\"A\")),D13,IF(OR(F13=\"F\",F13=\"A\"),D14,IF(OR(F14=\"F\",F14=\"A\"),D13,IF(F13=F14,\"\",(IF(F13>F14,D13,D14))))))","v":""},{"$f":"IF(OR(AND(F13=\"F\",F14=\"F\"),AND(F13=\"A\",F14=\"A\")),E13,IF(OR(F13=\"F\",F13=\"A\"),E14,IF(OR(F14=\"F\",F14=\"A\"),E13,IF(F13=F14,\"\",(IF(F13>F14,F13-F14,F14-F13+E14))))))","v":""},null,null,null,null,null,{"$f":"IF(AND(N13=\"A\",N14=\"A\"),L13,IF(N13=\"A\",L14,IF(N14=\"A\",L13,IF(N13=N14,\"\",(IF(N13>N14,L13,L14))))))","v":""},{"$f":"IF(OR(AND(N13=\"F\",N14=\"F\"),AND(N13=\"A\",N14=\"A\")),M14,IF(OR(N13=\"F\",N13=\"A\"),M14,IF(OR(N14=\"F\",N14=\"A\"),M13,IF(N13=N14,\"\",(IF(N13>N14,N13-M14,N14-N13+M14))))))","v":""},null,null,null,null,null,null,null,null,null,null,null,null,null,null,null,null,null,null,null,null,null,"JOUEURS","1/8","1/4","1/2","Finale","GA Final",null,"JOUEURS","GA Poules",null,"JOUEURS","GA Poules","GA Final","GA TOTAL"]
[null,null,null,null,null,null,null,null,null,null,null,null,null,null,null,null,null,null,"Billard N°",null,null,null,null,null,{"$f":"IF(AND(U14=\"A\",U16=\"A\"),S14,IF(U14=\"A\",S16,IF(U16=\"A\",S14,IF(U14=U16,\"\",(IF(U14>U16,S14,S16))))))","v":""},{"$f":"IF(OR(AND(U14=\"F\",U16=\"F\"),AND(U14=\"A\",U16=\"A\")),T16,IF(OR(U14=\"F\",U14=\"A\"),T16,IF(OR(U16=\"F\",U16=\"A\"),T14,IF(U14=U16,\"\",(IF(U14>U16,U14-U16,U16-U14+T16))))))","v":""},null,null,null,null,null,null,null,null,null,null,null,null,null,null,null,null,{"$f":"L7","v":"TEBBANI AZIZ "},{"$f":"IF(AND(N7=\"A\",N8=\"A\"),0,IF(N7=\"A\",-N8,IF(N8=\"A\",N7,N7-N8)))","v":0},{"$f":"IF(S8=AQ15,IF(AND(U8=\"A\",U10=\"A\"),0,IF(OR(AR15>0,N8=\"A\"),IF(U8=\"A\",-U10,IF(U10=\"A\",U8,U8-U10)),0)),0)","v":0},{"$f":"IF(Y9=AQ15,IF(AND(AA9=\"A\",AA15=\"A\"),0,IF(OR(AS15>0,U10=\"A\"),IF(AA9=\"A\",-AA15,IF(AA15=\"A\",AA9,AA9-AA15)),0)),0)","v":0},{"$f":"IF(AE12=AQ15,IF(AND(AG12=\"A\",AG24=\"A\"),0,IF(OR(AT15>0,AA15=\"A\"),IF(AG12=\"A\",-AG24,IF(AG24=\"A\",AG12,AG12-AG24)),0)),0)","v":0},{"$f":"SUM(AR15:AU15)","v":0},null,{"$f":"#REF!","v":{"$error":"#REF!"}},{"$f":"#REF!","v":{"$error":"#REF!"}},null,{"$f":"IF(#REF!=0,\"\",#REF!)","v":{"$error":"#REF!"}},{"$f":"VLOOKUP(BA15,$AX$15:$AY$46,2,FALSE)","v":{"$error":"#REF!"}},{"$f":"VLOOKUP(BA15,$AQ$15:$AV$46,6,FALSE)","v":{"$error":"#REF!"}},{"$f":"BB15+BC15","v":{"$error":"#REF!"}}]
[null,null,"TSB (13)",{"$f":"TSB_5","v":"KLEIN STEPHANE "},0,null,null,null,null,null,"TSA (4)",{"$f":"TSA_4","v":"ROBEZ FLORENT "},0,null,null,null,null,null,{"$f":"IF(AND(N16=\"A\",N17=\"A\"),L16,IF(N16=\"A\",L17,IF(N17=\"A\",L16,IF(N16=N17,\"\",(IF(N16>N17,L16,L17))))))","v":""},{"$f":"IF(OR(AND(N16=\"F\",N17=\"F\"),AND(N16=\"A\",N17=\"A\")),M17,IF(OR(N16=\"F\",N16=\"A\"),M17,IF(OR(N17=\"F\",N17=\"A\"),M16,IF(N16=N17,\"\",(IF(N16>N17,N16-M17,N17-N17+M16))))))","v":""},null,null,null,null,null,null,null,null,null,null,null,null,null,null,null,null,null,null,null,null,null,null,{"$f":"L8","v":""},{"$f":"IF(AND(N7=\"A\",N8=\"A\"),0,IF(N8=\"A\",-N7,IF(N7=\"A\",N8,N8-N7)))","v":0},{"$f":"IF(S8=AQ16,IF(AND(U8=\"A\",U10=\"A\"),0,IF(OR(AR16>0,N7=\"A\"),IF(U8=\"A\",-U10,IF(U10=\"A\",U8,U8-U10)),0)),0)","v":0},{"$f":"IF(Y9=AQ16,IF(AND(AA9=\"A\",AA15=\"A\"),0,IF(OR(AS16>0,U10=\"A\"),IF(AA9=\"A\",-AA15,IF(AA15=\"A\",AA9,AA9-AA15)),0)),0)","v":0},{"$f":"IF(AE12=AQ16,IF(AND(AG12=\"A\",AG24=\"A\"),0,IF(OR(AT16>0,AA15=\"A\"),IF(AG12=\"A\",-AG24,IF(AG24=\"A\",AG12,AG12-AG24)),0)),0)","v":0},{"$f":"SUM(AR16:AU16)","v":0},null,{"$f":"#REF!","v":{"$error":"#REF!"}},{"$f":"#REF!","v":{"$error":"#REF!"}},null,{"$f":"IF(#REF!=0,\"\",#REF!)","v":{"$error":"#REF!"}},{"$f":"VLOOKUP(BA16,$AX$15:$AY$46,2,FALSE)","v":{"$error":"#REF!"}},{"$f":"VLOOKUP(BA16,$AQ$15:$AV$46,6,FALSE)","v":{"$error":"#REF!"}},{"$error":"#REF!"}]
[null,null,"D",{"$f":"P4_1","v":""},{"$f":"P4_1G","v":""},null,null,null,null,null,null,{"$f":"IF(OR(AND(F16=\"F\",F17=\"F\"),AND(F16=\"A\",F17=\"A\")),D16,IF(OR(F16=\"F\",F16=\"A\"),D17,IF(OR(F17=\"F\",F17=\"A\"),D16,IF(F16=F17,\"\",(IF(F16>F17,D16,D17))))))","v":""},{"$f":"IF(OR(AND(F16=\"F\",F17=\"F\"),AND(F16=\"A\",F17=\"A\")),E16,IF(OR(F16=\"F\",F16=\"A\"),E17,IF(OR(F17=\"F\",F17=\"A\"),E16,IF(F16=F17,\"\",(IF(F16>F17,F16-F17,F17-F16+E17))))))","v":""},null,null,null,null,null,null,null,null,null,null,null,null,null,null,null,null,null,null,"N°",null,null,null,null,null,null,"CF","RF",null,null,{"$f":"L10","v":"LACROIX DYLAN "},{"$f":"IF(AND(N10=\"A\",N11=\"A\"),0,IF(N10=\"A\",-N11,IF(N11=\"A\",N10,N10-N11)))","v":0},{"$f":"IF(S10=AQ17,IF(AND(U8=\"A\",U10=\"A\"),0,IF(OR(AR17>0,N11=\"A\"),IF(U10=\"A\",-U8,IF(U8=\"A\",U10,U10-U8)),0)),0)","v":0},{"$f":"IF(Y9=AQ17,IF(AND(AA9=\"A\",AA15=\"A\"),0,IF(OR(AS17>0,U8=\"A\"),IF(AA9=\"A\",-AA15,IF(AA15=\"A\",AA9,AA9-AA15)),0)),0)","v":0},{"$f":"IF(AE12=AQ17,IF(AND(AG12=\"A\",AG24=\"A\"),0,IF(OR(AT17>0,AA15=\"A\"),IF(AG12=\"A\",-AG24,IF(AG24=\"A\",AG12,AG12-AG24)),0)),0)","v":0},0,null,{"$f":"#REF!","v":{"$error":"#REF!"}},{"$f":"#REF!","v":{"$error":"#REF!"}},null,{"$f":"IF(#REF!=0,\"\",#REF!)","v":{"$error":"#REF!"}},{"$error":"#REF!"},{"$error":"#REF!"},{"$error":"#REF!"}]
[null,null,null,null,null,null,null,null,null,null,null,null,null,null,null,null,null,null,null,null,null,null,null,null,null,null,null,null,null,null,"Billard N°",null,null,null,null,null,{"$f":"IF(AND(AG12=\"A\",AG24=\"A\"),AE12,IF(AG12=\"A\",AE24,IF(AG24=\"A\",AE12,IF(AG12=AG24,\"\",(IF(AG12>AG24,AE12,AE24))))))","v":""},{"$f":"IF(OR(AND(AG12=\"F\",AG24=\"F\"),AND(AG12=\"A\",AG24=\"A\")),AF24,IF(OR(AG12=\"F\",AG12=\"A\"),AF24,IF(OR(AG24=\"F\",AG24=\"A\"),AF12,IF(AG12=AG24,\"\",(IF(AG12>AG24,AG12-AG24+AF12,AG24-AG12+AF24))))))","v":""},null,null,null,null,{"$f":"L11","v":""},{"$f":"IF(AND(N10=\"A\",N11=\"A\"),0,IF(N11=\"A\",-N10,IF(N10=\"A\",N11,N11-N10)))","v":0},{"$f":"IF(S10=AQ18,IF(AND(U8=\"A\",U10=\"A\"),0,IF(OR(AR18>0,N10=\"A\"),IF(U10=\"A\",-U8,IF(U8=\"A\",U10,U10-U8)),0)),0)","v":0},{"$f":"IF(Y9=AQ18,IF(AND(AA9=\"A\",AA15=\"A\"),0,IF(OR(AS18>0,U8=\"A\"),IF(AA9=\"A\",-AA15,IF(AA15=\"A\",AA9,AA9-AA15)),0)),0)","v":0},{"$f":"IF(AE12=AQ18,IF(AND(AG12=\"A\",AG24=\"A\"),0,IF(OR(AT18>0,AA15=\"A\"),IF(AG12=\"A\",-AG24,IF(AG24=\"A\",AG12,AG12-AG24)),0)),0)","v":0},0,null,{"$f":"#REF!","v":{"$error":"#REF!"}},{"$f":"#REF!","v":{"$error":"#REF!"}},null,{"$f":"IF(#REF!=0,\"\",#REF!)","v":{"$error":"#REF!"}},{"$error":"#REF!"},{"$error":"#REF!"},{"$error":"#REF!"}]
[null,null,"TSB (14)",{"$f":"TSB_6","v":"MOREL SYLVAIN "},0,null,null,null,null,null,"TSA (3)",{"$f":"TSA_3","v":"SOPIC NICOLAS "},0,null,null,null,null,null,null,null,"GA","CF","RF",null,null,null,null,null,null,null,null,null,null,null,null,null,null,null,null,null,null,null,{"$f":"L13","v":"BACCAM BOUNLIENG "},{"$f":"IF(AND(N13=\"A\",N14=\"A\"),0,IF(N13=\"A\",-N14,IF(N14=\"A\",N13,N13-N14)))","v":0},{"$f":"IF(S14=AQ19,IF(AND(U14=\"A\",U16=\"A\"),0,IF(OR(AR19>0,N14=\"A\"),IF(U14=\"A\",-U16,IF(U16=\"A\",U14,U14-U16)),0)),0)","v":0},{"$f":"IF(Y15=AQ19,IF(AND(AA9=\"A\",AA15=\"A\"),0,IF(OR(AS19>0,U16=\"A\"),IF(AA15=\"A\",-AA9,IF(AA9=\"A\",AA15,AA15-AA9)),0)),0)","v":0},{"$f":"IF(AE12=AQ19,IF(AND(AG12=\"A\",AG24=\"A\"),0,IF(OR(AT19>0,AA9=\"A\"),IF(AG12=\"A\",-AG24,IF(AG24=\"A\",AG12,AG12-AG24)),0)),0)","v":0},0,null,{"$f":"#REF!","v":{"$error":"#REF!"}},{"$f":"#REF!","v":{"$error":"#REF!"}},null,{"$f":"IF(#REF!=0,\"\",#REF!)","v":{"$error":"#REF!"}},{"$error":"#REF!"},{"$error":"#REF!"},{"$error":"#REF!"}]
[null,null,"C",{"$f":"P3_1","v":""},{"$f":"P3_1G","v":""},null,null,null,null,null,null,{"$f":"IF(OR(AND(F19=\"F\",F20=\"F\"),AND(F19=\"A\",F20=\"A\")),D19,IF(OR(F19=\"F\",F19=\"A\"),D20,IF(OR(F20=\"F\",F20=\"A\"),D19,IF(F19=F20,\"\",(IF(F19>F20,D19,D20))))))","v":""},{"$f":"IF(OR(AND(F19=\"F\",F20=\"F\"),AND(F19=\"A\",F20=\"A\")),E19,IF(OR(F19=\"F\",F19=\"A\"),E20,IF(OR(F20=\"F\",F20=\"A\"),E19,IF(F19=F20,\"\",(IF(F19>F20,F19-F20,F20-F19+E20))))))","v":""},null,null,null,null,null,{"$f":"IF(AND(N19=\"A\",N20=\"A\"),L19,IF(N19=\"A\",L20,IF(N20=\"A\",L19,IF(N19=N20,\"\",(IF(N19>N20,L19,L20))))))","v":""},{"$f":"IF(OR(AND(N19=\"F\",N20=\"F\"),AND(N19=\"A\",N20=\"A\")),M20,IF(OR(N19=\"F\",N19=\"A\"),M20,IF(OR(N20=\"F\",N20=\"A\"),M19,IF(N19=N20,\"\",(IF(N19>N20,N19-M20,N20-N19+M20))))))","v":""},null,null,null,null,null,null,null,null,null,null,null,null,null,null,null,null,null,null,null,null,null,null,{"$f":"L14","v":""},{"$f":"IF(AND(N13=\"A\",N14=\"A\"),0,IF(N14=\"A\",-N13,IF(N13=\"A\",N14,N14-N13)))","v":0},{"$f":"IF(S14=AQ20,IF(AND(U14=\"A\",U16=\"A\"),0,IF(OR(AR20>0,N13=\"A\"),IF(U14=\"A\",-U16,IF(U16=\"A\",U14,U14-U16)),0)),0)","v":0},{"$f":"IF(Y15=AQ20,IF(AND(AA9=\"A\",AA15=\"A\"),0,IF(OR(AS20>0,U16=\"A\"),IF(AA15=\"A\",-AA9,IF(AA9=\"A\",AA15,AA15-AA9)),0)),0)","v":0},{"$f":"IF(AE12=AQ20,IF(AND(AG12=\"A\",AG24=\"A\"),0,IF(OR(AT20>0,AA9=\"A\"),IF(AG12=\"A\",-AG24,IF(AG24=\"A\",AG12,AG12-AG24)),0)),0)","v":0},0,null,{"$f":"#REF!","v":{"$error":"#REF!"}},{"$f":"#REF!","v":{"$error":"#REF!"}},null,{"$f":"IF(#REF!=0,\"\",#REF!)","v":{"$error":"#REF!"}},{"$error":"#REF!"},{"$error":"#REF!"},{"$error":"#REF!"}]
[null,null,null,null,null,null,null,null,null,null,null,null,null,null,null,null,null,null,"Billard N°",null,null,null,null,null,{"$f":"IF(AND(U20=\"A\",U22=\"A\"),S20,IF(U20=\"A\",S22,IF(U22=\"A\",S20,IF(U20=U22,\"\",(IF(U20>U22,S20,S22))))))","v":""},{"$f":"IF(OR(AND(U20=\"F\",U22=\"F\"),AND(U20=\"A\",U22=\"A\")),T22,IF(OR(U20=\"F\",U20=\"A\"),T22,IF(OR(U22=\"F\",U22=\"A\"),T20,IF(U20=U22,\"\",(IF(U20>U22,U20-U22,U22-U20+T22))))))","v":""},null,null,null,null,null,null,null,null,null,null,null,null,null,null,null,null,{"$f":"L16","v":"ROBEZ FLORENT "},{"$f":"IF(AND(N16=\"A\",N17=\"A\"),0,IF(N16=\"A\",-N17,IF(N17=\"A\",N16,N16-N17)))","v":0},{"$f":"IF(S16=AQ21,IF(AND(U14=\"A\",U16=\"A\"),0,IF(OR(AR21>0,N17=\"A\"),IF(U16=\"A\",-U14,IF(U14=\"A\",U16,U16-U14)),0)),0)","v":0},{"$f":"IF(Y15=AQ21,IF(AND(AA9=\"A\",AA15=\"A\"),0,IF(OR(AS21>0,U14=\"A\"),IF(AA15=\"A\",-AA9,IF(AA9=\"A\",AA15,AA15-AA9)),0)),0)","v":0},{"$f":"IF(AE12=AQ21,IF(AND(AG12=\"A\",AG24=\"A\"),0,IF(OR(AT21>0,AA9=\"A\"),IF(AG12=\"A\",-AG24,IF(AG24=\"A\",AG12,AG12-AG24)),0)),0)","v":0},0,null,{"$f":"#REF!","v":{"$error":"#REF!"}},{"$f":"#REF!","v":{"$error":"#REF!"}},null,{"$f":"IF(#REF!=0,\"\",#REF!)","v":{"$error":"#REF!"}},{"$error":"#REF!"},{"$error":"#REF!"},{"$error":"#REF!"}]
[null,null,"TSB (11)",{"$f":"TSB_3","v":"LETOURNEUR SEBASTIEN "},0,null,null,null,null,null,"TSA (6)",{"$f":"TSA_6","v":"URAY JIMMY "},0,null,null,null,null,null,{"$f":"IF(AND(N22=\"A\",N23=\"A\"),L22,IF(N22=\"A\",L23,IF(N23=\"A\",L22,IF(N22=N23,\"\",(IF(N22>N23,L22,L23))))))","v":""},{"$f":"IF(OR(AND(N22=\"F\",N23=\"F\"),AND(N22=\"A\",N23=\"A\")),M23,IF(OR(N22=\"F\",N22=\"A\"),M23,IF(OR(N23=\"F\",N23=\"A\"),M22,IF(N22=N23,\"\",(IF(N22>N23,N22-M23,N23-N23+M22))))))","v":""},null,null,null,null,null,null,null,null,null,null,null,null,null,null,null,null,null,null,null,null,null,null,{"$f":"L17","v":""},{"$f":"IF(AND(N16=\"A\",N17=\"A\"),0,IF(N17=\"A\",-N16,IF(N16=\"A\",N17,N17-N16)))","v":0},{"$f":"IF(S16=AQ22,IF(AND(U14=\"A\",U16=\"A\"),0,IF(OR(AR22>0,N16=\"A\"),IF(U16=\"A\",-U14,IF(U14=\"A\",U16,U16-U14)),0)),0)","v":0},{"$f":"IF(Y15=AQ22,IF(AND(AA9=\"A\",AA15=\"A\"),0,IF(OR(AS22>0,U14=\"A\"),IF(AA15=\"A\",-AA9,IF(AA9=\"A\",AA15,AA15-AA9)),0)),0)","v":0},{"$f":"IF(AE12=AQ22,IF(AND(AG12=\"A\",AG24=\"A\"),0,IF(OR(AT22>0,AA9=\"A\"),IF(AG12=\"A\",-AG24,IF(AG24=\"A\",AG12,AG12-AG24)),0)),0)","v":0},0,null,{"$f":"#REF!","v":{"$error":"#REF!"}},{"$f":"#REF!","v":{"$error":"#REF!"}},null,{"$f":"IF(#REF!=0,\"\",#REF!)","v":{"$error":"#REF!"}},{"$error":"#REF!"},{"$error":"#REF!"},{"$error":"#REF!"}]
[null,null,"E",{"$f":"P1_2","v":""},{"$f":"P1_2G","v":""},null,null,null,null,null,null,{"$f":"IF(OR(AND(F22=\"F\",F23=\"F\"),AND(F22=\"A\",F23=\"A\")),D22,IF(OR(F22=\"F\",F22=\"A\"),D23,IF(OR(F23=\"F\",F23=\"A\"),D22,IF(F22=F23,\"\",(IF(F22>F23,D22,D23))))))","v":""},{"$f":"IF(OR(AND(F22=\"F\",F23=\"F\"),AND(F22=\"A\",F23=\"A\")),E22,IF(OR(F22=\"F\",F22=\"A\"),E23,IF(OR(F23=\"F\",F23=\"A\"),E22,IF(F22=F23,\"\",(IF(F22>F23,F22-F23,F23-F22+E23))))))","v":""},null,null,null,null,null,null,null,null,null,null,null,null,"N°",null,null,null,null,null,null,null,null,null,null,null,null,null,null,null,null,{"$f":"L19","v":"SOPIC NICOLAS "},{"$f":"IF(AND(N19=\"A\",N20=\"A\"),0,IF(N19=\"A\",-N20,IF(N20=\"A\",N19,N19-N20)))","v":0},{"$f":"IF(S20=AQ23,IF(AND(U20=\"A\",U22=\"A\"),0,IF(OR(AR23>0,N20=\"A\"),IF(U20=\"A\",-U22,IF(U22=\"A\",U20,U20-U22)),0)),0)","v":0},{"$f":"IF(Y21=AQ23,IF(AND(AA21=\"A\",AA27=\"A\"),0,IF(OR(AS23>0,U22=\"A\"),IF(AA21=\"A\",-AA27,IF(AA27=\"A\",AA21,AA21-AA27)),0)),0)","v":0},{"$f":"IF(AE24=AQ23,IF(AND(AG12=\"A\",AG24=\"A\"),0,IF(OR(AT23>0,AA27=\"A\"),IF(AG24=\"A\",-AG12,IF(AG12=\"A\",AG24,AG24-AG12)),0)),0)","v":0},0,null,{"$f":"#REF!","v":{"$error":"#REF!"}},{"$f":"#REF!","v":{"$error":"#REF!"}},null,{"$f":"IF(#REF!=0,\"\",#REF!)","v":{"$error":"#REF!"}},{"$error":"#REF!"},{"$error":"#REF!"},{"$error":"#REF!"}]
[null,null,null,null,null,null,null,null,null,null,null,null,null,null,null,null,null,null,null,null,null,null,null,null,"Billard N°",null,null,null,null,null,{"$f":"IF(AND(AA21=\"A\",AA27=\"A\"),Y21,IF(AA21=\"A\",Y27,IF(AA27=\"A\",Y21,IF(AA21=AA27,\"\",(IF(AA21>AA27,Y21,Y27))))))","v":""},{"$f":"IF(OR(AND(AA21=\"F\",AA27=\"F\"),AND(AA21=\"A\",AA27=\"A\")),Z27,IF(OR(AA21=\"F\",AA21=\"A\"),Z27,IF(OR(AA27=\"F\",AA27=\"A\"),Z21,IF(AA21=AA27,\"\",(IF(AA21>AA27,AA21-AA27+Z21,AA27-AA21+Z27))))))","v":""},null,null,null,null,null,null,null,null,null,null,{"$f":"L20","v":""},{"$f":"IF(AND(N19=\"A\",N20=\"A\"),0,IF(N20=\"A\",-N19,IF(N19=\"A\",N20,N20-N19)))","v":0},{"$f":"IF(S20=AQ24,IF(AND(U20=\"A\",U22=\"A\"),0,IF(OR(AR24>0,N19=\"A\"),IF(U20=\"A\",-U22,IF(U22=\"A\",U20,U20-U22)),0)),0)","v":0},{"$f":"IF(Y21=AQ24,IF(AND(AA21=\"A\",AA27=\"A\"),0,IF(OR(AS24>0,U22=\"A\"),IF(AA21=\"A\",-AA27,IF(AA27=\"A\",AA21,AA21-AA27)),0)),0)","v":0},{"$f":"IF(AE24=AQ24,IF(AND(AG12=\"A\",AG24=\"A\"),0,IF(OR(AT24>0,AA27=\"A\"),IF(AG24=\"A\",-AG12,IF(AG12=\"A\",AG24,AG24-AG12)),0)),0)","v":0},0,null,{"$f":"#REF!","v":{"$error":"#REF!"}},{"$f":"#REF!","v":{"$error":"#REF!"}},null,{"$f":"IF(#REF!=0,\"\",#REF!)","v":{"$error":"#REF!"}},{"$error":"#REF!"},{"$error":"#REF!"},{"$error":"#REF!"}]
[null,null,"TSB (10)",{"$f":"TSB_2","v":"POTIQUET SEBASTIEN "},0,null,null,null,null,null,"TSA (7)",{"$f":"TSA_7","v":"CHIEZE MIREILLE "},0,null,null,null,null,null,null,null,"GA","CF","RF",null,null,null,null,null,null,null,null,null,null,null,null,null,null,null,null,null,null,null,{"$f":"L22","v":"URAY JIMMY "},{"$f":"IF(AND(N22=\"A\",N23=\"A\"),0,IF(N22=\"A\",-N23,IF(N23=\"A\",N22,N22-N23)))","v":0},{"$f":"IF(S22=AQ25,IF(AND(U20=\"A\",U22=\"A\"),0,IF(OR(AR25>0,N23=\"A\"),IF(U22=\"A\",-U20,IF(U20=\"A\",U22,U22-U20)),0)),0)","v":0},{"$f":"IF(Y21=AQ25,IF(AND(AA21=\"A\",AA27=\"A\"),0,IF(OR(AS25>0,U20=\"A\"),IF(AA21=\"A\",-AA27,IF(AA27=\"A\",AA21,AA21-AA27)),0)),0)","v":0},{"$f":"IF(AE24=AQ25,IF(AND(AG12=\"A\",AG24=\"A\"),0,IF(OR(AT25>0,AA27=\"A\"),IF(AG24=\"A\",-AG12,IF(AG12=\"A\",AG24,AG24-AG12)),0)),0)","v":0},0,null,{"$f":"#REF!","v":{"$error":"#REF!"}},{"$f":"#REF!","v":{"$error":"#REF!"}},null,{"$f":"IF(#REF!=0,\"\",#REF!)","v":{"$error":"#REF!"}},{"$error":"#REF!"},{"$error":"#REF!"},{"$error":"#REF!"}]
[null,null,"G",{"$f":"P3_2","v":""},{"$f":"P3_2G","v":""},null,null,null,null,null,null,{"$f":"IF(OR(AND(F25=\"F\",F26=\"F\"),AND(F25=\"A\",F26=\"A\")),D25,IF(OR(F25=\"F\",F25=\"A\"),D26,IF(OR(F26=\"F\",F26=\"A\"),D25,IF(F25=F26,\"\",(IF(F25>F26,D25,D26))))))","v":""},{"$f":"IF(OR(AND(F25=\"F\",F26=\"F\"),AND(F25=\"A\",F26=\"A\")),E25,IF(OR(F25=\"F\",F25=\"A\"),E26,IF(OR(F26=\"F\",F26=\"A\"),E25,IF(F25=F26,\"\",(IF(F25>F26,F25-F26,F26-F25+E26))))))","v":""},null,null,null,null,null,{"$f":"IF(AND(N25=\"A\",N26=\"A\"),L25,IF(N25=\"A\",L26,IF(N26=\"A\",L25,IF(N25=N26,\"\",(IF(N25>N26,L25,L26))))))","v":""},{"$f":"IF(OR(AND(N25=\"F\",N26=\"F\"),AND(N25=\"A\",N26=\"A\")),M26,IF(OR(N25=\"F\",N25=\"A\"),M26,IF(OR(N26=\"F\",N26=\"A\"),M25,IF(N25=N26,\"\",(IF(N25>N26,N25-M26,N26-N25+M26))))))","v":""},null,null,null,null,null,null,null,null,null,null,null,null,null,null,null,null,null,null,null,null,null,null,{"$f":"L23","v":""},{"$f":"IF(AND(N22=\"A\",N23=\"A\"),0,IF(N23=\"A\",-N22,IF(N22=\"A\",N23,N23-N22)))","v":0},{"$f":"IF(S22=AQ26,IF(AND(U20=\"A\",U22=\"A\"),0,IF(OR(AR26>0,N22=\"A\"),IF(U22=\"A\",-U20,IF(U20=\"A\",U22,U22-U20)),0)),0)","v":0},{"$f":"IF(Y21=AQ26,IF(AND(AA21=\"A\",AA27=\"A\"),0,IF(OR(AS26>0,U20=\"A\"),IF(AA21=\"A\",-AA27,IF(AA27=\"A\",AA21,AA21-AA27)),0)),0)","v":0},{"$f":"IF(AE24=AQ26,IF(AND(AG12=\"A\",AG24=\"A\"),0,IF(OR(AT26>0,AA27=\"A\"),IF(AG24=\"A\",-AG12,IF(AG12=\"A\",AG24,AG24-AG12)),0)),0)","v":0},0,null,{"$f":"#REF!","v":{"$error":"#REF!"}},{"$f":"#REF!","v":{"$error":"#REF!"}},null,{"$f":"IF(#REF!=0,\"\",#REF!)","v":{"$error":"#REF!"}},{"$error":"#REF!"},{"$error":"#REF!"},{"$error":"#REF!"}]
[null,null,null,null,null,null,null,null,null,null,null,null,null,null,null,null,null,null,"Billard N°",null,null,null,null,null,{"$f":"IF(AND(U26=\"A\",U28=\"A\"),S26,IF(U26=\"A\",S28,IF(U28=\"A\",S26,IF(U26=U28,\"\",(IF(U26>U28,S26,S28))))))","v":""},{"$f":"IF(OR(AND(U26=\"F\",U28=\"F\"),AND(U26=\"A\",U28=\"A\")),T28,IF(OR(U26=\"F\",U26=\"A\"),T28,IF(OR(U28=\"F\",U28=\"A\"),T26,IF(U26=U28,\"\",(IF(U26>U28,U26-U28,U28-U26+T28))))))","v":""},null,null,null,null,null,null,null,null,null,null,null,null,null,null,null,null,{"$f":"L25","v":"CHIEZE MIREILLE "},{"$f":"IF(AND(N25=\"A\",N26=\"A\"),0,IF(N25=\"A\",-N26,IF(N26=\"A\",N25,N25-N26)))","v":0},{"$f":"IF(S26=AQ27,IF(AND(U26=\"A\",U28=\"A\"),0,IF(OR(AR27>0,N26=\"A\"),IF(U26=\"A\",-U28,IF(U28=\"A\",U26,U26-U28)),0)),0)","v":0},{"$f":"IF(Y27=AQ27,IF(AND(AA21=\"A\",AA27=\"A\"),0,IF(OR(AS27>0,U28=\"A\"),IF(AA27=\"A\",-AA21,IF(AA21=\"A\",AA27,AA27-AA21)),0)),0)","v":0},{"$f":"IF(AE24=AQ27,IF(AND(AG12=\"A\",AG24=\"A\"),0,IF(OR(AT27>0,AA21=\"A\"),IF(AG24=\"A\",-AG12,IF(AG12=\"A\",AG24,AG24-AG12)),0)),0)","v":0},0,null,{"$f":"#REF!","v":{"$error":"#REF!"}},{"$f":"#REF!","v":{"$error":"#REF!"}},null,{"$f":"IF(#REF!=0,\"\",#REF!)","v":{"$error":"#REF!"}},{"$error":"#REF!"},{"$error":"#REF!"},{"$error":"#REF!"}]
[null,null,"TSB (15)",{"$f":"TSB_7","v":"LE GOFF THIERRY "},0,null,null,null,null,null,"TSA (2)",{"$f":"TSA_2","v":"DUDIT FABIEN "},0,null,null,null,null,null,{"$f":"IF(N28=\"A\",L29,IF(N29=\"A\",L28,IF(N28=N29,\"\",(IF(N28>N29,L28,L29)))))","v":""},{"$f":"IF(OR(AND(N28=\"F\",N29=\"F\"),AND(N28=\"A\",N29=\"A\")),M29,IF(OR(N28=\"F\",N28=\"A\"),M29,IF(OR(N29=\"F\",N29=\"A\"),M28,IF(N28=N29,\"\",(IF(N28>N29,N28-M29,N29-N29+M28))))))","v":""},null,null,null,null,null,null,null,null,null,null,null,null,null,null,null,null,null,null,null,null,null,null,{"$f":"L26","v":""},{"$f":"IF(AND(N25=\"A\",N26=\"A\"),0,IF(N26=\"A\",-N25,IF(N25=\"A\",N26,N26-N25)))","v":0},{"$f":"IF(S26=AQ28,IF(AND(U26=\"A\",U28=\"A\"),0,IF(OR(AR28>0,N25=\"A\"),IF(U26=\"A\",-U28,IF(U28=\"A\",U26,U26-U28)),0)),0)","v":0},{"$f":"IF(Y27=AQ28,IF(AND(AA21=\"A\",AA27=\"A\"),0,IF(OR(AS28>0,U28=\"A\"),IF(AA27=\"A\",-AA21,IF(AA21=\"A\",AA27,AA27-AA21)),0)),0)","v":0},{"$f":"IF(AE24=AQ28,IF(AND(AG12=\"A\",AG24=\"A\"),0,IF(OR(AT28>0,AA21=\"A\"),IF(AG24=\"A\",-AG12,IF(AG12=\"A\",AG24,AG24-AG12)),0)),0)","v":0},0,null,{"$f":"#REF!","v":{"$error":"#REF!"}},{"$f":"#REF!","v":{"$error":"#REF!"}},null,{"$f":"IF(#REF!=0,\"\",#REF!)","v":{"$error":"#REF!"}},{"$error":"#REF!"},{"$error":"#REF!"},{"$error":"#REF!"}]
[null,null,"B",{"$f":"P2_1","v":""},{"$f":"P2_1G","v":""},null,null,null,null,null,null,{"$f":"IF(OR(AND(F28=\"F\",F29=\"F\"),AND(F28=\"A\",F29=\"A\")),D28,IF(OR(F28=\"F\",F28=\"A\"),D29,IF(OR(F29=\"F\",F29=\"A\"),D28,IF(F28=F29,\"\",(IF(F28>F29,D28,D29))))))","v":""},{"$f":"IF(OR(AND(F28=\"F\",F29=\"F\"),AND(F28=\"A\",F29=\"A\")),E28,IF(OR(F28=\"F\",F28=\"A\"),E29,IF(OR(F29=\"F\",F29=\"A\"),E28,IF(F28=F29,\"\",(IF(F28>F29,F28-F29,F29-F28+E29))))))","v":""},null,null,null,null,null,null,null,null,null,null,null,null,null,null,null,null,null,null,null,null,null,null,null,null,null,null,null,null,null,{"$f":"L28","v":"DUDIT FABIEN "},{"$f":"IF(AND(N28=\"A\",N29=\"A\"),0,IF(N28=\"A\",-N29,IF(N29=\"A\",N28,N28-N29)))","v":0},{"$f":"IF(S28=AQ29,IF(AND(U26=\"A\",U28=\"A\"),0,IF(OR(AR29>0,N29=\"A\"),IF(U28=\"A\",-U26,IF(U26=\"A\",U28,U28-U26)),0)),0)","v":0},{"$f":"IF(Y27=AQ29,IF(AND(AA21=\"A\",AA27=\"A\"),0,IF(OR(AS29>0,U26=\"A\"),IF(AA27=\"A\",-AA21,IF(AA21=\"A\",AA27,AA27-AA21)),0)),0)","v":0},{"$f":"IF(AE24=AQ29,IF(AND(AG12=\"A\",AG24=\"A\"),0,IF(OR(AT29>0,AA21=\"A\"),IF(AG24=\"A\",-AG12,IF(AG12=\"A\",AG24,AG24-AG12)),0)),0)","v":0},0,null,{"$f":"#REF!","v":{"$error":"#REF!"}},{"$f":"#REF!","v":{"$error":"#REF!"}},null,{"$f":"IF(#REF!=0,\"\",#REF!)","v":{"$error":"#REF!"}},{"$error":"#REF!"},{"$error":"#REF!"},{"$error":"#REF!"}]
[null,null,null,null,null,null,null,null,null,null,null,null,null,null,null,null,null,null,null,null,null,null,null,null,null,null,null,null,null,181,null,null,null,null,null,null,null,null,null,null,null,null,{"$f":"L29","v":""},{"$f":"IF(AND(N28=\"A\",N29=\"A\"),0,IF(N29=\"A\",-N28,IF(N28=\"A\",N29,N29-N28)))","v":0},{"$f":"IF(S28=AQ30,IF(AND(U26=\"A\",U28=\"A\"),0,IF(OR(AR30>0,N28=\"A\"),IF(U28=\"A\",-U26,IF(U26=\"A\",U28,U28-U26)),0)),0)","v":0},{"$f":"IF(Y27=AQ30,IF(AND(AA21=\"A\",AA27=\"A\"),0,IF(OR(AS30>0,U26=\"A\"),IF(AA27=\"A\",-AA21,IF(AA21=\"A\",AA27,AA27-AA21)),0)),0)","v":0},{"$f":"IF(AE24=AQ30,IF(AND(AG12=\"A\",AG24=\"A\"),0,IF(OR(AT30>0,AA21=\"A\"),IF(AG24=\"A\",-AG12,IF(AG12=\"A\",AG24,AG24-AG12)),0)),0)","v":0},0,null,{"$f":"#REF!","v":{"$error":"#REF!"}},{"$f":"#REF!","v":{"$error":"#REF!"}},null,{"$f":"IF(#REF!=0,\"\",#REF!)","v":{"$error":"#REF!"}},{"$error":"#REF!"},{"$error":"#REF!"},{"$error":"#REF!"}]
[null,null,118,null,null,null,null,null,null,null,126,null,null,null,null,null,143,null,null,null,null,null,null,161,null,null,null,null,null,180,null,null,null,null,null,200,null,null,null,null,null,null,{"$f":"#REF!","v":{"$error":"#REF!"}},null,null,null,null,0,null,{"$f":"#REF!","v":{"$error":"#REF!"}},{"$f":"#REF!","v":{"$error":"#REF!"}},null,{"$f":"IF(#REF!=0,\"\",#REF!)","v":{"$error":"#REF!"}},{"$error":"#REF!"},{"$error":"#REF!"},{"$error":"#REF!"}]
[null,null,null,null,null,null,null,null,",",null,null,null,null,null,null,null,null,null,null,null,null,null,null,null,null,null,null,null,null,null,null,null,null,null,null,null,null,null,null,null,null,null,{"$f":"#REF!","v":{"$error":"#REF!"}},null,null,null,null,0,null,{"$f":"#REF!","v":{"$error":"#REF!"}},{"$f":"#REF!","v":{"$error":"#REF!"}},null,{"$f":"IF(#REF!=0,\"\",#REF!)","v":{"$error":"#REF!"}},{"$error":"#REF!"},{"$error":"#REF!"},{"$error":"#REF!"}]
[null,null,null,null,null,null,null,null,null,null,null,null,null,null,null,null,null,null,null,null,null,null,null,null,null,null,null,null,null,null,null,null,null,null,null,null,null,null,null,null,null,null,{"$f":"#REF!","v":{"$error":"#REF!"}},null,null,null,null,0,null,{"$f":"#REF!","v":{"$error":"#REF!"}},{"$f":"#REF!","v":{"$error":"#REF!"}},null,{"$f":"IF(#REF!=0,\"\",#REF!)","v":{"$error":"#REF!"}},{"$error":"#REF!"},{"$error":"#REF!"},{"$error":"#REF!"}]
[null,null,null,null,null,null,null,null,null,null,null,null,null,null,null,null,null,null,null,null,null,null,null,null,null,null,null,null,null,null,null,null,null,null,null,null,null,null,null,null,null,null,{"$f":"#REF!","v":{"$error":"#REF!"}},null,null,null,null,0,null,{"$f":"#REF!","v":{"$error":"#REF!"}},{"$f":"#REF!","v":{"$error":"#REF!"}},null,{"$f":"IF(#REF!=0,\"\",#REF!)","v":{"$error":"#REF!"}},{"$error":"#REF!"},{"$error":"#REF!"},{"$error":"#REF!"}]
[null,null,null,null,null,null,null,null,null,null,null,null,null,null,null,null,null,null,null,null,null,null,null,null,null,null,null,null,null,null,null,null,null,null,null,null,null,null,null,null,null,null,{"$f":"#REF!","v":{"$error":"#REF!"}},null,null,null,null,0,null,{"$f":"#REF!","v":{"$error":"#REF!"}},{"$f":"#REF!","v":{"$error":"#REF!"}},null,{"$f":"IF(#REF!=0,\"\",#REF!)","v":{"$error":"#REF!"}},{"$error":"#REF!"},{"$error":"#REF!"},{"$error":"#REF!"}]
[null,null,null,null,null,null,null,null,null,null,null,null,null,null,null,null,null,null,null,null,null,null,null,null,null,null,null,null,null,null,null,null,null,null,null,null,null,null,null,null,null,null,{"$f":"#REF!","v":{"$error":"#REF!"}},null,null,null,null,0,null,{"$f":"#REF!","v":{"$error":"#REF!"}},{"$f":"#REF!","v":{"$error":"#REF!"}},null,{"$f":"IF(#REF!=0,\"\",#REF!)","v":{"$error":"#REF!"}},{"$error":"#REF!"},{"$error":"#REF!"},{"$error":"#REF!"}]
[null,null,null,null,null,null,null,null,null,null,null,null,null,null,null,null,null,null,null,null,null,null,null,null,null,null,null,null,null,null,null,null,null,null,null,null,null,null,null,null,null,null,{"$f":"#REF!","v":{"$error":"#REF!"}},null,null,null,null,0,null,{"$f":"#REF!","v":{"$error":"#REF!"}},{"$f":"#REF!","v":{"$error":"#REF!"}},null,{"$f":"IF(#REF!=0,\"\",#REF!)","v":{"$error":"#REF!"}},{"$error":"#REF!"},{"$error":"#REF!"},{"$error":"#REF!"}]
[null,null,null,null,null,null,null,null,null,null,null,null,null,null,null,null,null,null,null,null,null,null,null,null,null,null,null,null,null,null,null,null,null,null,null,null,null,null,null,null,null,null,{"$f":"#REF!","v":{"$error":"#REF!"}},null,null,null,null,0,null,{"$f":"#REF!","v":{"$error":"#REF!"}},{"$f":"#REF!","v":{"$error":"#REF!"}},null,{"$f":"IF(#REF!=0,\"\",#REF!)","v":{"$error":"#REF!"}},{"$error":"#REF!"},{"$error":"#REF!"},{"$error":"#REF!"}]
[null,null,null,null,null,null,null,null,null,null,null,null,null,null,null,null,null,null,null,null,null,null,null,null,null,null,null,null,null,null,null,null,null,null,null,null,null,null,null,null,null,null,{"$f":"#REF!","v":{"$error":"#REF!"}},null,null,null,null,0,null,{"$f":"#REF!","v":{"$error":"#REF!"}},{"$f":"#REF!","v":{"$error":"#REF!"}},null,{"$f":"IF(#REF!=0,\"\",#REF!)","v":{"$error":"#REF!"}},{"$error":"#REF!"},{"$error":"#REF!"},{"$error":"#REF!"}]
[null,null,"TSB (13)",{"$f":"TSB_5","v":"KLEIN STEPHANE "},0,null,null,null,4,null,null,null,null,null,null,null,null,null,null,null,null,null,null,null,null,null,null,null,null,null,null,null,null,null,null,null,null,null,null,null,null,null,{"$f":"#REF!","v":{"$error":"#REF!"}},null,null,null,null,0,null,{"$f":"#REF!","v":{"$error":"#REF!"}},{"$f":"#REF!","v":{"$error":"#REF!"}},null,{"$f":"IF(#REF!=0,\"\",#REF!)","v":{"$error":"#REF!"}},{"$error":"#REF!"},{"$error":"#REF!"},{"$error":"#REF!"}]
[null,null,"D",{"$f":"P4_1","v":""},{"$f":"P4_1G","v":""},null,null,null,null,null,null,null,null,null,null,null,null,null,null,null,null,null,null,null,null,null,null,null,null,null,null,null,null,null,null,null,null,null,null,null,null,null,{"$f":"#REF!","v":{"$error":"#REF!"}},null,null,null,null,0,null,{"$f":"#REF!","v":{"$error":"#REF!"}},{"$f":"#REF!","v":{"$error":"#REF!"}},null,{"$f":"IF(#REF!=0,\"\",#REF!)","v":{"$error":"#REF!"}},{"$error":"#REF!"},{"$error":"#REF!"},{"$error":"#REF!"}]
[null,null,null,null,null,null,null,null,null,null,null,null,null,null,null,null,null,null,null,null,null,null,null,null,null,null,null,null,null,null,null,null,null,null,null,null,null,null,null,null,null,null,{"$f":"#REF!","v":{"$error":"#REF!"}},null,null,null,null,0,null,{"$f":"#REF!","v":{"$error":"#REF!"}},{"$f":"#REF!","v":{"$error":"#REF!"}},null,{"$f":"IF(#REF!=0,\"\",#REF!)","v":{"$error":"#REF!"}},{"$error":"#REF!"},{"$error":"#REF!"},{"$error":"#REF!"}]
[null,null,null,null,null,null,null,null,null,null,null,null,null,null,null,null,null,null,null,null,null,null,null,null,null,null,null,null,null,null,null,null,null,null,null,null,null,null,null,null,null,null,{"$f":"#REF!","v":{"$error":"#REF!"}},null,null,null,null,0,null,{"$f":"#REF!","v":{"$error":"#REF!"}},{"$f":"#REF!","v":{"$error":"#REF!"}},null,{"$f":"IF(#REF!=0,\"\",#REF!)","v":{"$error":"#REF!"}},{"$error":"#REF!"},{"$error":"#REF!"},{"$error":"#REF!"}]
[null,null,null,null,null,null,null,null,null,null,null,null,null,null,null,null,null,null,null,null,null,null,null,null,null,null,null,null,null,null,null,null,null,null,null,null,null,null,null,null,null,null,{"$f":"#REF!","v":{"$error":"#REF!"}},null,null,null,null,0,null,{"$f":"#REF!","v":{"$error":"#REF!"}},{"$f":"#REF!","v":{"$error":"#REF!"}},null,{"$f":"IF(#REF!=0,\"\",#REF!)","v":{"$error":"#REF!"}},{"$error":"#REF!"},{"$error":"#REF!"},{"$error":"#REF!"}]
[null,null,null,null,null,null,null,null,null,null,null,null,null,null,null,null,null,null,null,null,null,null,null,null,null,null,null,null,null,null,null,null,null,null,null,null,null,null,null,null,null,null,{"$f":"#REF!","v":{"$error":"#REF!"}},null,null,null,null,0,null,{"$f":"#REF!","v":{"$error":"#REF!"}},{"$f":"#REF!","v":{"$error":"#REF!"}},null,{"$f":"IF(#REF!=0,\"\",#REF!)","v":{"$error":"#REF!"}},{"$error":"#REF!"},{"$error":"#REF!"},{"$error":"#REF!"}]
[null,null,null,null,null,null,null,null,null,null,null,null,null,null,null,null,null,null,null,null,null,null,null,null,null,null,null,null,null,null,null,null,null,null,null,null,null,null,null,null,null,null,{"$f":"#REF!","v":{"$error":"#REF!"}},null,null,null,null,0,null,{"$f":"#REF!","v":{"$error":"#REF!"}},{"$f":"#REF!","v":{"$error":"#REF!"}},null,{"$f":"IF(#REF!=0,\"\",#REF!)","v":{"$error":"#REF!"}},{"$error":"#REF!"},{"$error":"#REF!"},{"$error":"#REF!"}]

{"sheet":"Classement","index":9,"n_rows":70,"n_cols":13,"rows_kept":70,"cut":false,"hidden":false,"merged":[]}
[null,null,"Formules Initiales","Nom & Prénom","Place","Points","GA","CF","RF","Club","Ville","Licence","Division"]
[null,null,1,{"$f":"Final!AK18","v":""},1,200,null,null,null,{"$f":"IF(ISNA(VLOOKUP(D2,'Listing joueurs'!C:E,2,FALSE)),\"\",VLOOKUP(D2,'Listing joueurs'!D:E,2,FALSE))","v":""},{"$f":"IF(ISNA(VLOOKUP(D2,#REF!,3,FALSE)),\"\",VLOOKUP(D2,#REF!,3,FALSE))","v":{"$error":"#REF!"}},{"$f":"IF(ISNA(VLOOKUP(D2,#REF!,4,FALSE)),\"\",VLOOKUP(D2,#REF!,4,FALSE))","v":{"$error":"#REF!"}},{"$f":"IF(NB_JOUEURS_UP>0,IF(LEN(Division)=2,\"R\"&RIGHT(Division,1)-1&\"\",IF(LEN(Division)=3,IF(RIGHT(LEFT(Division,2),1)=\"2\",\"R1\",IF(Nb_R2=1,\"R2\",\"R\"&RIGHT(LEFT(Division,2),1)-1&\"\"&RIGHT(Division,1)&\"\")),IF(LEN(Division)=4,IF(RIGHT(LEFT(Division,2),1)=\"2\",\"R1\",\"R\"&RIGHT(LEFT(Division,2),1)-1&\"\"&RIGHT(LEFT(Division,3),1)&\"\"),\"?\"))),Division)","v":{"$error":"#REF!"}}]
[null,null,2,{"$f":"IF(Final!AG12>Final!AG24,Final!AE24,Final!AE12)","v":""},2,180,null,null,null,{"$f":"IF(ISNA(VLOOKUP(D3,#REF!,2,FALSE)),\"\",VLOOKUP(D3,#REF!,2,FALSE))","v":{"$error":"#REF!"}},{"$f":"IF(ISNA(VLOOKUP(D3,#REF!,3,FALSE)),\"\",VLOOKUP(D3,#REF!,3,FALSE))","v":{"$error":"#REF!"}},{"$f":"IF(ISNA(VLOOKUP(D3,#REF!,4,FALSE)),\"\",VLOOKUP(D3,#REF!,4,FALSE))","v":{"$error":"#REF!"}},{"$f":"IF(NB_JOUEURS_UP>1,IF(LEN(Division)=2,\"R\"&RIGHT(Division,1)-1&\"\",IF(LEN(Division)=3,IF(RIGHT(LEFT(Division,2),1)=\"2\",\"R1\",IF(Nb_R2=1,\"R2\",\"R\"&RIGHT(LEFT(Division,2),1)-1&\"\"&RIGHT(Division,1)&\"\")),IF(LEN(Division)=4,IF(RIGHT(LEFT(Division,2),1)=\"2\",\"R1\",\"R\"&RIGHT(LEFT(Division,2),1)-1&\"\"&RIGHT(LEFT(Division,3),1)&\"\"),\"?\"))),Division)","v":{"$error":"#REF!"}}]
[null,null,3,null,3,161,null,null,null,{"$f":"IF(ISNA(VLOOKUP(D4,#REF!,2,FALSE)),\"\",VLOOKUP(D4,#REF!,2,FALSE))","v":{"$error":"#REF!"}},{"$f":"IF(ISNA(VLOOKUP(D4,#REF!,3,FALSE)),\"\",VLOOKUP(D4,#REF!,3,FALSE))","v":{"$error":"#REF!"}},{"$f":"IF(ISNA(VLOOKUP(D4,#REF!,4,FALSE)),\"\",VLOOKUP(D4,#REF!,4,FALSE))","v":{"$error":"#REF!"}},{"$f":"IF(NB_JOUEURS_UP>2,IF(LEN(Division)=2,\"R\"&RIGHT(Division,1)-1&\"\",IF(LEN(Division)=3,IF(RIGHT(LEFT(Division,2),1)=\"2\",\"R1\",IF(Nb_R2=1,\"R2\",\"R\"&RIGHT(LEFT(Division,2),1)-1&\"\"&RIGHT(Division,1)&\"\")),IF(LEN(Division)=4,IF(RIGHT(LEFT(Division,2),1)=\"2\",\"R1\",\"R\"&RIGHT(LEFT(Division,2),1)-1&\"\"&RIGHT(LEFT(Division,3),1)&\"\"),\"?\"))),Division)","v":{"$error":"#REF!"}}]
[null,null,4,null,4,161,null,null,null,{"$f":"IF(ISNA(VLOOKUP(D5,#REF!,2,FALSE)),\"\",VLOOKUP(D5,#REF!,2,FALSE))","v":{"$error":"#REF!"}},{"$f":"IF(ISNA(VLOOKUP(D5,#REF!,3,FALSE)),\"\",VLOOKUP(D5,#REF!,3,FALSE))","v":{"$error":"#REF!"}},{"$f":"IF(ISNA(VLOOKUP(D5,#REF!,4,FALSE)),\"\",VLOOKUP(D5,#REF!,4,FALSE))","v":{"$error":"#REF!"}},{"$f":"IF(NB_JOUEURS_UP>3,IF(LEN(Division)=2,\"R\"&RIGHT(Division,1)-1&\"\",IF(LEN(Division)=3,IF(RIGHT(LEFT(Division,2),1)=\"2\",\"R1\",IF(Nb_R2=1,\"R2\",\"R\"&RIGHT(LEFT(Division,2),1)-1&\"\"&RIGHT(Division,1)&\"\")),IF(LEN(Division)=4,IF(RIGHT(LEFT(Division,2),1)=\"2\",\"R1\",\"R\"&RIGHT(LEFT(Division,2),1)-1&\"\"&RIGHT(LEFT(Division,3),1)&\"\"),\"?\"))),Division)","v":{"$error":"#REF!"}}]
[null,null,5,null,5,143,null,null,null,{"$f":"IF(ISNA(VLOOKUP(D6,#REF!,2,FALSE)),\"\",VLOOKUP(D6,#REF!,2,FALSE))","v":{"$error":"#REF!"}},{"$f":"IF(ISNA(VLOOKUP(D6,#REF!,3,FALSE)),\"\",VLOOKUP(D6,#REF!,3,FALSE))","v":{"$error":"#REF!"}},{"$f":"IF(ISNA(VLOOKUP(D6,#REF!,4,FALSE)),\"\",VLOOKUP(D6,#REF!,4,FALSE))","v":{"$error":"#REF!"}},{"$f":"IF(NB_JOUEURS_UP>4,IF(LEN(Division)=2,\"R\"&RIGHT(Division,1)-1&\"\",IF(LEN(Division)=3,IF(RIGHT(LEFT(Division,2),1)=\"2\",\"R1\",IF(Nb_R2=1,\"R2\",\"R\"&RIGHT(LEFT(Division,2),1)-1&\"\"&RIGHT(Division,1)&\"\")),IF(LEN(Division)=4,IF(RIGHT(LEFT(Division,2),1)=\"2\",\"R1\",\"R\"&RIGHT(LEFT(Division,2),1)-1&\"\"&RIGHT(LEFT(Division,3),1)&\"\"),\"?\"))),Division)","v":{"$error":"#REF!"}}]
[null,null,6,null,6,143,null,null,null,{"$f":"IF(ISNA(VLOOKUP(D7,#REF!,2,FALSE)),\"\",VLOOKUP(D7,#REF!,2,FALSE))","v":{"$error":"#REF!"}},{"$f":"IF(ISNA(VLOOKUP(D7,#REF!,3,FALSE)),\"\",VLOOKUP(D7,#REF!,3,FALSE))","v":{"$error":"#REF!"}},{"$f":"IF(ISNA(VLOOKUP(D7,#REF!,4,FALSE)),\"\",VLOOKUP(D7,#REF!,4,FALSE))","v":{"$error":"#REF!"}},{"$f":"IF(NB_JOUEURS_UP>5,IF(LEN(Division)=2,\"R\"&RIGHT(Division,1)-1&\"\",IF(LEN(Division)=3,IF(RIGHT(LEFT(Division,2),1)=\"2\",\"R1\",IF(Nb_R2=1,\"R2\",\"R\"&RIGHT(LEFT(Division,2),1)-1&\"\"&RIGHT(Division,1)&\"\")),IF(LEN(Division)=4,IF(RIGHT(LEFT(Division,2),1)=\"2\",\"R1\",\"R\"&RIGHT(LEFT(Division,2),1)-1&\"\"&RIGHT(LEFT(Division,3),1)&\"\"),\"?\"))),Division)","v":{"$error":"#REF!"}}]
[null,null,7,null,7,143,null,null,null,{"$f":"IF(ISNA(VLOOKUP(D8,#REF!,2,FALSE)),\"\",VLOOKUP(D8,#REF!,2,FALSE))","v":{"$error":"#REF!"}},{"$f":"IF(ISNA(VLOOKUP(D8,#REF!,3,FALSE)),\"\",VLOOKUP(D8,#REF!,3,FALSE))","v":{"$error":"#REF!"}},{"$f":"IF(ISNA(VLOOKUP(D8,#REF!,4,FALSE)),\"\",VLOOKUP(D8,#REF!,4,FALSE))","v":{"$error":"#REF!"}},{"$f":"IF(NB_JOUEURS_UP>6,IF(LEN(Division)=2,\"R\"&RIGHT(Division,1)-1&\"\",IF(LEN(Division)=3,IF(RIGHT(LEFT(Division,2),1)=\"2\",\"R1\",IF(Nb_R2=1,\"R2\",\"R\"&RIGHT(LEFT(Division,2),1)-1&\"\"&RIGHT(Division,1)&\"\")),IF(LEN(Division)=4,IF(RIGHT(LEFT(Division,2),1)=\"2\",\"R1\",\"R\"&RIGHT(LEFT(Division,2),1)-1&\"\"&RIGHT(LEFT(Division,3),1)&\"\"),\"?\"))),Division)","v":{"$error":"#REF!"}}]
[null,null,8,null,8,143,null,null,null,{"$f":"IF(ISNA(VLOOKUP(D9,#REF!,2,FALSE)),\"\",VLOOKUP(D9,#REF!,2,FALSE))","v":{"$error":"#REF!"}},{"$f":"IF(ISNA(VLOOKUP(D9,#REF!,3,FALSE)),\"\",VLOOKUP(D9,#REF!,3,FALSE))","v":{"$error":"#REF!"}},{"$f":"IF(ISNA(VLOOKUP(D9,#REF!,4,FALSE)),\"\",VLOOKUP(D9,#REF!,4,FALSE))","v":{"$error":"#REF!"}},{"$f":"IF(NB_JOUEURS_UP>7,IF(LEN(Division)=2,\"R\"&RIGHT(Division,1)-1&\"\",IF(LEN(Division)=3,IF(RIGHT(LEFT(Division,2),1)=\"2\",\"R1\",IF(Nb_R2=1,\"R2\",\"R\"&RIGHT(LEFT(Division,2),1)-1&\"\"&RIGHT(Division,1)&\"\")),IF(LEN(Division)=4,IF(RIGHT(LEFT(Division,2),1)=\"2\",\"R1\",\"R\"&RIGHT(LEFT(Division,2),1)-1&\"\"&RIGHT(LEFT(Division,3),1)&\"\"),\"?\"))),Division)","v":{"$error":"#REF!"}}]
[null,null,11,null,9,126,null,null,null,{"$f":"IF(ISNA(VLOOKUP(D10,#REF!,2,FALSE)),\"\",VLOOKUP(D10,#REF!,2,FALSE))","v":{"$error":"#REF!"}},{"$f":"IF(ISNA(VLOOKUP(D10,#REF!,3,FALSE)),\"\",VLOOKUP(D10,#REF!,3,FALSE))","v":{"$error":"#REF!"}},{"$f":"IF(ISNA(VLOOKUP(D10,#REF!,4,FALSE)),\"\",VLOOKUP(D10,#REF!,4,FALSE))","v":{"$error":"#REF!"}},{"$f":"Division","v":{"$error":"#REF!"}}]
[null,null,16,null,10,126,null,null,null,{"$f":"IF(ISNA(VLOOKUP(D11,#REF!,2,FALSE)),\"\",VLOOKUP(D11,#REF!,2,FALSE))","v":{"$error":"#REF!"}},{"$f":"IF(ISNA(VLOOKUP(D11,#REF!,3,FALSE)),\"\",VLOOKUP(D11,#REF!,3,FALSE))","v":{"$error":"#REF!"}},{"$f":"IF(ISNA(VLOOKUP(D11,#REF!,4,FALSE)),\"\",VLOOKUP(D11,#REF!,4,FALSE))","v":{"$error":"#REF!"}},{"$error":"#REF!"}]
[null,null,9,null,11,126,null,null,null,{"$f":"IF(ISNA(VLOOKUP(D12,#REF!,2,FALSE)),\"\",VLOOKUP(D12,#REF!,2,FALSE))","v":{"$error":"#REF!"}},{"$f":"IF(ISNA(VLOOKUP(D12,#REF!,3,FALSE)),\"\",VLOOKUP(D12,#REF!,3,FALSE))","v":{"$error":"#REF!"}},{"$f":"IF(ISNA(VLOOKUP(D12,#REF!,4,FALSE)),\"\",VLOOKUP(D12,#REF!,4,FALSE))","v":{"$error":"#REF!"}},{"$error":"#REF!"}]
[null,null,12,null,12,126,null,null,null,{"$f":"IF(ISNA(VLOOKUP(D13,#REF!,2,FALSE)),\"\",VLOOKUP(D13,#REF!,2,FALSE))","v":{"$error":"#REF!"}},{"$f":"IF(ISNA(VLOOKUP(D13,#REF!,3,FALSE)),\"\",VLOOKUP(D13,#REF!,3,FALSE))","v":{"$error":"#REF!"}},{"$f":"IF(ISNA(VLOOKUP(D13,#REF!,4,FALSE)),\"\",VLOOKUP(D13,#REF!,4,FALSE))","v":{"$error":"#REF!"}},{"$error":"#REF!"}]
[null,null,14,null,13,126,null,null,null,{"$f":"IF(ISNA(VLOOKUP(D14,#REF!,2,FALSE)),\"\",VLOOKUP(D14,#REF!,2,FALSE))","v":{"$error":"#REF!"}},{"$f":"IF(ISNA(VLOOKUP(D14,#REF!,3,FALSE)),\"\",VLOOKUP(D14,#REF!,3,FALSE))","v":{"$error":"#REF!"}},{"$f":"IF(ISNA(VLOOKUP(D14,#REF!,4,FALSE)),\"\",VLOOKUP(D14,#REF!,4,FALSE))","v":{"$error":"#REF!"}},{"$error":"#REF!"}]
[null,null,15,null,14,126,null,null,null,{"$f":"IF(ISNA(VLOOKUP(D15,#REF!,2,FALSE)),\"\",VLOOKUP(D15,#REF!,2,FALSE))","v":{"$error":"#REF!"}},{"$f":"IF(ISNA(VLOOKUP(D15,#REF!,3,FALSE)),\"\",VLOOKUP(D15,#REF!,3,FALSE))","v":{"$error":"#REF!"}},{"$f":"IF(ISNA(VLOOKUP(D15,#REF!,4,FALSE)),\"\",VLOOKUP(D15,#REF!,4,FALSE))","v":{"$error":"#REF!"}},{"$error":"#REF!"}]
[null,null,13,null,15,126,null,null,null,{"$f":"IF(ISNA(VLOOKUP(D16,#REF!,2,FALSE)),\"\",VLOOKUP(D16,#REF!,2,FALSE))","v":{"$error":"#REF!"}},{"$f":"IF(ISNA(VLOOKUP(D16,#REF!,3,FALSE)),\"\",VLOOKUP(D16,#REF!,3,FALSE))","v":{"$error":"#REF!"}},{"$f":"IF(ISNA(VLOOKUP(D16,#REF!,4,FALSE)),\"\",VLOOKUP(D16,#REF!,4,FALSE))","v":{"$error":"#REF!"}},{"$error":"#REF!"}]
[null,null,10,null,16,126,null,null,null,{"$f":"IF(ISNA(VLOOKUP(D17,#REF!,2,FALSE)),\"\",VLOOKUP(D17,#REF!,2,FALSE))","v":{"$error":"#REF!"}},{"$f":"IF(ISNA(VLOOKUP(D17,#REF!,3,FALSE)),\"\",VLOOKUP(D17,#REF!,3,FALSE))","v":{"$error":"#REF!"}},{"$f":"IF(ISNA(VLOOKUP(D17,#REF!,4,FALSE)),\"\",VLOOKUP(D17,#REF!,4,FALSE))","v":{"$error":"#REF!"}},{"$error":"#REF!"}]
[null,null,18,null,17,118,null,null,null,{"$f":"IF(ISNA(VLOOKUP(D18,#REF!,2,FALSE)),\"\",VLOOKUP(D18,#REF!,2,FALSE))","v":{"$error":"#REF!"}},{"$f":"IF(ISNA(VLOOKUP(D18,#REF!,3,FALSE)),\"\",VLOOKUP(D18,#REF!,3,FALSE))","v":{"$error":"#REF!"}},{"$f":"IF(ISNA(VLOOKUP(D18,#REF!,4,FALSE)),\"\",VLOOKUP(D18,#REF!,4,FALSE))","v":{"$error":"#REF!"}},{"$error":"#REF!"}]
[null,null,27,null,18,118,null,null,null,{"$f":"IF(ISNA(VLOOKUP(D19,#REF!,2,FALSE)),\"\",VLOOKUP(D19,#REF!,2,FALSE))","v":{"$error":"#REF!"}},{"$f":"IF(ISNA(VLOOKUP(D19,#REF!,3,FALSE)),\"\",VLOOKUP(D19,#REF!,3,FALSE))","v":{"$error":"#REF!"}},{"$f":"IF(ISNA(VLOOKUP(D19,#REF!,4,FALSE)),\"\",VLOOKUP(D19,#REF!,4,FALSE))","v":{"$error":"#REF!"}},{"$f":"IF(NB_JOUEURS_DOWN>5,\"Relégué(e)\",Division)","v":"Relégué(e)"}]
[null,null,28,null,19,118,null,null,null,{"$f":"IF(ISNA(VLOOKUP(D20,#REF!,2,FALSE)),\"\",VLOOKUP(D20,#REF!,2,FALSE))","v":{"$error":"#REF!"}},{"$f":"IF(ISNA(VLOOKUP(D20,#REF!,3,FALSE)),\"\",VLOOKUP(D20,#REF!,3,FALSE))","v":{"$error":"#REF!"}},{"$f":"IF(ISNA(VLOOKUP(D20,#REF!,4,FALSE)),\"\",VLOOKUP(D20,#REF!,4,FALSE))","v":{"$error":"#REF!"}},{"$f":"IF(NB_JOUEURS_DOWN>4,\"Relégué(e)\",Division)","v":"Relégué(e)"}]
[null,null,22,null,20,118,null,null,null,{"$f":"IF(ISNA(VLOOKUP(D21,#REF!,2,FALSE)),\"\",VLOOKUP(D21,#REF!,2,FALSE))","v":{"$error":"#REF!"}},{"$f":"IF(ISNA(VLOOKUP(D21,#REF!,3,FALSE)),\"\",VLOOKUP(D21,#REF!,3,FALSE))","v":{"$error":"#REF!"}},{"$f":"IF(ISNA(VLOOKUP(D21,#REF!,4,FALSE)),\"\",VLOOKUP(D21,#REF!,4,FALSE))","v":{"$error":"#REF!"}},{"$f":"IF(NB_JOUEURS_DOWN>10,\"Relégué(e)\",Division)","v":{"$error":"#REF!"}}]
[null,null,32,null,21,118,null,null,null,{"$f":"IF(ISNA(VLOOKUP(D22,#REF!,2,FALSE)),\"\",VLOOKUP(D22,#REF!,2,FALSE))","v":{"$error":"#REF!"}},{"$f":"IF(ISNA(VLOOKUP(D22,#REF!,3,FALSE)),\"\",VLOOKUP(D22,#REF!,3,FALSE))","v":{"$error":"#REF!"}},{"$f":"IF(ISNA(VLOOKUP(D22,#REF!,4,FALSE)),\"\",VLOOKUP(D22,#REF!,4,FALSE))","v":{"$error":"#REF!"}},{"$f":"IF(NB_JOUEURS_DOWN>0,\"Relégué(e)\",Division)","v":"Relégué(e)"}]
[null,null,21,null,22,118,null,null,null,{"$f":"IF(ISNA(VLOOKUP(D23,#REF!,2,FALSE)),\"\",VLOOKUP(D23,#REF!,2,FALSE))","v":{"$error":"#REF!"}},{"$f":"IF(ISNA(VLOOKUP(D23,#REF!,3,FALSE)),\"\",VLOOKUP(D23,#REF!,3,FALSE))","v":{"$error":"#REF!"}},{"$f":"IF(ISNA(VLOOKUP(D23,#REF!,4,FALSE)),\"\",VLOOKUP(D23,#REF!,4,FALSE))","v":{"$error":"#REF!"}},{"$f":"Division","v":{"$error":"#REF!"}}]
[null,null,23,null,23,118,null,null,null,{"$f":"IF(ISNA(VLOOKUP(D24,#REF!,2,FALSE)),\"\",VLOOKUP(D24,#REF!,2,FALSE))","v":{"$error":"#REF!"}},{"$f":"IF(ISNA(VLOOKUP(D24,#REF!,3,FALSE)),\"\",VLOOKUP(D24,#REF!,3,FALSE))","v":{"$error":"#REF!"}},{"$f":"IF(ISNA(VLOOKUP(D24,#REF!,4,FALSE)),\"\",VLOOKUP(D24,#REF!,4,FALSE))","v":{"$error":"#REF!"}},{"$f":"IF(NB_JOUEURS_DOWN>9,\"Relégué(e)\",Division)","v":{"$error":"#REF!"}}]
[null,null,24,null,24,118,null,null,null,{"$f":"IF(ISNA(VLOOKUP(D25,#REF!,2,FALSE)),\"\",VLOOKUP(D25,#REF!,2,FALSE))","v":{"$error":"#REF!"}},{"$f":"IF(ISNA(VLOOKUP(D25,#REF!,3,FALSE)),\"\",VLOOKUP(D25,#REF!,3,FALSE))","v":{"$error":"#REF!"}},{"$f":"IF(ISNA(VLOOKUP(D25,#REF!,4,FALSE)),\"\",VLOOKUP(D25,#REF!,4,FALSE))","v":{"$error":"#REF!"}},{"$f":"IF(NB_JOUEURS_DOWN>8,\"Relégué(e)\",Division)","v":{"$error":"#REF!"}}]
[null,null,25,null,25,118,null,null,null,{"$f":"IF(ISNA(VLOOKUP(D28,#REF!,2,FALSE)),\"\",VLOOKUP(D28,#REF!,2,FALSE))","v":{"$error":"#REF!"}},{"$f":"IF(ISNA(VLOOKUP(D28,#REF!,3,FALSE)),\"\",VLOOKUP(D28,#REF!,3,FALSE))","v":{"$error":"#REF!"}},{"$f":"IF(ISNA(VLOOKUP(D26,#REF!,4,FALSE)),\"\",VLOOKUP(D26,#REF!,4,FALSE))","v":{"$error":"#REF!"}},{"$f":"IF(NB_JOUEURS_DOWN>7,\"Relégué(e)\",Division)","v":"Relégué(e)"}]
[null,null,20,null,26,118,null,null,null,{"$f":"IF(ISNA(VLOOKUP(D27,#REF!,2,FALSE)),\"\",VLOOKUP(D27,#REF!,2,FALSE))","v":{"$error":"#REF!"}},{"$f":"IF(ISNA(VLOOKUP(D27,#REF!,3,FALSE)),\"\",VLOOKUP(D27,#REF!,3,FALSE))","v":{"$error":"#REF!"}},{"$f":"IF(ISNA(VLOOKUP(D27,#REF!,4,FALSE)),\"\",VLOOKUP(D27,#REF!,4,FALSE))","v":{"$error":"#REF!"}},{"$f":"Division","v":{"$error":"#REF!"}}]
[null,null,26,null,27,118,null,null,null,{"$f":"IF(ISNA(VLOOKUP(D28,#REF!,2,FALSE)),\"\",VLOOKUP(D28,#REF!,2,FALSE))","v":{"$error":"#REF!"}},{"$f":"IF(ISNA(VLOOKUP(D28,#REF!,3,FALSE)),\"\",VLOOKUP(D28,#REF!,3,FALSE))","v":{"$error":"#REF!"}},{"$f":"IF(ISNA(VLOOKUP(D28,#REF!,4,FALSE)),\"\",VLOOKUP(D28,#REF!,4,FALSE))","v":{"$error":"#REF!"}},{"$f":"IF(NB_JOUEURS_DOWN>6,\"Relégué(e)\",Division)","v":"Relégué(e)"}]
[null,null,29,null,28,118,null,null,null,{"$f":"IF(ISNA(VLOOKUP(D29,#REF!,2,FALSE)),\"\",VLOOKUP(D29,#REF!,2,FALSE))","v":{"$error":"#REF!"}},{"$f":"IF(ISNA(VLOOKUP(D29,#REF!,3,FALSE)),\"\",VLOOKUP(D29,#REF!,3,FALSE))","v":{"$error":"#REF!"}},{"$f":"IF(ISNA(VLOOKUP(D29,#REF!,4,FALSE)),\"\",VLOOKUP(D29,#REF!,4,FALSE))","v":{"$error":"#REF!"}},{"$f":"IF(NB_JOUEURS_DOWN>3,\"Relégué(e)\",Division)","v":"Relégué(e)"}]
[null,null,30,null,29,118,null,null,null,{"$f":"IF(ISNA(VLOOKUP(D30,#REF!,2,FALSE)),\"\",VLOOKUP(D30,#REF!,2,FALSE))","v":{"$error":"#REF!"}},{"$f":"IF(ISNA(VLOOKUP(D30,#REF!,3,FALSE)),\"\",VLOOKUP(D30,#REF!,3,FALSE))","v":{"$error":"#REF!"}},{"$f":"IF(ISNA(VLOOKUP(D30,#REF!,4,FALSE)),\"\",VLOOKUP(D30,#REF!,4,FALSE))","v":{"$error":"#REF!"}},{"$f":"IF(NB_JOUEURS_DOWN>2,\"Relégué(e)\",Division)","v":"Relégué(e)"}]
[null,null,31,null,30,118,null,null,null,{"$f":"IF(ISNA(VLOOKUP(D31,#REF!,2,FALSE)),\"\",VLOOKUP(D31,#REF!,2,FALSE))","v":{"$error":"#REF!"}},{"$f":"IF(ISNA(VLOOKUP(D31,#REF!,3,FALSE)),\"\",VLOOKUP(D31,#REF!,3,FALSE))","v":{"$error":"#REF!"}},{"$f":"IF(ISNA(VLOOKUP(D31,#REF!,4,FALSE)),\"\",VLOOKUP(D31,#REF!,4,FALSE))","v":{"$error":"#REF!"}},{"$f":"IF(NB_JOUEURS_DOWN>1,\"Relégué(e)\",Division)","v":"Relégué(e)"}]
[null,null,17,null,31,118,null,null,null,{"$f":"IF(ISNA(VLOOKUP(D32,#REF!,2,FALSE)),\"\",VLOOKUP(D32,#REF!,2,FALSE))","v":{"$error":"#REF!"}},{"$f":"IF(ISNA(VLOOKUP(D32,#REF!,3,FALSE)),\"\",VLOOKUP(D32,#REF!,3,FALSE))","v":{"$error":"#REF!"}},{"$f":"IF(ISNA(VLOOKUP(D32,#REF!,4,FALSE)),\"\",VLOOKUP(D32,#REF!,4,FALSE))","v":{"$error":"#REF!"}},{"$f":"Division","v":{"$error":"#REF!"}}]
[null,null,19,null,32,118,null,null,null,{"$f":"IF(ISNA(VLOOKUP(D33,#REF!,2,FALSE)),\"\",VLOOKUP(D33,#REF!,2,FALSE))","v":{"$error":"#REF!"}},{"$f":"IF(ISNA(VLOOKUP(D33,#REF!,3,FALSE)),\"\",VLOOKUP(D33,#REF!,3,FALSE))","v":{"$error":"#REF!"}},{"$f":"IF(ISNA(VLOOKUP(D33,#REF!,4,FALSE)),\"\",VLOOKUP(D33,#REF!,4,FALSE))","v":{"$error":"#REF!"}},{"$f":"Division","v":{"$error":"#REF!"}}]
[null,null,null,null,33,110,null,null,null,{"$f":"IF(ISNA(VLOOKUP(D34,#REF!,2,FALSE)),\"\",VLOOKUP(D34,#REF!,2,FALSE))","v":{"$error":"#REF!"}},{"$f":"IF(ISNA(VLOOKUP(D34,#REF!,3,FALSE)),\"\",VLOOKUP(D34,#REF!,3,FALSE))","v":{"$error":"#REF!"}},{"$f":"IF(ISNA(VLOOKUP(D34,#REF!,4,FALSE)),\"\",VLOOKUP(D34,#REF!,4,FALSE))","v":{"$error":"#REF!"}},{"$f":"IF(NB_JOUEURS_DOWN>2,\"Relégué(e)\",Division)","v":"Relégué(e)"}]
[null,null,null,null,34,110,null,null,null,{"$f":"IF(ISNA(VLOOKUP(D35,#REF!,2,FALSE)),\"\",VLOOKUP(D35,#REF!,2,FALSE))","v":{"$error":"#REF!"}},{"$f":"IF(ISNA(VLOOKUP(D35,#REF!,3,FALSE)),\"\",VLOOKUP(D35,#REF!,3,FALSE))","v":{"$error":"#REF!"}},{"$f":"IF(ISNA(VLOOKUP(D35,#REF!,4,FALSE)),\"\",VLOOKUP(D35,#REF!,4,FALSE))","v":{"$error":"#REF!"}},{"$f":"IF(NB_JOUEURS_DOWN>1,\"Relégué(e)\",Division)","v":"Relégué(e)"}]
[null,null,null,null,35,110,null,null,null,{"$f":"IF(ISNA(VLOOKUP(D36,#REF!,2,FALSE)),\"\",VLOOKUP(D36,#REF!,2,FALSE))","v":{"$error":"#REF!"}},{"$f":"IF(ISNA(VLOOKUP(D36,#REF!,3,FALSE)),\"\",VLOOKUP(D36,#REF!,3,FALSE))","v":{"$error":"#REF!"}},{"$f":"IF(ISNA(VLOOKUP(D36,#REF!,4,FALSE)),\"\",VLOOKUP(D36,#REF!,4,FALSE))","v":{"$error":"#REF!"}},{"$f":"IF(NB_JOUEURS_DOWN>2,\"Relégué(e)\",Division)","v":"Relégué(e)"}]
[null,null,null,null,36,110,null,null,null,{"$f":"IF(ISNA(VLOOKUP(D37,#REF!,2,FALSE)),\"\",VLOOKUP(D37,#REF!,2,FALSE))","v":{"$error":"#REF!"}},{"$f":"IF(ISNA(VLOOKUP(D37,#REF!,3,FALSE)),\"\",VLOOKUP(D37,#REF!,3,FALSE))","v":{"$error":"#REF!"}},{"$f":"IF(ISNA(VLOOKUP(D37,#REF!,4,FALSE)),\"\",VLOOKUP(D37,#REF!,4,FALSE))","v":{"$error":"#REF!"}},{"$f":"IF(NB_JOUEURS_DOWN>2,\"Relégué(e)\",Division)","v":"Relégué(e)"}]
[null,null,null,null,37,110,null,null,null,{"$f":"IF(ISNA(VLOOKUP(D38,#REF!,2,FALSE)),\"\",VLOOKUP(D38,#REF!,2,FALSE))","v":{"$error":"#REF!"}},{"$f":"IF(ISNA(VLOOKUP(D38,#REF!,3,FALSE)),\"\",VLOOKUP(D38,#REF!,3,FALSE))","v":{"$error":"#REF!"}},{"$f":"IF(ISNA(VLOOKUP(D38,#REF!,4,FALSE)),\"\",VLOOKUP(D38,#REF!,4,FALSE))","v":{"$error":"#REF!"}},{"$f":"IF(NB_JOUEURS_DOWN>3,\"Relégué(e)\",Division)","v":"Relégué(e)"}]
[null,null,null,null,38,110,null,null,null,{"$f":"IF(ISNA(VLOOKUP(D39,#REF!,2,FALSE)),\"\",VLOOKUP(D39,#REF!,2,FALSE))","v":{"$error":"#REF!"}},{"$f":"IF(ISNA(VLOOKUP(D39,#REF!,3,FALSE)),\"\",VLOOKUP(D39,#REF!,3,FALSE))","v":{"$error":"#REF!"}},{"$f":"IF(ISNA(VLOOKUP(D39,#REF!,4,FALSE)),\"\",VLOOKUP(D39,#REF!,4,FALSE))","v":{"$error":"#REF!"}},{"$f":"IF(NB_JOUEURS_DOWN>0,\"Relégué(e)\",Division)","v":"Relégué(e)"}]
[null,null,null,null,39,110,null,null,null,{"$f":"IF(ISNA(VLOOKUP(D40,#REF!,2,FALSE)),\"\",VLOOKUP(D40,#REF!,2,FALSE))","v":{"$error":"#REF!"}},{"$f":"IF(ISNA(VLOOKUP(D40,#REF!,3,FALSE)),\"\",VLOOKUP(D40,#REF!,3,FALSE))","v":{"$error":"#REF!"}},{"$f":"IF(ISNA(VLOOKUP(D40,#REF!,4,FALSE)),\"\",VLOOKUP(D40,#REF!,4,FALSE))","v":{"$error":"#REF!"}},{"$f":"IF(NB_JOUEURS_DOWN>2,\"Relégué(e)\",Division)","v":"Relégué(e)"}]
[null,null,null,null,40,110,null,null,null,{"$f":"IF(ISNA(VLOOKUP(D41,#REF!,2,FALSE)),\"\",VLOOKUP(D41,#REF!,2,FALSE))","v":{"$error":"#REF!"}},{"$f":"IF(ISNA(VLOOKUP(D41,#REF!,3,FALSE)),\"\",VLOOKUP(D41,#REF!,3,FALSE))","v":{"$error":"#REF!"}},{"$f":"IF(ISNA(VLOOKUP(D41,#REF!,4,FALSE)),\"\",VLOOKUP(D41,#REF!,4,FALSE))","v":{"$error":"#REF!"}},{"$f":"IF(NB_JOUEURS_DOWN>0,\"Relégué(e)\",Division)","v":"Relégué(e)"}]
[null,null,null,null,41,110,null,null,null,{"$f":"IF(ISNA(VLOOKUP(D42,#REF!,2,FALSE)),\"\",VLOOKUP(D42,#REF!,2,FALSE))","v":{"$error":"#REF!"}},{"$f":"IF(ISNA(VLOOKUP(D42,#REF!,3,FALSE)),\"\",VLOOKUP(D42,#REF!,3,FALSE))","v":{"$error":"#REF!"}},{"$f":"IF(ISNA(VLOOKUP(D42,#REF!,4,FALSE)),\"\",VLOOKUP(D42,#REF!,4,FALSE))","v":{"$error":"#REF!"}},{"$f":"IF(NB_JOUEURS_DOWN>1,\"Relégué(e)\",Division)","v":"Relégué(e)"}]
[null,null,null,null,42,110,null,null,null,{"$f":"IF(ISNA(VLOOKUP(D43,#REF!,2,FALSE)),\"\",VLOOKUP(D43,#REF!,2,FALSE))","v":{"$error":"#REF!"}},{"$f":"IF(ISNA(VLOOKUP(D43,#REF!,3,FALSE)),\"\",VLOOKUP(D43,#REF!,3,FALSE))","v":{"$error":"#REF!"}},{"$f":"IF(ISNA(VLOOKUP(D43,#REF!,4,FALSE)),\"\",VLOOKUP(D43,#REF!,4,FALSE))","v":{"$error":"#REF!"}},{"$f":"IF(NB_JOUEURS_DOWN>3,\"Relégué(e)\",Division)","v":"Relégué(e)"}]
[null,null,null,null,43,110,null,null,null,{"$f":"IF(ISNA(VLOOKUP(D44,#REF!,2,FALSE)),\"\",VLOOKUP(D44,#REF!,2,FALSE))","v":{"$error":"#REF!"}},{"$f":"IF(ISNA(VLOOKUP(D44,#REF!,3,FALSE)),\"\",VLOOKUP(D44,#REF!,3,FALSE))","v":{"$error":"#REF!"}},{"$f":"IF(ISNA(VLOOKUP(D44,#REF!,4,FALSE)),\"\",VLOOKUP(D44,#REF!,4,FALSE))","v":{"$error":"#REF!"}},{"$f":"IF(NB_JOUEURS_DOWN>3,\"Relégué(e)\",Division)","v":"Relégué(e)"}]
[null,null,null,null,44,110,null,null,null,{"$f":"IF(ISNA(VLOOKUP(D45,#REF!,2,FALSE)),\"\",VLOOKUP(D45,#REF!,2,FALSE))","v":{"$error":"#REF!"}},{"$f":"IF(ISNA(VLOOKUP(D45,#REF!,3,FALSE)),\"\",VLOOKUP(D45,#REF!,3,FALSE))","v":{"$error":"#REF!"}},{"$f":"IF(ISNA(VLOOKUP(D45,#REF!,4,FALSE)),\"\",VLOOKUP(D45,#REF!,4,FALSE))","v":{"$error":"#REF!"}},{"$f":"IF(NB_JOUEURS_DOWN>3,\"Relégué(e)\",Division)","v":"Relégué(e)"}]
[null,null,null,null,45,110,null,null,null,{"$f":"IF(ISNA(VLOOKUP(D46,#REF!,2,FALSE)),\"\",VLOOKUP(D46,#REF!,2,FALSE))","v":{"$error":"#REF!"}},{"$f":"IF(ISNA(VLOOKUP(D46,#REF!,3,FALSE)),\"\",VLOOKUP(D46,#REF!,3,FALSE))","v":{"$error":"#REF!"}},{"$f":"IF(ISNA(VLOOKUP(D46,#REF!,4,FALSE)),\"\",VLOOKUP(D46,#REF!,4,FALSE))","v":{"$error":"#REF!"}},{"$f":"IF(NB_JOUEURS_DOWN>1,\"Relégué(e)\",Division)","v":"Relégué(e)"}]
[null,null,null,null,46,110,null,null,null,{"$f":"IF(ISNA(VLOOKUP(D47,#REF!,2,FALSE)),\"\",VLOOKUP(D47,#REF!,2,FALSE))","v":{"$error":"#REF!"}},{"$f":"IF(ISNA(VLOOKUP(D47,#REF!,3,FALSE)),\"\",VLOOKUP(D47,#REF!,3,FALSE))","v":{"$error":"#REF!"}},{"$f":"IF(ISNA(VLOOKUP(D47,#REF!,4,FALSE)),\"\",VLOOKUP(D47,#REF!,4,FALSE))","v":{"$error":"#REF!"}},{"$f":"IF(NB_JOUEURS_DOWN>1,\"Relégué(e)\",Division)","v":"Relégué(e)"}]
[null,null,null,null,47,110,null,null,null,{"$f":"IF(ISNA(VLOOKUP(D48,#REF!,2,FALSE)),\"\",VLOOKUP(D48,#REF!,2,FALSE))","v":{"$error":"#REF!"}},{"$f":"IF(ISNA(VLOOKUP(D48,#REF!,3,FALSE)),\"\",VLOOKUP(D48,#REF!,3,FALSE))","v":{"$error":"#REF!"}},{"$f":"IF(ISNA(VLOOKUP(D48,#REF!,4,FALSE)),\"\",VLOOKUP(D48,#REF!,4,FALSE))","v":{"$error":"#REF!"}},{"$f":"IF(NB_JOUEURS_DOWN>0,\"Relégué(e)\",Division)","v":"Relégué(e)"}]
[null,null,null,null,48,110,null,null,null,{"$f":"IF(ISNA(VLOOKUP(D49,#REF!,2,FALSE)),\"\",VLOOKUP(D49,#REF!,2,FALSE))","v":{"$error":"#REF!"}},{"$f":"IF(ISNA(VLOOKUP(D49,#REF!,3,FALSE)),\"\",VLOOKUP(D49,#REF!,3,FALSE))","v":{"$error":"#REF!"}},{"$f":"IF(ISNA(VLOOKUP(D49,#REF!,4,FALSE)),\"\",VLOOKUP(D49,#REF!,4,FALSE))","v":{"$error":"#REF!"}},{"$f":"IF(NB_JOUEURS_DOWN>0,\"Relégué(e)\",Division)","v":"Relégué(e)"}]
[null,null,null,null,49,95,null,null,null,{"$f":"IF(ISNA(VLOOKUP(D50,#REF!,2,FALSE)),\"\",VLOOKUP(D50,#REF!,2,FALSE))","v":{"$error":"#REF!"}},{"$f":"IF(ISNA(VLOOKUP(D50,#REF!,3,FALSE)),\"\",VLOOKUP(D50,#REF!,3,FALSE))","v":{"$error":"#REF!"}},{"$f":"IF(ISNA(VLOOKUP(D50,#REF!,4,FALSE)),\"\",VLOOKUP(D50,#REF!,4,FALSE))","v":{"$error":"#REF!"}},{"$f":"IF(NB_JOUEURS_DOWN>2,\"Relégué(e)\",Division)","v":"Relégué(e)"}]
[null,null,null,null,50,95,null,null,null,{"$f":"IF(ISNA(VLOOKUP(D51,#REF!,2,FALSE)),\"\",VLOOKUP(D51,#REF!,2,FALSE))","v":{"$error":"#REF!"}},{"$f":"IF(ISNA(VLOOKUP(D51,#REF!,3,FALSE)),\"\",VLOOKUP(D51,#REF!,3,FALSE))","v":{"$error":"#REF!"}},{"$f":"IF(ISNA(VLOOKUP(D51,#REF!,4,FALSE)),\"\",VLOOKUP(D51,#REF!,4,FALSE))","v":{"$error":"#REF!"}},{"$f":"IF(NB_JOUEURS_DOWN>3,\"Relégué(e)\",Division)","v":"Relégué(e)"}]
[null,null,null,null,51,95,null,null,null,{"$f":"IF(ISNA(VLOOKUP(D52,#REF!,2,FALSE)),\"\",VLOOKUP(D52,#REF!,2,FALSE))","v":{"$error":"#REF!"}},{"$f":"IF(ISNA(VLOOKUP(D52,#REF!,3,FALSE)),\"\",VLOOKUP(D52,#REF!,3,FALSE))","v":{"$error":"#REF!"}},{"$f":"IF(ISNA(VLOOKUP(D52,#REF!,4,FALSE)),\"\",VLOOKUP(D52,#REF!,4,FALSE))","v":{"$error":"#REF!"}},{"$f":"IF(NB_JOUEURS_DOWN>1,\"Relégué(e)\",Division)","v":"Relégué(e)"}]
[null,null,null,null,52,95,null,null,null,{"$f":"IF(ISNA(VLOOKUP(D53,#REF!,2,FALSE)),\"\",VLOOKUP(D53,#REF!,2,FALSE))","v":{"$error":"#REF!"}},{"$f":"IF(ISNA(VLOOKUP(D53,#REF!,3,FALSE)),\"\",VLOOKUP(D53,#REF!,3,FALSE))","v":{"$error":"#REF!"}},{"$f":"IF(ISNA(VLOOKUP(D53,#REF!,4,FALSE)),\"\",VLOOKUP(D53,#REF!,4,FALSE))","v":{"$error":"#REF!"}},{"$f":"IF(NB_JOUEURS_DOWN>0,\"Relégué(e)\",Division)","v":"Relégué(e)"}]
[null,null,null,null,53,95,null,null,null,{"$f":"IF(ISNA(VLOOKUP(D54,#REF!,2,FALSE)),\"\",VLOOKUP(D54,#REF!,2,FALSE))","v":{"$error":"#REF!"}},{"$f":"IF(ISNA(VLOOKUP(D54,#REF!,3,FALSE)),\"\",VLOOKUP(D54,#REF!,3,FALSE))","v":{"$error":"#REF!"}},{"$f":"IF(ISNA(VLOOKUP(D54,#REF!,4,FALSE)),\"\",VLOOKUP(D54,#REF!,4,FALSE))","v":{"$error":"#REF!"}},{"$f":"IF(NB_JOUEURS_DOWN>3,\"Relégué(e)\",Division)","v":"Relégué(e)"}]
[null,null,null,null,54,95,null,null,null,{"$f":"IF(ISNA(VLOOKUP(D55,#REF!,2,FALSE)),\"\",VLOOKUP(D55,#REF!,2,FALSE))","v":{"$error":"#REF!"}},{"$f":"IF(ISNA(VLOOKUP(D55,#REF!,3,FALSE)),\"\",VLOOKUP(D55,#REF!,3,FALSE))","v":{"$error":"#REF!"}},{"$f":"IF(ISNA(VLOOKUP(D55,#REF!,4,FALSE)),\"\",VLOOKUP(D55,#REF!,4,FALSE))","v":{"$error":"#REF!"}},{"$f":"IF(NB_JOUEURS_DOWN>2,\"Relégué(e)\",Division)","v":"Relégué(e)"}]
[null,null,null,null,55,95,null,null,null,{"$f":"IF(ISNA(VLOOKUP(D59,#REF!,2,FALSE)),\"\",VLOOKUP(D59,#REF!,2,FALSE))","v":{"$error":"#REF!"}},{"$f":"IF(ISNA(VLOOKUP(D56,#REF!,3,FALSE)),\"\",VLOOKUP(D56,#REF!,3,FALSE))","v":{"$error":"#REF!"}},{"$f":"IF(ISNA(VLOOKUP(D59,#REF!,4,FALSE)),\"\",VLOOKUP(D59,#REF!,4,FALSE))","v":{"$error":"#REF!"}},{"$f":"IF(NB_JOUEURS_DOWN>1,\"Relégué(e)\",Division)","v":"Relégué(e)"}]
[null,null,null,null,56,95,null,null,null,{"$f":"IF(ISNA(VLOOKUP(D60,#REF!,2,FALSE)),\"\",VLOOKUP(D60,#REF!,2,FALSE))","v":{"$error":"#REF!"}},{"$f":"IF(ISNA(VLOOKUP(D57,#REF!,3,FALSE)),\"\",VLOOKUP(D57,#REF!,3,FALSE))","v":{"$error":"#REF!"}},{"$f":"IF(ISNA(VLOOKUP(D60,#REF!,4,FALSE)),\"\",VLOOKUP(D60,#REF!,4,FALSE))","v":{"$error":"#REF!"}},{"$f":"IF(NB_JOUEURS_DOWN>0,\"Relégué(e)\",Division)","v":"Relégué(e)"}]
[null,null,null,null,57,95,null,null,null,{"$f":"IF(ISNA(VLOOKUP(D61,#REF!,2,FALSE)),\"\",VLOOKUP(D61,#REF!,2,FALSE))","v":{"$error":"#REF!"}},{"$f":"IF(ISNA(VLOOKUP(D58,#REF!,3,FALSE)),\"\",VLOOKUP(D58,#REF!,3,FALSE))","v":{"$error":"#REF!"}},{"$f":"IF(ISNA(VLOOKUP(D61,#REF!,4,FALSE)),\"\",VLOOKUP(D61,#REF!,4,FALSE))","v":{"$error":"#REF!"}},{"$f":"IF(NB_JOUEURS_DOWN>3,\"Relégué(e)\",Division)","v":"Relégué(e)"}]
[null,null,null,null,58,95,null,null,null,{"$f":"IF(ISNA(VLOOKUP(D62,#REF!,2,FALSE)),\"\",VLOOKUP(D62,#REF!,2,FALSE))","v":{"$error":"#REF!"}},{"$f":"IF(ISNA(VLOOKUP(D59,#REF!,3,FALSE)),\"\",VLOOKUP(D59,#REF!,3,FALSE))","v":{"$error":"#REF!"}},{"$f":"IF(ISNA(VLOOKUP(D62,#REF!,4,FALSE)),\"\",VLOOKUP(D62,#REF!,4,FALSE))","v":{"$error":"#REF!"}},{"$f":"IF(NB_JOUEURS_DOWN>2,\"Relégué(e)\",Division)","v":"Relégué(e)"}]
[null,null,null,null,59,95,null,null,null,{"$f":"IF(ISNA(VLOOKUP(D62,#REF!,2,FALSE)),\"\",VLOOKUP(D62,#REF!,2,FALSE))","v":{"$error":"#REF!"}},{"$f":"IF(ISNA(VLOOKUP(D60,#REF!,3,FALSE)),\"\",VLOOKUP(D60,#REF!,3,FALSE))","v":{"$error":"#REF!"}},{"$f":"IF(ISNA(VLOOKUP(D63,#REF!,4,FALSE)),\"\",VLOOKUP(D63,#REF!,4,FALSE))","v":{"$error":"#REF!"}},{"$f":"IF(NB_JOUEURS_DOWN>1,\"Relégué(e)\",Division)","v":"Relégué(e)"}]
[null,null,null,null,60,95,null,null,null,{"$f":"IF(ISNA(VLOOKUP(D63,#REF!,2,FALSE)),\"\",VLOOKUP(D63,#REF!,2,FALSE))","v":{"$error":"#REF!"}},{"$f":"IF(ISNA(VLOOKUP(D63,#REF!,3,FALSE)),\"\",VLOOKUP(D63,#REF!,3,FALSE))","v":{"$error":"#REF!"}},{"$f":"IF(ISNA(VLOOKUP(D63,#REF!,4,FALSE)),\"\",VLOOKUP(D63,#REF!,4,FALSE))","v":{"$error":"#REF!"}},{"$f":"IF(NB_JOUEURS_DOWN>0,\"Relégué(e)\",Division)","v":"Relégué(e)"}]
[null,null,null,null,61,-50,null,null,null,{"$f":"IF(ISNA(VLOOKUP(D64,#REF!,2,FALSE)),\"\",VLOOKUP(D64,#REF!,2,FALSE))","v":{"$error":"#REF!"}},{"$f":"IF(ISNA(VLOOKUP(D64,#REF!,3,FALSE)),\"\",VLOOKUP(D64,#REF!,3,FALSE))","v":{"$error":"#REF!"}},{"$f":"IF(ISNA(VLOOKUP(D64,#REF!,4,FALSE)),\"\",VLOOKUP(D64,#REF!,4,FALSE))","v":{"$error":"#REF!"}},{"$f":"IF(NB_JOUEURS_DOWN>3,\"Relégué(e)\",Division)","v":"Relégué(e)"}]
[null,null,null,null,62,-50,null,null,null,{"$f":"IF(ISNA(VLOOKUP(D65,#REF!,2,FALSE)),\"\",VLOOKUP(D65,#REF!,2,FALSE))","v":{"$error":"#REF!"}},{"$f":"IF(ISNA(VLOOKUP(D65,#REF!,3,FALSE)),\"\",VLOOKUP(D65,#REF!,3,FALSE))","v":{"$error":"#REF!"}},{"$f":"IF(ISNA(VLOOKUP(D65,#REF!,4,FALSE)),\"\",VLOOKUP(D65,#REF!,4,FALSE))","v":{"$error":"#REF!"}},{"$f":"IF(NB_JOUEURS_DOWN>2,\"Relégué(e)\",Division)","v":"Relégué(e)"}]
[null,null,null,null,63,-50,null,null,null,{"$f":"IF(ISNA(VLOOKUP(D66,#REF!,2,FALSE)),\"\",VLOOKUP(D66,#REF!,2,FALSE))","v":{"$error":"#REF!"}},{"$f":"IF(ISNA(VLOOKUP(D66,#REF!,3,FALSE)),\"\",VLOOKUP(D66,#REF!,3,FALSE))","v":{"$error":"#REF!"}},{"$f":"IF(ISNA(VLOOKUP(D66,#REF!,4,FALSE)),\"\",VLOOKUP(D66,#REF!,4,FALSE))","v":{"$error":"#REF!"}},{"$f":"IF(NB_JOUEURS_DOWN>1,\"Relégué(e)\",Division)","v":"Relégué(e)"}]
[null,null,null,null,64,-50,null,null,null,{"$f":"IF(ISNA(VLOOKUP(D67,#REF!,2,FALSE)),\"\",VLOOKUP(D67,#REF!,2,FALSE))","v":{"$error":"#REF!"}},{"$f":"IF(ISNA(VLOOKUP(D67,#REF!,3,FALSE)),\"\",VLOOKUP(D67,#REF!,3,FALSE))","v":{"$error":"#REF!"}},{"$f":"IF(ISNA(VLOOKUP(D67,#REF!,4,FALSE)),\"\",VLOOKUP(D67,#REF!,4,FALSE))","v":{"$error":"#REF!"}},{"$f":"IF(NB_JOUEURS_DOWN>1,\"Relégué(e)\",Division)","v":"Relégué(e)"}]
[null,null,null,null,"FE"]
[null,null,null,null,"FE"]
[null,null,null,null,"FE"]
[null,null,null,null,"FE"]
[null,null,null,null,"FE"]

{"sheet":"FEUILLE 3GA","index":10,"n_rows":75,"n_cols":53,"rows_kept":75,"cut":false,"hidden":false,"merged":[[59,29,59,32],[68,29,68,35],[68,47,68,53],[69,35,71,47],[74,30,74,36],[74,46,74,52],[52,31,52,51],[53,29,53,38],[54,29,55,38],[54,40,55,42],[54,44,55,53],[59,2,59,5],[68,2,68,8],[68,20,68,26],[69,8,71,20],[74,3,74,9],[74,19,74,25],[17,2,17,5],[17,29,17,32],[26,29,26,35],[27,35,29,47],[32,30,32,36],[32,46,32,52],[42,2,48,26],[50,2,50,7],[50,9,50,19],[50,21,50,26],[52,4,52,24],[53,2,53,11],[54,2,55,11],[54,13,55,15],[54,17,55,26],[32,3,32,9],[32,19,32,25],[42,29,48,53],[50,29,50,34],[50,36,50,46],[50,48,50,53],[26,2,26,8],[26,20,26,26],[27,8,29,20],[26,47,26,53],[10,4,10,24],[11,2,11,11],[12,2,13,11],[12,13,13,15],[12,17,13,26],[10,31,10,51],[11,29,11,38],[12,29,13,38],[12,40,13,42],[12,44,13,53],[0,2,6,26],[8,2,8,7],[8,9,8,19],[8,21,8,26],[0,29,6,53],[8,29,8,34],[8,36,8,46],[8,48,8,53]]}
[null,null,"MIXTE",null,null,null,null,null,null,null,null,null,null,null,null,null,null,null,null,null,null,null,null,null,null,null,null,null,null,"MIXTE"]
[]
[]
[]
[]
[]
[]
[]
[null,null,"JOUEUR A",null,null,null,null,null,null,"BILLARD N° ",null,null,null,null,null,null,null,null,null,null,null,"JOUEUR B",null,null,null,null,null,null,null,"JOUEUR A",null,null,null,null,null,null,"BILLARD N° ",null,null,null,null,null,null,null,null,null,null,null,"JOUEUR B"]
[]
[null,null,null,null,"3 PARTIES GAGNANTES",null,null,null,null,null,null,null,null,null,null,null,null,null,null,null,null,null,null,null,null,null,null,null,null,null,null,"3 PARTIES GAGNANTES"]
[]
[null,null,null,null,null,null,null,null,null,null,null,null,null,"VS",null,null,null,null,null,null,null,null,null,null,null,null,null,null,null,null,null,null,null,null,null,null,null,null,null,null,"VS"]
[]
[]
[null,null,"PARTIES",null,null,null,null,null,1,null,2,null,3,null,4,null,5,null,null,null,null,null,null,"TOT.A",null,"TOT.B",null,null,null,"PARTIES",null,null,null,null,null,1,null,2,null,3,null,4,null,5,null,null,null,null,null,null,"TOT.A",null,"TOT.B"]
[]
[null,null,"CASES",null,null,null,null,null,null,null,null,null,null,null,null,null,null,null,null,null,null,null,null,null,null,null,null,null,null,"CASES"]
[]
[null,null,"GAGNANT",null,null,null,null,null,null,null,null,null,null,null,null,null,null,null,null,null,null,null,null,null,null,null,null,null,null,"GAGNANT"]
[]
[null,null,"CASSE FERME",null,null,null,null,null,null,null,null,null,null,null,null,null,null,null,null,null,null,null,null,null,null,null,null,null,null,"CASSE FERME"]
[]
[null,null,"REPRISE FERME",null,null,null,null,null,null,null,null,null,null,null,null,null,null,null,null,null,null,null,null,null,null,null,null,null,null,"REPRISE FERME"]
[]
[]
[null,null,"Forfait joueur A",null,null,null,null,null,null,null,null,null,null,null,null,null,null,null,null,null,"Forfait joueur B",null,null,null,null,null,null,null,null,"Forfait joueur A",null,null,null,null,null,null,null,null,null,null,null,null,null,null,null,null,null,"Forfait joueur B"]
[null,null,null,null,null,null,null,null,"En cas de litige, cochez la case ci-dessous et décrivez le litige au dos de cette feuille",null,null,null,null,null,null,null,null,null,null,null,null,null,null,null,null,null,null,null,null,null,null,null,null,null,null,"En cas de litige, cochez la case ci-dessous et décrivez le litige au dos de cette feuille"]
[]
[]
[]
[]
[null,null,null,"Signature joueur A",null,null,null,null,null,null,null,null,null,null,null,null,null,null,null,"Signature joueur B",null,null,null,null,null,null,null,null,null,null,"Signature joueur A",null,null,null,null,null,null,null,null,null,null,null,null,null,null,null,"Signature joueur B"]
[]
[]
[]
[]
[]
[]
[]
[]
[]
[null,null,"MIXTE",null,null,null,null,null,null,null,null,null,null,null,null,null,null,null,null,null,null,null,null,null,null,null,null,null,null,"MIXTE"]
[]
[]
[]
[]
[]
[]
[]
[null,null,"JOUEUR A",null,null,null,null,null,null,"BILLARD N° ",null,null,null,null,null,null,null,null,null,null,null,"JOUEUR B",null,null,null,null,null,null,null,"JOUEUR A",null,null,null,null,null,null,"BILLARD N° ",null,null,null,null,null,null,null,null,null,null,null,"JOUEUR B"]
[]
[null,null,null,null,"3 PARTIES GAGNANTES",null,null,null,null,null,null,null,null,null,null,null,null,null,null,null,null,null,null,null,null,null,null,null,null,null,null,"3 PARTIES GAGNANTES"]
[]
[null,null,null,null,null,null,null,null,null,null,null,null,null,"VS",null,null,null,null,null,null,null,null,null,null,null,null,null,null,null,null,null,null,null,null,null,null,null,null,null,null,"VS"]
[]
[]
[null,null,"PARTIES",null,null,null,null,null,1,null,2,null,3,null,4,null,5,null,null,null,null,null,null,"TOT.A",null,"TOT.B",null,null,null,"PARTIES",null,null,null,null,null,1,null,2,null,3,null,4,null,5,null,null,null,null,null,null,"TOT.A",null,"TOT.B"]
[]
[null,null,"CASES",null,null,null,null,null,null,null,null,null,null,null,null,null,null,null,null,null,null,null,null,null,null,null,null,null,null,"CASES"]
[]
[null,null,"GAGNANT",null,null,null,null,null,null,null,null,null,null,null,null,null,null,null,null,null,null,null,null,null,null,null,null,null,null,"GAGNANT"]
[]
[null,null,"CASSE FERME",null,null,null,null,null,null,null,null,null,null,null,null,null,null,null,null,null,null,null,null,null,null,null,null,null,null,"CASSE FERME"]
[]
[null,null,"REPRISE FERME",null,null,null,null,null,null,null,null,null,null,null,null,null,null,null,null,null,null,null,null,null,null,null,null,null,null,"REPRISE FERME"]
[]
[]
[null,null,"Forfait joueur A",null,null,null,null,null,null,null,null,null,null,null,null,null,null,null,null,null,"Forfait joueur B",null,null,null,null,null,null,null,null,"Forfait joueur A",null,null,null,null,null,null,null,null,null,null,null,null,null,null,null,null,null,"Forfait joueur B"]
[null,null,null,null,null,null,null,null,"En cas de litige, cochez la case ci-dessous et décrivez le litige au dos de cette feuille",null,null,null,null,null,null,null,null,null,null,null,null,null,null,null,null,null,null,null,null,null,null,null,null,null,null,"En cas de litige, cochez la case ci-dessous et décrivez le litige au dos de cette feuille"]
[]
[]
[]
[]
[null,null,null,"Signature joueur A",null,null,null,null,null,null,null,null,null,null,null,null,null,null,null,"Signature joueur B",null,null,null,null,null,null,null,null,null,null,"Signature joueur A",null,null,null,null,null,null,null,null,null,null,null,null,null,null,null,"Signature joueur B"]

{"sheet":"Points","index":11,"n_rows":68,"n_cols":8,"rows_kept":68,"cut":false,"hidden":true,"merged":[]}
["Place","R1","R2","R3"]
[1,200,200,93]
[2,180,180,79]
[3,161,161,66]
[4,161,161,66,null,null,{"$f":"IF(AND(#REF!=\"A\",#REF!=\"A\"),#REF!,IF(#REF!=\"A\",#REF!,IF(#REF!=\"A\",#REF!,IF(#REF!=#REF!,\"\",(IF(#REF!>#REF!,#REF!,#REF!))))))","v":{"$error":"#REF!"}},{"$f":"IF(AND(#REF!=\"A\",#REF!=\"A\"),#REF!,IF(#REF!=\"A\",#REF!,IF(#REF!=\"A\",#REF!,IF(#REF!=#REF!,\"\",(IF(#REF!>#REF!,#REF!+#REF!-#REF!,#REF!+#REF!-#REF!))))))","v":{"$error":"#REF!"}}]
[5,143,143,54,null,null,{"$f":"IF(AND(#REF!=\"A\",#REF!=\"A\"),#REF!,IF(#REF!=\"A\",#REF!,IF(#REF!=\"A\",#REF!,IF(#REF!=#REF!,\"\",(IF(#REF!>#REF!,#REF!,#REF!))))))","v":{"$error":"#REF!"}},{"$f":"IF(AND(#REF!=\"A\",#REF!=\"A\"),#REF!,IF(#REF!=\"A\",#REF!,IF(#REF!=\"A\",#REF!,IF(#REF!=#REF!,\"\",(IF(#REF!>#REF!,#REF!+#REF!-#REF!,#REF!+#REF!-#REF!))))))","v":{"$error":"#REF!"}}]
[6,143,143,54]
[7,143,143,54]
[8,143,143,54]
[9,126,126,43]
[10,126,126,43]
[11,126,126,43]
[12,126,126,43]
[13,126,126,43]
[14,126,126,43]
[15,126,126,43]
[16,126,126,43]
[17,118,118,38]
[18,118,118,38]
[19,118,118,38]
[20,118,118,38]
[21,118,118,38]
[22,118,118,38]
[23,118,118,38]
[24,118,118,38]
[25,118,118,38]
[26,118,118,38]
[27,118,118,38]
[28,118,118,38]
[29,118,118,38]
[30,118,118,38]
[31,118,118,38]
[32,118,118,38]
[33,110,110,33]
[34,110,110,33]
[35,110,110,33]
[36,110,110,33]
[37,110,110,33]
[38,110,110,33]
[39,110,110,33]
[40,110,110,33]
[41,110,110,33]
[42,110,110,33]
[43,110,110,33]
[44,110,110,33]
[45,110,110,33]
[46,110,110,33]
[47,110,110,33]
[48,110,110,33]
[49,95,95,24]
[50,95,95,24]
[51,95,95,24]
[52,95,95,24]
[53,95,95,24]
[54,95,95,24]
[55,95,95,24]
[56,95,95,24]
[57,95,95,24]
[58,95,95,24]
[59,95,95,24]
[60,95,95,24]
[61,95,95,24]
[62,95,95,24]
[63,95,95,24]
[64,95,95,24]
["FNE",-50,-50,-20]
["FE",0,0,0]
["A",0,0,0]

{"sheet":"Parametres","index":12,"n_rows":27,"n_cols":1,"rows_kept":27,"cut":false,"hidden":true,"merged":[]}
[]
[]
[]
[]
[]
[]
[]
[]
[]
[]
[]
[]
[]
[]
[]
[]
[]
[]
[]
[]
["Billard"]
[1]
[2]
[3]
[4]
[5]
[6]

{"sheet":"FEUILLE 4GA","index":13,"n_rows":75,"n_cols":52,"rows_kept":75,"cut":false,"hidden":false,"merged":[[0,1,6,25],[8,1,8,6],[8,8,8,18],[8,20,8,25],[10,3,10,23],[32,2,32,8],[32,18,32,24],[11,1,11,10],[12,1,13,10],[12,12,13,14],[12,16,13,25],[17,1,17,4],[11,28,11,37],[12,28,13,37],[12,39,13,41],[12,43,13,52],[17,28,17,31],[0,28,6,52],[8,28,8,33],[8,35,8,45],[8,47,8,52],[10,30,10,50],[50,20,50,25],[52,3,52,23],[26,28,26,34],[26,46,26,52],[27,34,29,46],[32,29,32,35],[32,45,32,51],[26,1,26,7],[26,19,26,25],[27,7,29,19],[69,7,71,19],[74,2,74,8],[74,18,74,24],[53,1,53,10],[54,1,55,10],[54,12,55,14],[54,16,55,25],[59,1,59,4],[42,28,48,52],[50,28,50,33],[50,35,50,45],[50,47,50,52],[52,30,52,50],[68,1,68,7],[68,19,68,25],[42,1,48,25],[50,1,50,6],[50,8,50,18],[68,28,68,34],[68,46,68,52],[69,34,71,46],[74,29,74,35],[74,45,74,51],[53,28,53,37],[54,28,55,37],[54,39,55,41],[54,43,55,52],[59,28,59,31]]}
[null,"MIXTE",null,null,null,null,null,null,null,null,null,null,null,null,null,null,null,null,null,null,null,null,null,null,null,null,null,null,"MIXTE"]
[]
[]
[]
[]
[]
[]
[]
[null,"JOUEUR A",null,null,null,null,null,null,"BILLARD N° ",null,null,null,null,null,null,null,null,null,null,null,"JOUEUR B",null,null,null,null,null,null,null,"JOUEUR A",null,null,null,null,null,null,"BILLARD N° ",null,null,null,null,null,null,null,null,null,null,null,"JOUEUR B"]
[]
[null,null,null,"4 PARTIES GAGNANTES",null,null,null,null,null,null,null,null,null,null,null,null,null,null,null,null,null,null,null,null,null,null,null,null,null,null,"4 PARTIES GAGNANTES"]
[]
[null,null,null,null,null,null,null,null,null,null,null,null,"VS",null,null,null,null,null,null,null,null,null,null,null,null,null,null,null,null,null,null,null,null,null,null,null,null,null,null,"VS"]
[]
[]
[null,"PARTIES",null,null,null,null,null,1,null,2,null,3,null,4,null,5,null,6,null,7,null,null,"TOT.A",null,"TOT.B",null,null,null,"PARTIES",null,null,null,null,null,1,null,2,null,3,null,4,null,5,null,6,null,7,null,null,"TOT.A",null,"TOT.B"]
[]
[null,"CASES",null,null,null,null,null,null,null,null,null,null,null,null,null,null,null,null,null,null,null,null,null,null,null,null,null,null,"CASES"]
[]
[null,"GAGNANT",null,null,null,null,null,null,null,null,null,null,null,null,null,null,null,null,null,null,null,null,null,null,null,null,null,null,"GAGNANT"]
[]
[null,"CASSE FERME",null,null,null,null,null,null,null,null,null,null,null,null,null,null,null,null,null,null,null,null,null,null,null,null,null,null,"CASSE FERME"]
[]
[null,"REPRISE FERME",null,null,null,null,null,null,null,null,null,null,null,null,null,null,null,null,null,null,null,null,null,null,null,null,null,null,"REPRISE FERME"]
[]
[]
[null,"Forfait joueur A",null,null,null,null,null,null,null,null,null,null,null,null,null,null,null,null,null,"Forfait joueur B",null,null,null,null,null,null,null,null,"Forfait joueur A",null,null,null,null,null,null,null,null,null,null,null,null,null,null,null,null,null,"Forfait joueur B"]
[null,null,null,null,null,null,null,"En cas de litige, cochez la case ci-dessous et décrivez le litige au dos de cette feuille",null,null,null,null,null,null,null,null,null,null,null,null,null,null,null,null,null,null,null,null,null,null,null,null,null,null,"En cas de litige, cochez la case ci-dessous et décrivez le litige au dos de cette feuille"]
[]
[]
[]
[]
[null,null,"Signature joueur A",null,null,null,null,null,null,null,null,null,null,null,null,null,null,null,"Signature joueur B",null,null,null,null,null,null,null,null,null,null,"Signature joueur A",null,null,null,null,null,null,null,null,null,null,null,null,null,null,null,"Signature joueur B"]
[]
[]
[]
[]
[]
[]
[]
[]
[]
[null,"MIXTE",null,null,null,null,null,null,null,null,null,null,null,null,null,null,null,null,null,null,null,null,null,null,null,null,null,null,"MIXTE"]
[]
[]
[]
[]
[]
[]
[]
[null,"JOUEUR A",null,null,null,null,null,null,"BILLARD N° ",null,null,null,null,null,null,null,null,null,null,null,"JOUEUR B",null,null,null,null,null,null,null,"JOUEUR A",null,null,null,null,null,null,"BILLARD N° ",null,null,null,null,null,null,null,null,null,null,null,"JOUEUR B"]
[]
[null,null,null,"4 PARTIES GAGNANTES",null,null,null,null,null,null,null,null,null,null,null,null,null,null,null,null,null,null,null,null,null,null,null,null,null,null,"4 PARTIES GAGNANTES"]
[]
[null,null,null,null,null,null,null,null,null,null,null,null,"VS",null,null,null,null,null,null,null,null,null,null,null,null,null,null,null,null,null,null,null,null,null,null,null,null,null,null,"VS"]
[]
[]
[null,"PARTIES",null,null,null,null,null,1,null,2,null,3,null,4,null,5,null,6,null,7,null,null,"TOT.A",null,"TOT.B",null,null,null,"PARTIES",null,null,null,null,null,1,null,2,null,3,null,4,null,5,null,6,null,7,null,null,"TOT.A",null,"TOT.B"]
[]
[null,"CASES",null,null,null,null,null,null,null,null,null,null,null,null,null,null,null,null,null,null,null,null,null,null,null,null,null,null,"CASES"]
[]
[null,"GAGNANT",null,null,null,null,null,null,null,null,null,null,null,null,null,null,null,null,null,null,null,null,null,null,null,null,null,null,"GAGNANT"]
[]
[null,"CASSE FERME",null,null,null,null,null,null,null,null,null,null,null,null,null,null,null,null,null,null,null,null,null,null,null,null,null,null,"CASSE FERME"]
[]
[null,"REPRISE FERME",null,null,null,null,null,null,null,null,null,null,null,null,null,null,null,null,null,null,null,null,null,null,null,null,null,null,"REPRISE FERME"]
[]
[]
[null,"Forfait joueur A",null,null,null,null,null,null,null,null,null,null,null,null,null,null,null,null,null,"Forfait joueur B",null,null,null,null,null,null,null,null,"Forfait joueur A",null,null,null,null,null,null,null,null,null,null,null,null,null,null,null,null,null,"Forfait joueur B"]
[null,null,null,null,null,null,null,"En cas de litige, cochez la case ci-dessous et décrivez le litige au dos de cette feuille",null,null,null,null,null,null,null,null,null,null,null,null,null,null,null,null,null,null,null,null,null,null,null,null,null,null,"En cas de litige, cochez la case ci-dessous et décrivez le litige au dos de cette feuille"]
[]
[]
[]
[]
[null,null,"Signature joueur A",null,null,null,null,null,null,null,null,null,null,null,null,null,null,null,"Signature joueur B",null,null,null,null,null,null,null,null,null,null,"Signature joueur A",null,null,null,null,null,null,null,null,null,null,null,null,null,null,null,"Signature joueur B"]

{"sheet":"FEUILLE 5GA","index":14,"n_rows":33,"n_cols":28,"rows_kept":33,"cut":false,"hidden":false,"merged":[[27,7,29,22],[32,2,32,8],[32,21,32,27],[12,1,13,10],[12,12,13,17],[12,19,13,28],[17,1,17,4],[26,1,26,7],[26,22,26,28],[0,1,6,28],[8,1,8,6],[8,8,8,21],[8,23,8,28],[10,3,10,26]]}
[null,"MIXTE"]
[]
[]
[]
[]
[]
[]
[]
[null,"JOUEUR A",null,null,null,null,null,null,"BILLARD N° ",null,null,null,null,null,null,null,null,null,null,null,null,null,null,"JOUEUR B"]
[]
[null,null,null,"5 PARTIES GAGNANTES"]
[]
[null,null,null,null,null,null,null,null,null,null,null,null,"VS"]
[]
[]
[null,"PARTIES",null,null,null,null,null,1,null,2,null,3,null,4,null,5,null,6,null,7,null,8,null,9,null,"TOT.A",null,"TOT.B"]
[]
[null,"CASES"]
[]
[null,"GAGNANT"]
[]
[null,"CASSE FERME"]
[]
[null,"REPRISE FERME"]
[]
[]
[null,"Forfait joueur A",null,null,null,null,null,null,null,null,null,null,null,null,null,null,null,null,null,null,null,null,"Forfait joueur B"]
[null,null,null,null,null,null,null,"En cas de litige, cochez la case ci-dessous et décrivez le litige au dos de cette feuille"]
[]
[]
[]
[]
[null,null,"Signature joueur A",null,null,null,null,null,null,null,null,null,null,null,null,null,null,null,null,null,null,"Signature joueur B"]