{"text_format":"1","workbook":"xlsx","n_sheets":10,"sheets":["Points","Accueil","Inscrits","1","2","3","4","Final","Classement","Feuil1"],"not_rendered":{"charts":0,"images":2,"macros":0,"external_links":1,"defined_names":69,"comments":5,"pivot_tables":0},"unopened":[],"bounds":{"document_bytes":16777216,"sheet_cells":100000,"rows_first":2000,"rows_last":500,"rows_between":2000,"halvings":0,"cell_chars":16384,"cell_head_chars":4096},"cells_cut":0,"cells_raw":0,"read":"whole","date_system":"1900"}

{"sheet":"Points","index":0,"n_rows":18,"n_cols":8,"rows_kept":18,"cut":false,"hidden":false,"merged":[]}
["Place","R1","Place","R1","Place","R1","Place","R1"]
[1,200,17,118,33,110,49,95]
[2,180,18,118,34,110,50,95]
[3,170,19,118,35,110,51,95]
[4,160,20,118,36,110,52,95]
[5,143,21,118,37,110,53,95]
[6,143,22,118,38,110,54,95]
[7,143,23,118,39,110,55,95]
[8,143,24,118,40,110,56,95]
[9,126,25,118,41,110,57,95]
[10,126,26,118,42,110,58,95]
[11,126,27,118,43,110,59,95]
[12,126,28,118,44,110,60,95]
[13,126,29,118,45,110,61,95]
[14,126,30,118,46,110,62,95]
[15,126,31,118,47,110,63,95]
[16,126,32,118,48,110,64,95]
["A",0,"FE",0,"FNE",-50,"SUP",-100]

{"sheet":"Accueil","index":1,"n_rows":128,"n_cols":7,"rows_kept":128,"cut":false,"hidden":false,"merged":[[1,2,1,6],[24,3,24,6],[25,3,25,6],[15,2,15,6]]}
["F"]
["A",null,"INFOS UTILES POUR CE TOURNOI"]
[0]
[1,null,"Comité Sportif","Savoie/Haute-Savoie/Ain Est",null,"SAISON","2017 / 2018"]
[2]
[3,null,"DATE","2017-10-22",null,"TOURNOI",1]
[4]
[5,null,"CLUB","Billard Club 8 Pool Evian",null,"DIVISION","R1"]
[6]
[7,null,"VILLE DU CLUB","EVIAN",null,"NB JOUEURS",17]
[8]
[9,null,"Nombre de joueurs\nMontants de Division",0,null,"CATEGORIE","MIXTE"]
[10]
[11,null,"Nombre de joueurs\nDescendants de Division",0,null,"Nombre de Billards\n8 Pool",5]
[12]
[13,null,"DISTANCES DES MATCHS"]
[14]
[15,null,"Nb Parties Gagnantes\ndans les Poules\n(côté gagnant)",3,null,"Nb Parties Gagnantes\ndans les Poules\n(côté perdant)",3]
[16]
[17,null,"Nb Parties Gagnantes\nen 1/8 de finale",4,null,"Nb Parties Gagnantes\nen 1/4 de finale",4]
[18]
[19,null,"Nb Parties Gagnantes\nen 1/2 de finale",4,null,"Nb Parties Gagnantes\nen Finale",5]
[20]
[21]
[22,null,"Nom du fichier des Licenciés","Championnat FFB avec R3.xls"]
[23,null,"Chemin du fichier Licenciés","E:\\FFB\\Logiciel\\Championnat FFB avec R3.xls"]
[24]
[25]
[26]
[27]
[28]
[29]
[30]
[31]
[32]
[33]
[34]
[35]
[36]
[37]
[38]
[39]
[40]
[41]
[42]
[]
["Club"]
["Comité Sportif"]
["Ligue"]
[]
["Cantal/Haute-Loire"]
["Isére Nord/Rhône"]
["Isére Sud/Drôme"]
["Savoie/Haute-Savoie/Ain Est"]
["Ain Ouest"]
["Allier/Loire/Puy-de-Dôme"]
["U14"]
["U18"]
["U23"]
["FEMININ"]
["VETERAN"]
["MIXTE"]
["R1"]
[]
[]
[]
[]
["2016 / 2017"]
["2017 / 2018"]
["2018 / 2019"]
["2019 / 2020"]
["2020 / 2021"]
["F"]
["G"]
["H"]
["I"]
["J"]
["K"]
["L"]
["M"]
["N"]
["O"]
["P"]
["Q"]
[]
[]
[]
[]
[]
[]
[]
[]
[]
[]
[]
[]
[]
[]
[]
[]
[]
[]
[]
[]
[]
[]
[]
[]
[]
[]
[]
[]
[]
[]
[]
[]
[]
[]
[]
[]
[]
[]
[]
[]
[]
[]
[]
["DAMIENFFB8POOL"]

{"sheet":"Inscrits","index":2,"n_rows":33,"n_cols":12,"rows_kept":33,"cut":false,"hidden":false,"merged":[[0,11,1,11],[8,11,9,11],[16,11,18,11],[25,11,26,11]]}
["N° Tirage","Nom du Joueur","Classement","Club","N° Licence","Forfait\nNon Excusé","Forfait\nExcusé","Abandon",1,"X",null,1]
[1,"DUARTE JOSE",1,{"$f":"IFERROR(VLOOKUP(B2,LINSTING,3,FALSE),\"\")","v":"ACADEMIE DE BILLARD DE LA VALSERINE"},{"$f":"IFERROR(VLOOKUP(B2,LINSTING,2,FALSE),\"\")","v":"146968Y"},null,"-",null,2,"-"]
[2,"CENDRIER DAVID",2,{"$f":"IFERROR(VLOOKUP(B3,LINSTING,3,FALSE),\"\")","v":"ASSOCIATION DU LAKE PUB 74"},"104768O",null,"-",null,3]
[3,"DE ALMEIDA DUARTE FREDERICO",3,"BILLARD CLUB DE CLARAFOND ARCINE","146972C",null,"-",null,4]
[4,"MONTPELLIER BRUNO",6,"BILLARD CLUB 8 POOL EVIAN","149875H",null,"-",null,5]
[5,"GROS ERIC",7,"ASSOCIATION DU LAKE PUB 74","145231V",null,"-",null,6]
[6,"TASSET JEROME",8,"CLUB CHAMBERIEN DE BILLARD","156368Q",null,"-",null,7]
[7,"BABEL STEPHANIE",9,"BILLARD CLUB DE CLARAFOND ARCINE","159062T",null,"-",null,8]
[8,"CARNIATO LORENZO",11,"BILLARD CLUB 8 POOL EVIAN","107379Z",null,"-",null,9,null,null,2]
[9,"BERRAHOU SOLANGE",12,"ACADEMIE DE BILLARD DE LA VALSERINE","153217Q",null,"-",null,10]
[10,"SENES A MARIO",13,"ASSOCIATION DU LAKE PUB 74","145232W",null,"-",null,11]
[11,"SOCKEEL AURORE",14,"BILLARD CLUB DE CLARAFOND ARCINE","157214K",null,"-",null,12]
[12,"SOCKEEL YANNICK",16,"BILLARD CLUB DE CLARAFOND ARCINE","159064W",null,"-",null,13]
[13,"SOCKEEL MARIE PIERRE",17,"BILLARD CLUB DE CLARAFOND ARCINE","159065X",null,"-",null,14]
[14,"BESSON JEROME",18,"BILLARD CLUB DE CLARAFOND ARCINE","150947Y",null,"-",null,15]
[15,"DURET CHRISTOPHE",24,"CLUB CHAMBERIEN DE BILLARD","105704O",null,"-",null,16]
[16,"BALHAND SEBASTIEN",26,"CLUB CHAMBERIEN DE BILLARD","160643M",null,"-",null,17,null,null,"OU"]
[17,"ADON MARC OLIVIER",31,"ACADEMIE DE BILLARD DE LA VALSERINE","161258F",null,"-",null,18]
[18,"SUDARA BRUNO",33,"CLUB CHAMBERIEN DE BILLARD","156581X",null,"-",null,19]
[19,"TRIPLET FREDERIC",43,"CLUB CHAMBERIEN DE BILLARD","162070N",null,"-",null,20]
[20,"GIRARD FREDERIC",44,"BILLARD CLUB 8 POOL EVIAN","149917D",null,"-",null,21]
[21,"GOSSUIN JUSTINE",46,"BILLARD CLUB DE CLARAFOND ARCINE","155699N",null,"-",null,22]
[22,"TRABICHET CHRISTOPHE",47,"BILLARD CLUB 8 POOL EVIAN","152028Y",null,"-",null,23]
[23,"AARAB LAHOUSINE","NC","CLUB CHAMBERIEN DE BILLARD","163282F",null,"-",null,24]
[24,"KEBE MAMADOU","NC","CLUB CHAMBERIEN DE BILLARD","162803K",null,"-",null,25]
[25,"KUSAR TONY","NC","BILLARD CLUB DE CLARAFOND ARCINE","155700P",null,"-",null,26,null,null,3]
[26,"ELAMRI JAAFAR","NC","BILLARD CLUB 8 POOL EVIAN","160859X",null,"-",null,27]
[27,"Blanc 1",null,"","",null,"-",null,28]
[28,"Blanc 2",null,null,null,null,"-",null,29]
[29,"Blanc 3",null,null,null,null,"-",null,30]
[30,"Blanc 4",null,null,null,null,"-",null,31]
[31,"Blanc 5",null,null,null,null,"-",null,32]
[32,"Blanc 6",null,null,null,null,"-"]

{"sheet":"1","index":3,"n_rows":21,"n_cols":45,"rows_kept":21,"cut":false,"hidden":false,"merged":[[20,9,21,17],[12,1,12,2],[1,42,1,45],[11,42,11,45],[10,20,10,21],[0,9,1,17]]}
[null,null,null,null,null,null,null,null,null,{"$f":"\"(\"&Accueil!D18&\" manches côté gagnant)\"","v":"(3 manches côté gagnant)"}]
[null,null,null,null,null,null,null,null,null,null,null,null,null,null,null,null,null,null,null,null,null,null,null,null,null,null,null,null,null,null,null,null,null,null,null,null,null,null,null,null,null,null,"QUALIFIES"]
[null,null,null,null,null,null,null,null,null,null,"P1",1,{"$f":"IF(IF(ISNA(VLOOKUP(L3,Inscrits!$A$2:$C$33,2,FALSE)),\"\",VLOOKUP(L3,Inscrits!$A$2:$C$33,2,FALSE))=0,\"\",IF(ISNA(VLOOKUP(L3,Inscrits!$A$2:$C$33,2,FALSE)),\"\",VLOOKUP(L3,Inscrits!$A$2:$C$33,2,FALSE)))","v":"DUARTE JOSE"},{"$f":"IF(IF(ISNA(VLOOKUP(L3,Inscrits!$A$2:$C$33,3,FALSE)),\"\",\"(\"&(VLOOKUP(L3,Inscrits!$A$2:$C$33,3,FALSE))&\")\")=\"()\",\"\",IF(ISNA(VLOOKUP(L3,Inscrits!$A$2:$C$33,3,FALSE)),\"\",\"(\"&(VLOOKUP(L3,Inscrits!$A$2:$C$33,3,FALSE))&\")\"))","v":"(1)"},null,null,"G1",null,null,null,null,null,null,null,null,null,null,null,"G","P","G","P","G","P","G","P","G","P","G","P","Ga",null,null,"NOM","Ga"]
[null,null,null,null,null,null,null,null,"F",{"$f":"IF(OR(AND(O3=\"F\",O5=\"F\"),AND(O3=\"A\",O5=\"A\")),M5,IF(OR(O3=\"F\",O3=\"A\"),M3,IF(OR(O5=\"F\",O5=\"A\"),M5,IF(O3=O5,\"\",(IF(O3<O5,M3,M5))))))","v":"Blanc 6"},{"$f":"IF(OR(AND(O3=\"F\",O5=\"F\"),AND(O3=\"A\",O5=\"A\")),N5,IF(OR(O3=\"F\",O3=\"A\"),N3,IF(OR(O5=\"F\",O5=\"A\"),N5,IF(O3=O5,\"\",(IF(O3<O5,N3,N5))))))","v":""},null,"Match 1 - Billard",null,null,null,{"$f":"IF(OR(AND(O3=\"F\",O5=\"F\"),AND(O3=\"A\",O5=\"A\")),M3,IF(OR(O3=\"F\",O3=\"A\"),M5,IF(OR(O5=\"F\",O5=\"A\"),M3,IF(O3=O5,\"\",(IF(O3>O5,M3,M5))))))","v":"DUARTE JOSE"},{"$f":"IF(OR(AND(O3=\"F\",O5=\"F\"),AND(O3=\"A\",O5=\"A\")),N3,IF(OR(O3=\"F\",O3=\"A\"),N5,IF(OR(O5=\"F\",O5=\"A\"),N3,IF(O3=O5,\"\",(IF(O3>O5,N3,N5))))))","v":"(1)"},null,null,null,null,null,null,1,{"$f":"IF(U6=\"\",\"\",IF(U6=Q4,Q4,Q8))","v":""},null,{"$f":"M3","v":"DUARTE JOSE"},{"$f":"IF(AB4=M3,IF(O5=\"F\",\"\",O3),0)","v":""},{"$f":"IF(AB4=M3,IF(O3=\"F\",\"\",O5),0)","v":"F"},{"$f":"IF(AB4=Q4,IF(S8=\"F\",\"\",S4),0)","v":0},{"$f":"IF(AB4=Q4,IF(S4=\"F\",\"\",S8),0)","v":0},{"$f":"IF(AB4=J4,IF(I8=\"F\",\"\",I4),0)","v":0},{"$f":"IF(AB4=J4,IF(I4=\"F\",\"\",I8),0)","v":0},{"$f":"IF(AB4=F6,IF(E10=\"F\",\"\",E6),0)","v":0},{"$f":"IF(AB4=F6,IF(E6=\"F\",\"\",E10),0)","v":0},{"$f":"IF(AB4=F20,IF(E16=\"F\",\"\",E20),0)","v":0},{"$f":"IF(AB4=F20,IF(E20=\"F\",\"\",E16),0)","v":0},{"$f":"SUM(AC4,AE4,AG4,AI4,AK4)","v":0},0,{"$f":"AM4-AN4","v":0},null,null,{"$f":"Z4","v":""},{"$f":"IF(AR4=\"\",\"\",(VLOOKUP(AR4,AB4:AO17,14,FALSE)))","v":""}]
[null,null,null,null,null,null,"G7",null,null,null,null,32,{"$f":"IF(IF(ISNA(VLOOKUP(L5,Inscrits!$A$2:$C$33,2,FALSE)),\"\",VLOOKUP(L5,Inscrits!$A$2:$C$33,2,FALSE))=0,\"\",IF(ISNA(VLOOKUP(L5,Inscrits!$A$2:$C$33,2,FALSE)),\"\",VLOOKUP(L5,Inscrits!$A$2:$C$33,2,FALSE)))","v":"Blanc 6"},{"$f":"IF(IF(ISNA(VLOOKUP(L5,Inscrits!$A$2:$C$33,3,FALSE)),\"\",\"(\"&(VLOOKUP(L5,Inscrits!$A$2:$C$33,3,FALSE))&\")\")=\"()\",\"\",IF(ISNA(VLOOKUP(L5,Inscrits!$A$2:$C$33,3,FALSE)),\"\",\"(\"&(VLOOKUP(L5,Inscrits!$A$2:$C$33,3,FALSE))&\")\"))","v":""},"F",null,null,null,null,null,"G5",null,null,null,3,{"$f":"IF(B8=\"\",\"\",IF(B8=F6,F6,F10))","v":""},null,{"$f":"M5","v":"Blanc 6"},{"$f":"IF(AB5=M5,IF(O3=\"F\",\"\",O5),0)","v":"F"},{"$f":"IF(AB5=M5,IF(O5=\"F\",\"\",O3),0)","v":""},{"$f":"IF(AB5=Q4,IF(S8=\"F\",\"\",S4),0)","v":0},{"$f":"IF(AB5=Q4,IF(S4=\"F\",\"\",S8),0)","v":0},{"$f":"IF(AB5=J4,IF(I8=\"F\",\"\",I4),0)","v":"F"},{"$f":"IF(AB5=J4,IF(I4=\"F\",\"\",I8),0)","v":""},{"$f":"IF(AB5=F6,IF(E10=\"F\",\"\",E6),0)","v":0},{"$f":"IF(AB5=F6,IF(E6=\"F\",\"\",E10),0)","v":0},{"$f":"IF(AB5=F20,IF(E16=\"F\",\"\",E20),0)","v":0},{"$f":"IF(AB5=F20,IF(E20=\"F\",\"\",E16),0)","v":0},0,0,{"$f":"AM5-AN5","v":0},null,null,{"$f":"Z14","v":""},{"$f":"IF(AR5=\"\",\"\",(VLOOKUP(AR5,AB4:AO17,14,FALSE)))","v":""}]
[null,null,null,null,null,{"$f":"IF(OR(I4=\"F\",I4=\"A\"),J8,IF(OR(I8=\"F\",I8=\"A\"),J4,IF(I4=I8,\"\",(IF(I4>I8,J4,J8)))))","v":""},{"$f":"IF(OR(I4=\"F\",I4=\"A\"),K8,IF(OR(I8=\"F\",I8=\"A\"),K4,IF(I4=I8,\"\",(IF(I4>I8,K4,K8)))))","v":""},null,null,"Match 7 - Billard",null,null,null,null,null,null,"Match 5 - Billard",null,null,null,{"$f":"IF(OR(S4=\"F\",S4=\"A\"),Q8,IF(OR(S8=\"F\",S8=\"A\"),Q4,IF(S4=S8,\"\",(IF(S4>S8,Q4,Q8)))))","v":""},{"$f":"IF(OR(S4=\"F\",S4=\"A\"),R8,IF(OR(S8=\"F\",S8=\"A\"),R4,IF(S4=S8,\"\",(IF(S4>S8,R4,R8)))))","v":""},"A",null,5,{"$f":"IF(B8=\"\",\"\",IF(B8=F6,F10,F6))","v":""},null,{"$f":"M7","v":"ADON MARC OLIVIER"},{"$f":"IF(AB6=M7,IF(O9=\"F\",\"\",O7),0)","v":0},{"$f":"IF(AB6=M7,IF(O7=\"F\",\"\",O9),0)","v":0},{"$f":"IF(AB6=Q8,IF(S4=\"F\",\"\",S8),0)","v":0},{"$f":"IF(AB6=Q8,IF(S8=\"F\",\"\",S4),0)","v":0},{"$f":"IF(AB6=J8,IF(I4=\"F\",\"\",I8),0)","v":0},{"$f":"IF(AB6=J8,IF(I8=\"F\",\"\",I4),0)","v":0},{"$f":"IF(AB6=F6,IF(E10=\"F\",\"\",E6),0)","v":0},{"$f":"IF(AB6=F6,IF(E6=\"F\",\"\",E10),0)","v":0},{"$f":"IF(AB6=F20,IF(E16=\"F\",\"\",E20),0)","v":0},{"$f":"IF(AB6=F20,IF(E20=\"F\",\"\",E16),0)","v":0},0,0,{"$f":"AM6-AN6","v":0},null,null,{"$f":"Z5","v":""},{"$f":"IF(AR6=\"\",\"\",(VLOOKUP(AR6,AB4:AO17,14,FALSE)))","v":""}]
[null,null,"G9",null,null,null,null,null,null,null,null,17,{"$f":"IF(IF(ISNA(VLOOKUP(L7,Inscrits!$A$2:$C$33,2,FALSE)),\"\",VLOOKUP(L7,Inscrits!$A$2:$C$33,2,FALSE))=0,\"\",IF(ISNA(VLOOKUP(L7,Inscrits!$A$2:$C$33,2,FALSE)),\"\",VLOOKUP(L7,Inscrits!$A$2:$C$33,2,FALSE)))","v":"ADON MARC OLIVIER"},{"$f":"IF(IF(ISNA(VLOOKUP(L7,Inscrits!$A$2:$C$33,3,FALSE)),\"\",\"(\"&(VLOOKUP(L7,Inscrits!$A$2:$C$33,3,FALSE))&\")\")=\"()\",\"\",IF(ISNA(VLOOKUP(L7,Inscrits!$A$2:$C$33,3,FALSE)),\"\",\"(\"&(VLOOKUP(L7,Inscrits!$A$2:$C$33,3,FALSE))&\")\"))","v":"(31)"},null,null,null,null,null,null,null,null,null,null,7,{"$f":"IF(F6=\"\",\"\",IF(F6=J4,J8,J4))","v":""},null,{"$f":"M9","v":"BALHAND SEBASTIEN"},{"$f":"IF(AB7=M9,IF(O7=\"F\",\"\",O9),0)","v":0},{"$f":"IF(AB7=M9,IF(O9=\"F\",\"\",O7),0)","v":0},{"$f":"IF(AB7=Q8,IF(S4=\"F\",\"\",S8),0)","v":0},{"$f":"IF(AB7=Q8,IF(S8=\"F\",\"\",S4),0)","v":0},{"$f":"IF(AB7=J8,IF(I4=\"F\",\"\",I8),0)","v":0},{"$f":"IF(AB7=J8,IF(I8=\"F\",\"\",I4),0)","v":0},{"$f":"IF(AB7=F6,IF(E10=\"F\",\"\",E6),0)","v":0},{"$f":"IF(AB7=F6,IF(E6=\"F\",\"\",E10),0)","v":0},{"$f":"IF(AB7=F20,IF(E16=\"F\",\"\",E20),0)","v":0},{"$f":"IF(AB7=F20,IF(E20=\"F\",\"\",E16),0)","v":0},0,0,{"$f":"AM7-AN7","v":0},null,null,{"$f":"Z15","v":""},{"$f":"IF(AR7=\"\",\"\",(VLOOKUP(AR7,AB4:AO17,14,FALSE)))","v":""}]
["S",{"$f":"IF(OR(E6=\"F\",E6=\"A\"),F10,IF(OR(E10=\"F\",E10=\"A\"),F6,IF(E6=E10,\"\",(IF(E6>E10,F6,F10)))))","v":""},{"$f":"IF(OR(E6=\"F\",E6=\"A\"),G10,IF(OR(E10=\"F\",E10=\"A\"),G6,IF(E6=E10,\"\",(IF(E6>E10,G6,G10)))))","v":""},null,null,"Match 9 - Billard",null,null,null,{"$f":"IF(OR(AND(O7=\"F\",O9=\"F\"),AND(O7=\"A\",O9=\"A\")),M9,IF(OR(O7=\"F\",O7=\"A\"),M7,IF(OR(O9=\"F\",O9=\"A\"),M9,IF(O7=O9,\"\",(IF(O7<O9,M7,M9))))))","v":""},{"$f":"IF(OR(AND(O7=\"F\",O9=\"F\"),AND(O7=\"A\",O9=\"A\")),N9,IF(OR(O7=\"F\",O7=\"A\"),N7,IF(OR(O9=\"F\",O9=\"A\"),N9,IF(O7=O9,\"\",(IF(O7<O9,N7,N9))))))","v":""},null,"Match 2 - Billard",null,null,null,{"$f":"IF(OR(AND(O7=\"F\",O9=\"F\"),AND(O7=\"A\",O9=\"A\")),M7,IF(OR(O7=\"F\",O7=\"A\"),M9,IF(OR(O9=\"F\",O9=\"A\"),M7,IF(O7=O9,\"\",(IF(O7>O9,M7,M9))))))","v":""},{"$f":"IF(OR(AND(O7=\"F\",O9=\"F\"),AND(O7=\"A\",O9=\"A\")),N7,IF(OR(O7=\"F\",O7=\"A\"),N9,IF(OR(O9=\"F\",O9=\"A\"),N7,IF(O7=O9,\"\",(IF(O7>O9,N7,N9))))))","v":""}]
[null,null,null,null,null,null,null,null,null,null,"P2",16,{"$f":"IF(IF(ISNA(VLOOKUP(L9,Inscrits!$A$2:$C$33,2,FALSE)),\"\",VLOOKUP(L9,Inscrits!$A$2:$C$33,2,FALSE))=0,\"\",IF(ISNA(VLOOKUP(L9,Inscrits!$A$2:$C$33,2,FALSE)),\"\",VLOOKUP(L9,Inscrits!$A$2:$C$33,2,FALSE)))","v":"BALHAND SEBASTIEN"},{"$f":"IF(IF(ISNA(VLOOKUP(L9,Inscrits!$A$2:$C$33,3,FALSE)),\"\",\"(\"&(VLOOKUP(L9,Inscrits!$A$2:$C$33,3,FALSE))&\")\")=\"()\",\"\",IF(ISNA(VLOOKUP(L9,Inscrits!$A$2:$C$33,3,FALSE)),\"\",\"(\"&(VLOOKUP(L9,Inscrits!$A$2:$C$33,3,FALSE))&\")\"))","v":"(26)"},null,null,"G2"]
[null,null,null,null,null,{"$f":"IF(OR(S14=\"F\",S14=\"A\"),Q14,IF(OR(S18=\"F\",S18=\"A\"),Q18,IF(S14=S18,\"\",(IF(S14<S18,Q14,Q18)))))","v":""},{"$f":"IF(OR(S14=\"F\",S14=\"A\"),R14,IF(OR(S18=\"F\",S18=\"A\"),R18,IF(S14=S18,\"\",(IF(S14<S18,R14,R18)))))","v":""}]
[null,null,null,null,null,null,"P6",null,null,null,null,null,null,null,null,null,null,null,null,null,"QUALIFIES"]
[null,null,null,null,null,null,null,null,null,null,null,null,null,null,null,null,null,null,null,null,null,null,null,null,null,null,null,null,null,null,null,null,null,null,null,null,null,null,null,null,null,null,"ELIMINES"]
[null,"QUALIFIES",null,null,null,null,null,null,null,null,"P3",9,{"$f":"IF(IF(ISNA(VLOOKUP(L13,Inscrits!$A$2:$C$33,2,FALSE)),\"\",VLOOKUP(L13,Inscrits!$A$2:$C$33,2,FALSE))=0,\"\",IF(ISNA(VLOOKUP(L13,Inscrits!$A$2:$C$33,2,FALSE)),\"\",VLOOKUP(L13,Inscrits!$A$2:$C$33,2,FALSE)))","v":"BERRAHOU SOLANGE"},{"$f":"IF(IF(ISNA(VLOOKUP(L13,Inscrits!$A$2:$C$33,3,FALSE)),\"\",\"(\"&(VLOOKUP(L13,Inscrits!$A$2:$C$33,3,FALSE))&\")\")=\"()\",\"\",IF(ISNA(VLOOKUP(L13,Inscrits!$A$2:$C$33,3,FALSE)),\"\",\"(\"&(VLOOKUP(L13,Inscrits!$A$2:$C$33,3,FALSE))&\")\"))","v":"(12)"},null,null,"G3",null,null,null,null,null,null,null,null,null,null,null,"G","P","G","P","G","P","G","P","G","P","G","P","Ga",null,null,"NOM","Ga"]
[null,null,null,null,null,null,null,null,null,{"$f":"IF(OR(AND(O13=\"F\",O15=\"F\"),AND(O13=\"A\",O15=\"A\")),M15,IF(OR(O13=\"F\",O13=\"A\"),M13,IF(OR(O15=\"F\",O15=\"A\"),M15,IF(O13=O15,\"\",(IF(O13<O15,M13,M15))))))","v":""},{"$f":"IF(OR(AND(O13=\"F\",O15=\"F\"),AND(O13=\"A\",O15=\"A\")),N15,IF(OR(O13=\"F\",O13=\"A\"),N13,IF(OR(O15=\"F\",O15=\"A\"),N15,IF(O13=O15,\"\",(IF(O13<O15,N13,N15))))))","v":""},null,"Match 3 - Billard",null,null,null,{"$f":"IF(OR(AND(O13=\"F\",O15=\"F\"),AND(O13=\"A\",O15=\"A\")),M13,IF(OR(O13=\"F\",O13=\"A\"),M15,IF(OR(O15=\"F\",O15=\"A\"),M13,IF(O13=O15,\"\",(IF(O13>O15,M13,M15))))))","v":""},{"$f":"IF(OR(AND(O13=\"F\",O15=\"F\"),AND(O13=\"A\",O15=\"A\")),N13,IF(OR(O13=\"F\",O13=\"A\"),N15,IF(OR(O15=\"F\",O15=\"A\"),N13,IF(O13=O15,\"\",(IF(O13>O15,N13,N15))))))","v":""},null,null,null,null,null,null,2,{"$f":"IF(U16=\"\",\"\",IF(U16=Q14,Q14,Q18))","v":""},null,{"$f":"M13","v":"BERRAHOU SOLANGE"},{"$f":"IF(AB14=M13,IF(O15=\"F\",\"\",O13),0)","v":0},{"$f":"IF(AB14=M13,IF(O13=\"F\",\"\",O15),0)","v":0},{"$f":"IF(AB14=Q14,IF(S18=\"F\",\"\",S14),0)","v":0},{"$f":"IF(AB14=Q14,IF(S14=\"F\",\"\",S18),0)","v":0},{"$f":"IF(AB14=J14,IF(I18=\"F\",\"\",I14),0)","v":0},{"$f":"IF(AB14=J14,IF(I14=\"F\",\"\",I18),0)","v":0},{"$f":"IF(AB14=F16,IF(E20=\"F\",\"\",E16),0)","v":0},{"$f":"IF(AB14=F16,IF(E16=\"F\",\"\",E20),0)","v":0},{"$f":"IF(AB14=F10,IF(E6=\"F\",\"\",E10),0)","v":0},{"$f":"IF(AB14=F10,IF(E10=\"F\",\"\",E6),0)","v":0},{"$f":"SUM(AC14,AE14,AG14,AI14,AK14)","v":0},0,{"$f":"AM14-AN14","v":0},null,null,{"$f":"Z6","v":""},{"$f":"IF(AR14=\"\",\"\",(VLOOKUP(AR14,AB4:AO17,14,FALSE)))","v":""}]
[null,null,null,null,null,null,"G8",null,null,null,null,24,{"$f":"IF(IF(ISNA(VLOOKUP(L15,Inscrits!$A$2:$C$33,2,FALSE)),\"\",VLOOKUP(L15,Inscrits!$A$2:$C$33,2,FALSE))=0,\"\",IF(ISNA(VLOOKUP(L15,Inscrits!$A$2:$C$33,2,FALSE)),\"\",VLOOKUP(L15,Inscrits!$A$2:$C$33,2,FALSE)))","v":"KEBE MAMADOU"},{"$f":"IF(IF(ISNA(VLOOKUP(L15,Inscrits!$A$2:$C$33,3,FALSE)),\"\",\"(\"&(VLOOKUP(L15,Inscrits!$A$2:$C$33,3,FALSE))&\")\")=\"()\",\"\",IF(ISNA(VLOOKUP(L15,Inscrits!$A$2:$C$33,3,FALSE)),\"\",\"(\"&(VLOOKUP(L15,Inscrits!$A$2:$C$33,3,FALSE))&\")\"))","v":"(NC)"},null,null,null,null,null,null,"G6",null,null,null,4,{"$f":"IF(B18=\"\",\"\",IF(B18=F16,F16,F20))","v":""},null,{"$f":"M15","v":"KEBE MAMADOU"},{"$f":"IF(AB15=M15,IF(O13=\"F\",\"\",O15),0)","v":0},{"$f":"IF(AB15=M15,IF(O15=\"F\",\"\",O13),0)","v":0},{"$f":"IF(AB15=Q14,IF(S18=\"F\",\"\",S14),0)","v":0},{"$f":"IF(AB15=Q14,IF(S14=\"F\",\"\",S18),0)","v":0},{"$f":"IF(AB15=J14,IF(I18=\"F\",\"\",I14),0)","v":0},{"$f":"IF(AB15=J14,IF(I14=\"F\",\"\",I18),0)","v":0},{"$f":"IF(AB15=F16,IF(E20=\"F\",\"\",E16),0)","v":0},{"$f":"IF(AB15=F16,IF(E16=\"F\",\"\",E20),0)","v":0},{"$f":"IF(AB15=F10,IF(E6=\"F\",\"\",E10),0)","v":0},{"$f":"IF(AB15=F10,IF(E10=\"F\",\"\",E6),0)","v":0},0,0,{"$f":"AM15-AN15","v":0},null,null,{"$f":"Z16","v":""},{"$f":"IF(AR15=\"\",\"\",(VLOOKUP(AR15,AB4:AO17,14,FALSE)))","v":""}]
[null,null,null,null,null,{"$f":"IF(OR(I14=\"F\",I14=\"A\"),J18,IF(OR(I18=\"F\",I18=\"A\"),J14,IF(I14=I18,\"\",(IF(I14>I18,J14,J18)))))","v":""},{"$f":"IF(OR(I14=\"F\",I14=\"A\"),K18,IF(OR(I18=\"F\",I18=\"A\"),K14,IF(I14=I18,\"\",(IF(I14>I18,K14,K18)))))","v":""},null,null,"Match 8 - Billard",null,null,null,null,null,null,"Match 6 - Billard",null,null,null,{"$f":"IF(OR(S14=\"F\",S14=\"A\"),Q18,IF(OR(S18=\"F\",S18=\"A\"),Q14,IF(S14=S18,\"\",(IF(S14>S18,Q14,Q18)))))","v":""},{"$f":"IF(OR(S14=\"F\",S14=\"A\"),R18,IF(OR(S18=\"F\",S18=\"A\"),R14,IF(S14=S18,\"\",(IF(S14>S18,R14,R18)))))","v":""},"B",null,6,{"$f":"IF(B18=\"\",\"\",IF(B18=F16,F20,F16))","v":""},null,{"$f":"M17","v":"KUSAR TONY"},{"$f":"IF(AB16=M17,IF(O19=\"F\",\"\",O17),0)","v":0},{"$f":"IF(AB16=M17,IF(O17=\"F\",\"\",O19),0)","v":0},{"$f":"IF(AB16=Q18,IF(S14=\"F\",\"\",S18),0)","v":0},{"$f":"IF(AB16=Q18,IF(S18=\"F\",\"\",S14),0)","v":0},{"$f":"IF(AB16=J18,IF(I14=\"F\",\"\",I18),0)","v":0},{"$f":"IF(AB16=J18,IF(I18=\"F\",\"\",I14),0)","v":0},{"$f":"IF(AB16=F16,IF(E20=\"F\",\"\",E16),0)","v":0},{"$f":"IF(AB16=F16,IF(E16=\"F\",\"\",E20),0)","v":0},{"$f":"IF(AB16=F10,IF(E6=\"F\",\"\",E10),0)","v":0},{"$f":"IF(AB16=F10,IF(E10=\"F\",\"\",E6),0)","v":0},0,0,{"$f":"AM16-AN16","v":0},null,null,{"$f":"Z7","v":""},{"$f":"IF(AR16=\"\",\"\",(VLOOKUP(AR16,AB4:AO17,14,FALSE)))","v":""}]
[null,null,"G10",null,null,null,null,null,null,null,null,25,{"$f":"IF(IF(ISNA(VLOOKUP(L17,Inscrits!$A$2:$C$33,2,FALSE)),\"\",VLOOKUP(L17,Inscrits!$A$2:$C$33,2,FALSE))=0,\"\",IF(ISNA(VLOOKUP(L17,Inscrits!$A$2:$C$33,2,FALSE)),\"\",VLOOKUP(L17,Inscrits!$A$2:$C$33,2,FALSE)))","v":"KUSAR TONY"},{"$f":"IF(IF(ISNA(VLOOKUP(L17,Inscrits!$A$2:$C$33,3,FALSE)),\"\",\"(\"&(VLOOKUP(L17,Inscrits!$A$2:$C$33,3,FALSE))&\")\")=\"()\",\"\",IF(ISNA(VLOOKUP(L17,Inscrits!$A$2:$C$33,3,FALSE)),\"\",\"(\"&(VLOOKUP(L17,Inscrits!$A$2:$C$33,3,FALSE))&\")\"))","v":"(NC)"},null,null,null,null,null,null,null,null,null,null,8,{"$f":"IF(F16=\"\",\"\",IF(F16=J14,J18,J14))","v":""},null,{"$f":"M19","v":"CARNIATO LORENZO"},{"$f":"IF(AB17=M19,IF(O17=\"F\",\"\",O19),0)","v":0},{"$f":"IF(AB17=M19,IF(O19=\"F\",\"\",O17),0)","v":0},{"$f":"IF(AB17=Q18,IF(S14=\"F\",\"\",S18),0)","v":0},{"$f":"IF(AB17=Q18,IF(S18=\"F\",\"\",S14),0)","v":0},{"$f":"IF(AB17=J18,IF(I14=\"F\",\"\",I18),0)","v":0},{"$f":"IF(AB17=J18,IF(I18=\"F\",\"\",I14),0)","v":0},{"$f":"IF(AB17=F16,IF(E20=\"F\",\"\",E16),0)","v":0},{"$f":"IF(AB17=F16,IF(E16=\"F\",\"\",E20),0)","v":0},{"$f":"IF(AB17=F10,IF(E6=\"F\",\"\",E10),0)","v":0},{"$f":"IF(AB17=F10,IF(E10=\"F\",\"\",E6),0)","v":0},0,{"$f":"SUM(AD17,AF17,AH17,AJ17,AL17)","v":0},{"$f":"AM17-AN17","v":0},null,null,{"$f":"Z17","v":""},{"$f":"IF(AR17=\"\",\"\",(VLOOKUP(AR17,AB4:AO17,14,FALSE)))","v":""}]
["T",{"$f":"IF(OR(E16=\"F\",E16=\"A\"),F20,IF(OR(E20=\"F\",E20=\"A\"),F16,IF(E16=E20,\"\",(IF(E16>E20,F16,F20)))))","v":""},{"$f":"IF(OR(E16=\"F\",E16=\"A\"),G20,IF(OR(E20=\"F\",E20=\"A\"),G16,IF(E16=E20,\"\",(IF(E16>E20,G16,G20)))))","v":""},null,null,"Match 10 - Billard",null,null,null,{"$f":"IF(OR(AND(O17=\"F\",O19=\"F\"),AND(O17=\"A\",O19=\"A\")),M19,IF(OR(O17=\"F\",O17=\"A\"),M17,IF(OR(O19=\"F\",O19=\"A\"),M19,IF(O17=O19,\"\",(IF(O17<O19,M17,M19))))))","v":""},{"$f":"IF(OR(AND(O17=\"F\",O19=\"F\"),AND(O17=\"A\",O19=\"A\")),N19,IF(OR(O17=\"F\",O17=\"A\"),N17,IF(OR(O19=\"F\",O19=\"A\"),N19,IF(O17=O19,\"\",(IF(O17<O19,N17,N19))))))","v":""},null,"Match 4 - Billard",null,null,null,{"$f":"IF(OR(AND(O17=\"F\",O19=\"F\"),AND(O17=\"A\",O19=\"A\")),M17,IF(OR(O17=\"F\",O17=\"A\"),M19,IF(OR(O19=\"F\",O19=\"A\"),M17,IF(O17=O19,\"\",(IF(O17>O19,M17,M19))))))","v":""},{"$f":"IF(OR(AND(O17=\"F\",O19=\"F\"),AND(O17=\"A\",O19=\"A\")),N17,IF(OR(O17=\"F\",O17=\"A\"),N19,IF(OR(O19=\"F\",O19=\"A\"),N17,IF(O17=O19,\"\",(IF(O17>O19,N17,N19))))))","v":""}]
[null,null,null,null,null,null,null,null,null,null,"P4",8,{"$f":"IF(IF(ISNA(VLOOKUP(L19,Inscrits!$A$2:$C$33,2,FALSE)),\"\",VLOOKUP(L19,Inscrits!$A$2:$C$33,2,FALSE))=0,\"\",IF(ISNA(VLOOKUP(L19,Inscrits!$A$2:$C$33,2,FALSE)),\"\",VLOOKUP(L19,Inscrits!$A$2:$C$33,2,FALSE)))","v":"CARNIATO LORENZO"},{"$f":"IF(IF(ISNA(VLOOKUP(L19,Inscrits!$A$2:$C$33,3,FALSE)),\"\",\"(\"&(VLOOKUP(L19,Inscrits!$A$2:$C$33,3,FALSE))&\")\")=\"()\",\"\",IF(ISNA(VLOOKUP(L19,Inscrits!$A$2:$C$33,3,FALSE)),\"\",\"(\"&(VLOOKUP(L19,Inscrits!$A$2:$C$33,3,FALSE))&\")\"))","v":"(11)"},null,null,"G4"]
[null,null,null,null,null,{"$f":"IF(OR(S4=\"F\",S4=\"A\"),Q4,IF(OR(S8=\"F\",S8=\"A\"),Q8,IF(S4=S8,\"\",(IF(S4<S8,Q4,Q8)))))","v":""},{"$f":"IF(OR(S4=\"F\",S4=\"A\"),R4,IF(OR(S8=\"F\",S8=\"A\"),R8,IF(S4=S8,\"\",(IF(S4<S8,R4,R8)))))","v":""}]
[null,null,null,null,null,null,"P5",null,null,{"$f":"\"(\"&Accueil!G18&\" manches côté perdant)\"","v":"(3 manches côté perdant)"}]

{"sheet":"2","index":4,"n_rows":21,"n_cols":45,"rows_kept":21,"cut":false,"hidden":false,"merged":[[20,9,21,17],[12,1,12,2],[10,20,10,21],[1,42,1,45],[11,42,11,45],[0,9,1,17]]}
[null,null,null,null,null,null,null,null,null,{"$f":"\"(\"&Accueil!D18&\" manches côté gagnant)\"","v":"(3 manches côté gagnant)"}]
[null,null,null,null,null,null,null,null,null,null,null,null,null,null,null,null,null,null,null,null,null,null,null,null,null,null,null,null,null,null,null,null,null,null,null,null,null,null,null,null,null,null,"QUALIFIES"]
[null,null,null,null,null,null,null,null,null,null,"P1",5,{"$f":"IF(IF(ISNA(VLOOKUP(L3,Inscrits!$A$2:$C$33,2,FALSE)),\"\",VLOOKUP(L3,Inscrits!$A$2:$C$33,2,FALSE))=0,\"\",IF(ISNA(VLOOKUP(L3,Inscrits!$A$2:$C$33,2,FALSE)),\"\",VLOOKUP(L3,Inscrits!$A$2:$C$33,2,FALSE)))","v":"GROS ERIC"},{"$f":"IF(IF(ISNA(VLOOKUP(L3,Inscrits!$A$2:$C$33,3,FALSE)),\"\",\"(\"&(VLOOKUP(L3,Inscrits!$A$2:$C$33,3,FALSE))&\")\")=\"()\",\"\",IF(ISNA(VLOOKUP(L3,Inscrits!$A$2:$C$33,3,FALSE)),\"\",\"(\"&(VLOOKUP(L3,Inscrits!$A$2:$C$33,3,FALSE))&\")\"))","v":"(7)"},null,null,"G1",null,null,null,null,null,null,null,null,null,null,null,"G","P","G","P","G","P","G","P","G","P","G","P","Ga",null,null,"NOM","Ga"]
[null,null,null,null,null,null,null,null,"F",{"$f":"IF(OR(AND(O3=\"F\",O5=\"F\"),AND(O3=\"A\",O5=\"A\")),M5,IF(OR(O3=\"F\",O3=\"A\"),M3,IF(OR(O5=\"F\",O5=\"A\"),M5,IF(O3=O5,\"\",(IF(O3<O5,M3,M5))))))","v":"Blanc 2"},{"$f":"IF(OR(AND(O3=\"F\",O5=\"F\"),AND(O3=\"A\",O5=\"A\")),N5,IF(OR(O3=\"F\",O3=\"A\"),N3,IF(OR(O5=\"F\",O5=\"A\"),N5,IF(O3=O5,\"\",(IF(O3<O5,N3,N5))))))","v":""},null,"Match 1 - Billard",null,null,null,{"$f":"IF(OR(AND(O3=\"F\",O5=\"F\"),AND(O3=\"A\",O5=\"A\")),M3,IF(OR(O3=\"F\",O3=\"A\"),M5,IF(OR(O5=\"F\",O5=\"A\"),M3,IF(O3=O5,\"\",(IF(O3>O5,M3,M5))))))","v":"GROS ERIC"},{"$f":"IF(OR(AND(O3=\"F\",O5=\"F\"),AND(O3=\"A\",O5=\"A\")),N3,IF(OR(O3=\"F\",O3=\"A\"),N5,IF(OR(O5=\"F\",O5=\"A\"),N3,IF(O3=O5,\"\",(IF(O3>O5,N3,N5))))))","v":"(7)"},null,null,null,null,null,null,1,{"$f":"IF(U6=\"\",\"\",IF(U6=Q4,Q4,Q8))","v":""},null,{"$f":"M3","v":"GROS ERIC"},{"$f":"IF(AB4=M3,IF(O5=\"F\",\"\",O3),0)","v":""},{"$f":"IF(AB4=M3,IF(O3=\"F\",\"\",O5),0)","v":"F"},{"$f":"IF(AB4=Q4,IF(S8=\"F\",\"\",S4),0)","v":0},{"$f":"IF(AB4=Q4,IF(S4=\"F\",\"\",S8),0)","v":0},{"$f":"IF(AB4=J4,IF(I8=\"F\",\"\",I4),0)","v":0},{"$f":"IF(AB4=J4,IF(I4=\"F\",\"\",I8),0)","v":0},{"$f":"IF(AB4=F6,IF(E10=\"F\",\"\",E6),0)","v":0},{"$f":"IF(AB4=F6,IF(E6=\"F\",\"\",E10),0)","v":0},{"$f":"IF(AB4=F20,IF(E16=\"F\",\"\",E20),0)","v":0},{"$f":"IF(AB4=F20,IF(E20=\"F\",\"\",E16),0)","v":0},{"$f":"SUM(AC4,AE4,AG4,AI4,AK4)","v":0},0,{"$f":"AM4-AN4","v":0},null,null,{"$f":"Z4","v":""},{"$f":"IF(AR4=\"\",\"\",(VLOOKUP(AR4,AB4:AO17,14,FALSE)))","v":""}]
[null,null,null,null,null,null,"G7",null,null,null,null,28,{"$f":"IF(IF(ISNA(VLOOKUP(L5,Inscrits!$A$2:$C$33,2,FALSE)),\"\",VLOOKUP(L5,Inscrits!$A$2:$C$33,2,FALSE))=0,\"\",IF(ISNA(VLOOKUP(L5,Inscrits!$A$2:$C$33,2,FALSE)),\"\",VLOOKUP(L5,Inscrits!$A$2:$C$33,2,FALSE)))","v":"Blanc 2"},{"$f":"IF(IF(ISNA(VLOOKUP(L5,Inscrits!$A$2:$C$33,3,FALSE)),\"\",\"(\"&(VLOOKUP(L5,Inscrits!$A$2:$C$33,3,FALSE))&\")\")=\"()\",\"\",IF(ISNA(VLOOKUP(L5,Inscrits!$A$2:$C$33,3,FALSE)),\"\",\"(\"&(VLOOKUP(L5,Inscrits!$A$2:$C$33,3,FALSE))&\")\"))","v":""},"F",null,null,null,null,null,"G5",null,null,null,3,{"$f":"IF(B8=\"\",\"\",IF(B8=F6,F6,F10))","v":""},null,{"$f":"M5","v":"Blanc 2"},{"$f":"IF(AB5=M5,IF(O3=\"F\",\"\",O5),0)","v":"F"},{"$f":"IF(AB5=M5,IF(O5=\"F\",\"\",O3),0)","v":""},{"$f":"IF(AB5=Q4,IF(S8=\"F\",\"\",S4),0)","v":0},{"$f":"IF(AB5=Q4,IF(S4=\"F\",\"\",S8),0)","v":0},{"$f":"IF(AB5=J4,IF(I8=\"F\",\"\",I4),0)","v":"F"},{"$f":"IF(AB5=J4,IF(I4=\"F\",\"\",I8),0)","v":""},{"$f":"IF(AB5=F6,IF(E10=\"F\",\"\",E6),0)","v":0},{"$f":"IF(AB5=F6,IF(E6=\"F\",\"\",E10),0)","v":0},{"$f":"IF(AB5=F20,IF(E16=\"F\",\"\",E20),0)","v":0},{"$f":"IF(AB5=F20,IF(E20=\"F\",\"\",E16),0)","v":0},0,0,{"$f":"AM5-AN5","v":0},null,null,{"$f":"Z14","v":""},{"$f":"IF(AR5=\"\",\"\",(VLOOKUP(AR5,AB4:AO17,14,FALSE)))","v":""}]
[null,null,null,null,null,{"$f":"IF(OR(I4=\"F\",I4=\"A\"),J8,IF(OR(I8=\"F\",I8=\"A\"),J4,IF(I4=I8,\"\",(IF(I4>I8,J4,J8)))))","v":""},{"$f":"IF(OR(I4=\"F\",I4=\"A\"),K8,IF(OR(I8=\"F\",I8=\"A\"),K4,IF(I4=I8,\"\",(IF(I4>I8,K4,K8)))))","v":""},null,null,"Match 7 - Billard",null,null,null,null,null,null,"Match 5 - Billard",null,null,null,{"$f":"IF(OR(S4=\"F\",S4=\"A\"),Q8,IF(OR(S8=\"F\",S8=\"A\"),Q4,IF(S4=S8,\"\",(IF(S4>S8,Q4,Q8)))))","v":""},{"$f":"IF(OR(S4=\"F\",S4=\"A\"),R8,IF(OR(S8=\"F\",S8=\"A\"),R4,IF(S4=S8,\"\",(IF(S4>S8,R4,R8)))))","v":""},"C",null,5,{"$f":"IF(B8=\"\",\"\",IF(B8=F6,F10,F6))","v":""},null,{"$f":"M7","v":"GOSSUIN JUSTINE"},{"$f":"IF(AB6=M7,IF(O9=\"F\",\"\",O7),0)","v":0},{"$f":"IF(AB6=M7,IF(O7=\"F\",\"\",O9),0)","v":0},{"$f":"IF(AB6=Q8,IF(S4=\"F\",\"\",S8),0)","v":0},{"$f":"IF(AB6=Q8,IF(S8=\"F\",\"\",S4),0)","v":0},{"$f":"IF(AB6=J8,IF(I4=\"F\",\"\",I8),0)","v":0},{"$f":"IF(AB6=J8,IF(I8=\"F\",\"\",I4),0)","v":0},{"$f":"IF(AB6=F6,IF(E10=\"F\",\"\",E6),0)","v":0},{"$f":"IF(AB6=F6,IF(E6=\"F\",\"\",E10),0)","v":0},{"$f":"IF(AB6=F20,IF(E16=\"F\",\"\",E20),0)","v":0},{"$f":"IF(AB6=F20,IF(E20=\"F\",\"\",E16),0)","v":0},0,0,{"$f":"AM6-AN6","v":0},null,null,{"$f":"Z5","v":""},{"$f":"IF(AR6=\"\",\"\",(VLOOKUP(AR6,AB4:AO17,14,FALSE)))","v":""}]
[null,null,"G9",null,null,null,null,null,null,null,null,21,{"$f":"IF(IF(ISNA(VLOOKUP(L7,Inscrits!$A$2:$C$33,2,FALSE)),\"\",VLOOKUP(L7,Inscrits!$A$2:$C$33,2,FALSE))=0,\"\",IF(ISNA(VLOOKUP(L7,Inscrits!$A$2:$C$33,2,FALSE)),\"\",VLOOKUP(L7,Inscrits!$A$2:$C$33,2,FALSE)))","v":"GOSSUIN JUSTINE"},{"$f":"IF(IF(ISNA(VLOOKUP(L7,Inscrits!$A$2:$C$33,3,FALSE)),\"\",\"(\"&(VLOOKUP(L7,Inscrits!$A$2:$C$33,3,FALSE))&\")\")=\"()\",\"\",IF(ISNA(VLOOKUP(L7,Inscrits!$A$2:$C$33,3,FALSE)),\"\",\"(\"&(VLOOKUP(L7,Inscrits!$A$2:$C$33,3,FALSE))&\")\"))","v":"(46)"},null,null,null,null,null,null,null,null,null,null,7,{"$f":"IF(F6=\"\",\"\",IF(F6=J4,J8,J4))","v":""},null,{"$f":"M9","v":"SOCKEEL YANNICK"},{"$f":"IF(AB7=M9,IF(O7=\"F\",\"\",O9),0)","v":0},{"$f":"IF(AB7=M9,IF(O9=\"F\",\"\",O7),0)","v":0},{"$f":"IF(AB7=Q8,IF(S4=\"F\",\"\",S8),0)","v":0},{"$f":"IF(AB7=Q8,IF(S8=\"F\",\"\",S4),0)","v":0},{"$f":"IF(AB7=J8,IF(I4=\"F\",\"\",I8),0)","v":0},{"$f":"IF(AB7=J8,IF(I8=\"F\",\"\",I4),0)","v":0},{"$f":"IF(AB7=F6,IF(E10=\"F\",\"\",E6),0)","v":0},{"$f":"IF(AB7=F6,IF(E6=\"F\",\"\",E10),0)","v":0},{"$f":"IF(AB7=F20,IF(E16=\"F\",\"\",E20),0)","v":0},{"$f":"IF(AB7=F20,IF(E20=\"F\",\"\",E16),0)","v":0},0,0,{"$f":"AM7-AN7","v":0},null,null,{"$f":"Z15","v":""},{"$f":"IF(AR7=\"\",\"\",(VLOOKUP(AR7,AB4:AO17,14,FALSE)))","v":""}]
["U",{"$f":"IF(OR(E6=\"F\",E6=\"A\"),F10,IF(OR(E10=\"F\",E10=\"A\"),F6,IF(E6=E10,\"\",(IF(E6>E10,F6,F10)))))","v":""},{"$f":"IF(OR(E6=\"F\",E6=\"A\"),G10,IF(OR(E10=\"F\",E10=\"A\"),G6,IF(E6=E10,\"\",(IF(E6>E10,G6,G10)))))","v":""},null,null,"Match 9 - Billard",null,null,null,{"$f":"IF(OR(AND(O7=\"F\",O9=\"F\"),AND(O7=\"A\",O9=\"A\")),M9,IF(OR(O7=\"F\",O7=\"A\"),M7,IF(OR(O9=\"F\",O9=\"A\"),M9,IF(O7=O9,\"\",(IF(O7<O9,M7,M9))))))","v":""},{"$f":"IF(OR(AND(O7=\"F\",O9=\"F\"),AND(O7=\"A\",O9=\"A\")),N9,IF(OR(O7=\"F\",O7=\"A\"),N7,IF(OR(O9=\"F\",O9=\"A\"),N9,IF(O7=O9,\"\",(IF(O7<O9,N7,N9))))))","v":""},null,"Match 2 - Billard",null,null,null,{"$f":"IF(OR(AND(O7=\"F\",O9=\"F\"),AND(O7=\"A\",O9=\"A\")),M7,IF(OR(O7=\"F\",O7=\"A\"),M9,IF(OR(O9=\"F\",O9=\"A\"),M7,IF(O7=O9,\"\",(IF(O7>O9,M7,M9))))))","v":""},{"$f":"IF(OR(AND(O7=\"F\",O9=\"F\"),AND(O7=\"A\",O9=\"A\")),N7,IF(OR(O7=\"F\",O7=\"A\"),N9,IF(OR(O9=\"F\",O9=\"A\"),N7,IF(O7=O9,\"\",(IF(O7>O9,N7,N9))))))","v":""}]
[null,null,null,null,null,null,null,null,null,null,"P2",12,{"$f":"IF(IF(ISNA(VLOOKUP(L9,Inscrits!$A$2:$C$33,2,FALSE)),\"\",VLOOKUP(L9,Inscrits!$A$2:$C$33,2,FALSE))=0,\"\",IF(ISNA(VLOOKUP(L9,Inscrits!$A$2:$C$33,2,FALSE)),\"\",VLOOKUP(L9,Inscrits!$A$2:$C$33,2,FALSE)))","v":"SOCKEEL YANNICK"},{"$f":"IF(IF(ISNA(VLOOKUP(L9,Inscrits!$A$2:$C$33,3,FALSE)),\"\",\"(\"&(VLOOKUP(L9,Inscrits!$A$2:$C$33,3,FALSE))&\")\")=\"()\",\"\",IF(ISNA(VLOOKUP(L9,Inscrits!$A$2:$C$33,3,FALSE)),\"\",\"(\"&(VLOOKUP(L9,Inscrits!$A$2:$C$33,3,FALSE))&\")\"))","v":"(16)"},null,null,"G2"]
[null,null,null,null,null,{"$f":"IF(OR(S14=\"F\",S14=\"A\"),Q14,IF(OR(S18=\"F\",S18=\"A\"),Q18,IF(S14=S18,\"\",(IF(S14<S18,Q14,Q18)))))","v":""},{"$f":"IF(OR(S14=\"F\",S14=\"A\"),R14,IF(OR(S18=\"F\",S18=\"A\"),R18,IF(S14=S18,\"\",(IF(S14<S18,R14,R18)))))","v":""}]
[null,null,null,null,null,null,"P6",null,null,null,null,null,null,null,null,null,null,null,null,null,"QUALIFIES"]
[null,null,null,null,null,null,null,null,null,null,null,null,null,null,null,null,null,null,null,null,null,null,null,null,null,null,null,null,null,null,null,null,null,null,null,null,null,null,null,null,null,null,"ELIMINES"]
[null,"QUALIFIES",null,null,null,null,null,null,null,null,"P3",13,{"$f":"IF(IF(ISNA(VLOOKUP(L13,Inscrits!$A$2:$C$33,2,FALSE)),\"\",VLOOKUP(L13,Inscrits!$A$2:$C$33,2,FALSE))=0,\"\",IF(ISNA(VLOOKUP(L13,Inscrits!$A$2:$C$33,2,FALSE)),\"\",VLOOKUP(L13,Inscrits!$A$2:$C$33,2,FALSE)))","v":"SOCKEEL MARIE PIERRE"},{"$f":"IF(IF(ISNA(VLOOKUP(L13,Inscrits!$A$2:$C$33,3,FALSE)),\"\",\"(\"&(VLOOKUP(L13,Inscrits!$A$2:$C$33,3,FALSE))&\")\")=\"()\",\"\",IF(ISNA(VLOOKUP(L13,Inscrits!$A$2:$C$33,3,FALSE)),\"\",\"(\"&(VLOOKUP(L13,Inscrits!$A$2:$C$33,3,FALSE))&\")\"))","v":"(17)"},null,null,"G3",null,null,null,null,null,null,null,null,null,null,null,"G","P","G","P","G","P","G","P","G","P","G","P","Ga",null,null,"NOM","Ga"]
[null,null,null,null,null,null,null,null,null,{"$f":"IF(OR(AND(O13=\"F\",O15=\"F\"),AND(O13=\"A\",O15=\"A\")),M15,IF(OR(O13=\"F\",O13=\"A\"),M13,IF(OR(O15=\"F\",O15=\"A\"),M15,IF(O13=O15,\"\",(IF(O13<O15,M13,M15))))))","v":""},{"$f":"IF(OR(AND(O13=\"F\",O15=\"F\"),AND(O13=\"A\",O15=\"A\")),N15,IF(OR(O13=\"F\",O13=\"A\"),N13,IF(OR(O15=\"F\",O15=\"A\"),N15,IF(O13=O15,\"\",(IF(O13<O15,N13,N15))))))","v":""},null,"Match 3 - Billard",null,null,null,{"$f":"IF(OR(AND(O13=\"F\",O15=\"F\"),AND(O13=\"A\",O15=\"A\")),M13,IF(OR(O13=\"F\",O13=\"A\"),M15,IF(OR(O15=\"F\",O15=\"A\"),M13,IF(O13=O15,\"\",(IF(O13>O15,M13,M15))))))","v":""},{"$f":"IF(OR(AND(O13=\"F\",O15=\"F\"),AND(O13=\"A\",O15=\"A\")),N13,IF(OR(O13=\"F\",O13=\"A\"),N15,IF(OR(O15=\"F\",O15=\"A\"),N13,IF(O13=O15,\"\",(IF(O13>O15,N13,N15))))))","v":""},null,null,null,null,null,null,2,{"$f":"IF(U16=\"\",\"\",IF(U16=Q14,Q14,Q18))","v":""},null,{"$f":"M13","v":"SOCKEEL MARIE PIERRE"},{"$f":"IF(AB14=M13,IF(O15=\"F\",\"\",O13),0)","v":0},{"$f":"IF(AB14=M13,IF(O13=\"F\",\"\",O15),0)","v":0},{"$f":"IF(AB14=Q14,IF(S18=\"F\",\"\",S14),0)","v":0},{"$f":"IF(AB14=Q14,IF(S14=\"F\",\"\",S18),0)","v":0},{"$f":"IF(AB14=J14,IF(I18=\"F\",\"\",I14),0)","v":0},{"$f":"IF(AB14=J14,IF(I14=\"F\",\"\",I18),0)","v":0},{"$f":"IF(AB14=F16,IF(E20=\"F\",\"\",E16),0)","v":0},{"$f":"IF(AB14=F16,IF(E16=\"F\",\"\",E20),0)","v":0},{"$f":"IF(AB14=F10,IF(E6=\"F\",\"\",E10),0)","v":0},{"$f":"IF(AB14=F10,IF(E10=\"F\",\"\",E6),0)","v":0},{"$f":"SUM(AC14,AE14,AG14,AI14,AK14)","v":0},0,{"$f":"AM14-AN14","v":0},null,null,{"$f":"Z6","v":""},{"$f":"IF(AR14=\"\",\"\",(VLOOKUP(AR14,AB4:AO17,14,FALSE)))","v":""}]
[null,null,null,null,null,null,"G8",null,null,null,null,20,{"$f":"IF(IF(ISNA(VLOOKUP(L15,Inscrits!$A$2:$C$33,2,FALSE)),\"\",VLOOKUP(L15,Inscrits!$A$2:$C$33,2,FALSE))=0,\"\",IF(ISNA(VLOOKUP(L15,Inscrits!$A$2:$C$33,2,FALSE)),\"\",VLOOKUP(L15,Inscrits!$A$2:$C$33,2,FALSE)))","v":"GIRARD FREDERIC"},{"$f":"IF(IF(ISNA(VLOOKUP(L15,Inscrits!$A$2:$C$33,3,FALSE)),\"\",\"(\"&(VLOOKUP(L15,Inscrits!$A$2:$C$33,3,FALSE))&\")\")=\"()\",\"\",IF(ISNA(VLOOKUP(L15,Inscrits!$A$2:$C$33,3,FALSE)),\"\",\"(\"&(VLOOKUP(L15,Inscrits!$A$2:$C$33,3,FALSE))&\")\"))","v":"(44)"},null,null,null,null,null,null,"G6",null,null,null,4,{"$f":"IF(B18=\"\",\"\",IF(B18=F16,F16,F20))","v":""},null,{"$f":"M15","v":"GIRARD FREDERIC"},{"$f":"IF(AB15=M15,IF(O13=\"F\",\"\",O15),0)","v":0},{"$f":"IF(AB15=M15,IF(O15=\"F\",\"\",O13),0)","v":0},{"$f":"IF(AB15=Q14,IF(S18=\"F\",\"\",S14),0)","v":0},{"$f":"IF(AB15=Q14,IF(S14=\"F\",\"\",S18),0)","v":0},{"$f":"IF(AB15=J14,IF(I18=\"F\",\"\",I14),0)","v":0},{"$f":"IF(AB15=J14,IF(I14=\"F\",\"\",I18),0)","v":0},{"$f":"IF(AB15=F16,IF(E20=\"F\",\"\",E16),0)","v":0},{"$f":"IF(AB15=F16,IF(E16=\"F\",\"\",E20),0)","v":0},{"$f":"IF(AB15=F10,IF(E6=\"F\",\"\",E10),0)","v":0},{"$f":"IF(AB15=F10,IF(E10=\"F\",\"\",E6),0)","v":0},0,0,{"$f":"AM15-AN15","v":0},null,null,{"$f":"Z16","v":""},{"$f":"IF(AR15=\"\",\"\",(VLOOKUP(AR15,AB4:AO17,14,FALSE)))","v":""}]
[null,null,null,null,null,{"$f":"IF(OR(I14=\"F\",I14=\"A\"),J18,IF(OR(I18=\"F\",I18=\"A\"),J14,IF(I14=I18,\"\",(IF(I14>I18,J14,J18)))))","v":""},{"$f":"IF(OR(I14=\"F\",I14=\"A\"),K18,IF(OR(I18=\"F\",I18=\"A\"),K14,IF(I14=I18,\"\",(IF(I14>I18,K14,K18)))))","v":""},null,null,"Match 8 - Billard",null,null,null,null,null,null,"Match 6 - Billard",null,null,null,{"$f":"IF(OR(S14=\"F\",S14=\"A\"),Q18,IF(OR(S18=\"F\",S18=\"A\"),Q14,IF(S14=S18,\"\",(IF(S14>S18,Q14,Q18)))))","v":""},{"$f":"IF(OR(S14=\"F\",S14=\"A\"),R18,IF(OR(S18=\"F\",S18=\"A\"),R14,IF(S14=S18,\"\",(IF(S14>S18,R14,R18)))))","v":""},"D",null,6,{"$f":"IF(B18=\"\",\"\",IF(B18=F16,F20,F16))","v":""},null,{"$f":"M17","v":"Blanc 3"},{"$f":"IF(AB16=M17,IF(O19=\"F\",\"\",O17),0)","v":"F"},{"$f":"IF(AB16=M17,IF(O17=\"F\",\"\",O19),0)","v":""},{"$f":"IF(AB16=Q18,IF(S14=\"F\",\"\",S18),0)","v":0},{"$f":"IF(AB16=Q18,IF(S18=\"F\",\"\",S14),0)","v":0},{"$f":"IF(AB16=J18,IF(I14=\"F\",\"\",I18),0)","v":"F"},{"$f":"IF(AB16=J18,IF(I18=\"F\",\"\",I14),0)","v":""},{"$f":"IF(AB16=F16,IF(E20=\"F\",\"\",E16),0)","v":0},{"$f":"IF(AB16=F16,IF(E16=\"F\",\"\",E20),0)","v":0},{"$f":"IF(AB16=F10,IF(E6=\"F\",\"\",E10),0)","v":0},{"$f":"IF(AB16=F10,IF(E10=\"F\",\"\",E6),0)","v":0},0,0,{"$f":"AM16-AN16","v":0},null,null,{"$f":"Z7","v":""},{"$f":"IF(AR16=\"\",\"\",(VLOOKUP(AR16,AB4:AO17,14,FALSE)))","v":""}]
[null,null,"G10",null,null,null,null,null,null,null,null,29,{"$f":"IF(IF(ISNA(VLOOKUP(L17,Inscrits!$A$2:$C$33,2,FALSE)),\"\",VLOOKUP(L17,Inscrits!$A$2:$C$33,2,FALSE))=0,\"\",IF(ISNA(VLOOKUP(L17,Inscrits!$A$2:$C$33,2,FALSE)),\"\",VLOOKUP(L17,Inscrits!$A$2:$C$33,2,FALSE)))","v":"Blanc 3"},{"$f":"IF(IF(ISNA(VLOOKUP(L17,Inscrits!$A$2:$C$33,3,FALSE)),\"\",\"(\"&(VLOOKUP(L17,Inscrits!$A$2:$C$33,3,FALSE))&\")\")=\"()\",\"\",IF(ISNA(VLOOKUP(L17,Inscrits!$A$2:$C$33,3,FALSE)),\"\",\"(\"&(VLOOKUP(L17,Inscrits!$A$2:$C$33,3,FALSE))&\")\"))","v":""},"F",null,null,null,null,null,null,null,null,null,8,{"$f":"IF(F16=\"\",\"\",IF(F16=J14,J18,J14))","v":""},null,{"$f":"M19","v":"MONTPELLIER BRUNO"},{"$f":"IF(AB17=M19,IF(O17=\"F\",\"\",O19),0)","v":""},{"$f":"IF(AB17=M19,IF(O19=\"F\",\"\",O17),0)","v":"F"},{"$f":"IF(AB17=Q18,IF(S14=\"F\",\"\",S18),0)","v":0},{"$f":"IF(AB17=Q18,IF(S18=\"F\",\"\",S14),0)","v":0},{"$f":"IF(AB17=J18,IF(I14=\"F\",\"\",I18),0)","v":0},{"$f":"IF(AB17=J18,IF(I18=\"F\",\"\",I14),0)","v":0},{"$f":"IF(AB17=F16,IF(E20=\"F\",\"\",E16),0)","v":0},{"$f":"IF(AB17=F16,IF(E16=\"F\",\"\",E20),0)","v":0},{"$f":"IF(AB17=F10,IF(E6=\"F\",\"\",E10),0)","v":0},{"$f":"IF(AB17=F10,IF(E10=\"F\",\"\",E6),0)","v":0},0,0,{"$f":"AM17-AN17","v":0},null,null,{"$f":"Z17","v":""},{"$f":"IF(AR17=\"\",\"\",(VLOOKUP(AR17,AB4:AO17,14,FALSE)))","v":""}]
["V",{"$f":"IF(OR(E16=\"F\",E16=\"A\"),F20,IF(OR(E20=\"F\",E20=\"A\"),F16,IF(E16=E20,\"\",(IF(E16>E20,F16,F20)))))","v":""},{"$f":"IF(OR(E16=\"F\",E16=\"A\"),G20,IF(OR(E20=\"F\",E20=\"A\"),G16,IF(E16=E20,\"\",(IF(E16>E20,G16,G20)))))","v":""},null,null,"Match 10 - Billard",null,null,"F",{"$f":"IF(OR(AND(O17=\"F\",O19=\"F\"),AND(O17=\"A\",O19=\"A\")),M19,IF(OR(O17=\"F\",O17=\"A\"),M17,IF(OR(O19=\"F\",O19=\"A\"),M19,IF(O17=O19,\"\",(IF(O17<O19,M17,M19))))))","v":"Blanc 3"},{"$f":"IF(OR(AND(O17=\"F\",O19=\"F\"),AND(O17=\"A\",O19=\"A\")),N19,IF(OR(O17=\"F\",O17=\"A\"),N17,IF(OR(O19=\"F\",O19=\"A\"),N19,IF(O17=O19,\"\",(IF(O17<O19,N17,N19))))))","v":""},null,"Match 4 - Billard",null,null,null,{"$f":"IF(OR(AND(O17=\"F\",O19=\"F\"),AND(O17=\"A\",O19=\"A\")),M17,IF(OR(O17=\"F\",O17=\"A\"),M19,IF(OR(O19=\"F\",O19=\"A\"),M17,IF(O17=O19,\"\",(IF(O17>O19,M17,M19))))))","v":"MONTPELLIER BRUNO"},{"$f":"IF(OR(AND(O17=\"F\",O19=\"F\"),AND(O17=\"A\",O19=\"A\")),N17,IF(OR(O17=\"F\",O17=\"A\"),N19,IF(OR(O19=\"F\",O19=\"A\"),N17,IF(O17=O19,\"\",(IF(O17>O19,N17,N19))))))","v":"(6)"}]
[null,null,null,null,null,null,null,null,null,null,"P4",4,{"$f":"IF(IF(ISNA(VLOOKUP(L19,Inscrits!$A$2:$C$33,2,FALSE)),\"\",VLOOKUP(L19,Inscrits!$A$2:$C$33,2,FALSE))=0,\"\",IF(ISNA(VLOOKUP(L19,Inscrits!$A$2:$C$33,2,FALSE)),\"\",VLOOKUP(L19,Inscrits!$A$2:$C$33,2,FALSE)))","v":"MONTPELLIER BRUNO"},{"$f":"IF(IF(ISNA(VLOOKUP(L19,Inscrits!$A$2:$C$33,3,FALSE)),\"\",\"(\"&(VLOOKUP(L19,Inscrits!$A$2:$C$33,3,FALSE))&\")\")=\"()\",\"\",IF(ISNA(VLOOKUP(L19,Inscrits!$A$2:$C$33,3,FALSE)),\"\",\"(\"&(VLOOKUP(L19,Inscrits!$A$2:$C$33,3,FALSE))&\")\"))","v":"(6)"},null,null,"G4"]
[null,null,null,null,null,{"$f":"IF(OR(S4=\"F\",S4=\"A\"),Q4,IF(OR(S8=\"F\",S8=\"A\"),Q8,IF(S4=S8,\"\",(IF(S4<S8,Q4,Q8)))))","v":""},{"$f":"IF(OR(S4=\"F\",S4=\"A\"),R4,IF(OR(S8=\"F\",S8=\"A\"),R8,IF(S4=S8,\"\",(IF(S4<S8,R4,R8)))))","v":""}]
[null,null,null,null,null,null,"P5",null,null,{"$f":"\"(\"&Accueil!G18&\" manches côté perdant)\"","v":"(3 manches côté perdant)"}]

{"sheet":"3","index":5,"n_rows":21,"n_cols":45,"rows_kept":21,"cut":false,"hidden":false,"merged":[[20,9,21,17],[12,1,12,2],[10,20,10,21],[1,42,1,45],[11,42,11,45],[0,9,1,17]]}
[null,null,null,null,null,null,null,null,null,{"$f":"\"(\"&Accueil!D18&\" manches côté gagnant)\"","v":"(3 manches côté gagnant)"}]
[null,null,null,null,null,null,null,null,null,null,null,null,null,null,null,null,null,null,null,null,null,null,null,null,null,null,null,null,null,null,null,null,null,null,null,null,null,null,null,null,null,null,"QUALIFIES"]
[null,null,null,null,null,null,null,null,null,null,"P1",3,{"$f":"IF(IF(ISNA(VLOOKUP(L3,Inscrits!$A$2:$C$33,2,FALSE)),\"\",VLOOKUP(L3,Inscrits!$A$2:$C$33,2,FALSE))=0,\"\",IF(ISNA(VLOOKUP(L3,Inscrits!$A$2:$C$33,2,FALSE)),\"\",VLOOKUP(L3,Inscrits!$A$2:$C$33,2,FALSE)))","v":"DE ALMEIDA DUARTE FREDERICO"},{"$f":"IF(IF(ISNA(VLOOKUP(L3,Inscrits!$A$2:$C$33,3,FALSE)),\"\",\"(\"&(VLOOKUP(L3,Inscrits!$A$2:$C$33,3,FALSE))&\")\")=\"()\",\"\",IF(ISNA(VLOOKUP(L3,Inscrits!$A$2:$C$33,3,FALSE)),\"\",\"(\"&(VLOOKUP(L3,Inscrits!$A$2:$C$33,3,FALSE))&\")\"))","v":"(3)"},null,null,"G1",null,null,null,null,null,null,null,null,null,null,null,"G","P","G","P","G","P","G","P","G","P","G","P","Ga",null,null,"NOM","Ga"]
[null,null,null,null,null,null,null,null,"F",{"$f":"IF(OR(AND(O3=\"F\",O5=\"F\"),AND(O3=\"A\",O5=\"A\")),M5,IF(OR(O3=\"F\",O3=\"A\"),M3,IF(OR(O5=\"F\",O5=\"A\"),M5,IF(O3=O5,\"\",(IF(O3<O5,M3,M5))))))","v":"Blanc 4"},{"$f":"IF(OR(AND(O3=\"F\",O5=\"F\"),AND(O3=\"A\",O5=\"A\")),N5,IF(OR(O3=\"F\",O3=\"A\"),N3,IF(OR(O5=\"F\",O5=\"A\"),N5,IF(O3=O5,\"\",(IF(O3<O5,N3,N5))))))","v":""},null,"Match 1 - Billard",null,null,null,{"$f":"IF(OR(AND(O3=\"F\",O5=\"F\"),AND(O3=\"A\",O5=\"A\")),M3,IF(OR(O3=\"F\",O3=\"A\"),M5,IF(OR(O5=\"F\",O5=\"A\"),M3,IF(O3=O5,\"\",(IF(O3>O5,M3,M5))))))","v":"DE ALMEIDA DUARTE FREDERICO"},{"$f":"IF(OR(AND(O3=\"F\",O5=\"F\"),AND(O3=\"A\",O5=\"A\")),N3,IF(OR(O3=\"F\",O3=\"A\"),N5,IF(OR(O5=\"F\",O5=\"A\"),N3,IF(O3=O5,\"\",(IF(O3>O5,N3,N5))))))","v":"(3)"},null,null,null,null,null,null,1,{"$f":"IF(U6=\"\",\"\",IF(U6=Q4,Q4,Q8))","v":""},null,{"$f":"M3","v":"DE ALMEIDA DUARTE FREDERICO"},{"$f":"IF(AB4=M3,IF(O5=\"F\",\"\",O3),0)","v":""},{"$f":"IF(AB4=M3,IF(O3=\"F\",\"\",O5),0)","v":"F"},{"$f":"IF(AB4=Q4,IF(S8=\"F\",\"\",S4),0)","v":0},{"$f":"IF(AB4=Q4,IF(S4=\"F\",\"\",S8),0)","v":0},{"$f":"IF(AB4=J4,IF(I8=\"F\",\"\",I4),0)","v":0},{"$f":"IF(AB4=J4,IF(I4=\"F\",\"\",I8),0)","v":0},{"$f":"IF(AB4=F6,IF(E10=\"F\",\"\",E6),0)","v":0},{"$f":"IF(AB4=F6,IF(E6=\"F\",\"\",E10),0)","v":0},{"$f":"IF(AB4=F20,IF(E16=\"F\",\"\",E20),0)","v":0},{"$f":"IF(AB4=F20,IF(E20=\"F\",\"\",E16),0)","v":0},{"$f":"SUM(AC4,AE4,AG4,AI4,AK4)","v":0},0,{"$f":"AM4-AN4","v":0},null,null,{"$f":"Z4","v":""},{"$f":"IF(AR4=\"\",\"\",(VLOOKUP(AR4,AB4:AO17,14,FALSE)))","v":""}]
[null,null,null,null,null,null,"G7",null,null,null,null,30,{"$f":"IF(IF(ISNA(VLOOKUP(L5,Inscrits!$A$2:$C$33,2,FALSE)),\"\",VLOOKUP(L5,Inscrits!$A$2:$C$33,2,FALSE))=0,\"\",IF(ISNA(VLOOKUP(L5,Inscrits!$A$2:$C$33,2,FALSE)),\"\",VLOOKUP(L5,Inscrits!$A$2:$C$33,2,FALSE)))","v":"Blanc 4"},{"$f":"IF(IF(ISNA(VLOOKUP(L5,Inscrits!$A$2:$C$33,3,FALSE)),\"\",\"(\"&(VLOOKUP(L5,Inscrits!$A$2:$C$33,3,FALSE))&\")\")=\"()\",\"\",IF(ISNA(VLOOKUP(L5,Inscrits!$A$2:$C$33,3,FALSE)),\"\",\"(\"&(VLOOKUP(L5,Inscrits!$A$2:$C$33,3,FALSE))&\")\"))","v":""},"F",null,null,null,null,null,"G5",null,null,null,3,{"$f":"IF(B8=\"\",\"\",IF(B8=F6,F6,F10))","v":""},null,{"$f":"M5","v":"Blanc 4"},{"$f":"IF(AB5=M5,IF(O3=\"F\",\"\",O5),0)","v":"F"},{"$f":"IF(AB5=M5,IF(O5=\"F\",\"\",O3),0)","v":""},{"$f":"IF(AB5=Q4,IF(S8=\"F\",\"\",S4),0)","v":0},{"$f":"IF(AB5=Q4,IF(S4=\"F\",\"\",S8),0)","v":0},{"$f":"IF(AB5=J4,IF(I8=\"F\",\"\",I4),0)","v":"F"},{"$f":"IF(AB5=J4,IF(I4=\"F\",\"\",I8),0)","v":""},{"$f":"IF(AB5=F6,IF(E10=\"F\",\"\",E6),0)","v":0},{"$f":"IF(AB5=F6,IF(E6=\"F\",\"\",E10),0)","v":0},{"$f":"IF(AB5=F20,IF(E16=\"F\",\"\",E20),0)","v":0},{"$f":"IF(AB5=F20,IF(E20=\"F\",\"\",E16),0)","v":0},0,0,{"$f":"AM5-AN5","v":0},null,null,{"$f":"Z14","v":""},{"$f":"IF(AR5=\"\",\"\",(VLOOKUP(AR5,AB4:AO17,14,FALSE)))","v":""}]
[null,null,null,null,null,{"$f":"IF(OR(I4=\"F\",I4=\"A\"),J8,IF(OR(I8=\"F\",I8=\"A\"),J4,IF(I4=I8,\"\",(IF(I4>I8,J4,J8)))))","v":""},{"$f":"IF(OR(I4=\"F\",I4=\"A\"),K8,IF(OR(I8=\"F\",I8=\"A\"),K4,IF(I4=I8,\"\",(IF(I4>I8,K4,K8)))))","v":""},null,null,"Match 7 - Billard",null,null,null,null,null,null,"Match 5 - Billard",null,null,null,{"$f":"IF(OR(S4=\"F\",S4=\"A\"),Q8,IF(OR(S8=\"F\",S8=\"A\"),Q4,IF(S4=S8,\"\",(IF(S4>S8,Q4,Q8)))))","v":""},{"$f":"IF(OR(S4=\"F\",S4=\"A\"),R8,IF(OR(S8=\"F\",S8=\"A\"),R4,IF(S4=S8,\"\",(IF(S4>S8,R4,R8)))))","v":""},"E",null,5,{"$f":"IF(B8=\"\",\"\",IF(B8=F6,F10,F6))","v":""},null,{"$f":"M7","v":"TRIPLET FREDERIC"},{"$f":"IF(AB6=M7,IF(O9=\"F\",\"\",O7),0)","v":0},{"$f":"IF(AB6=M7,IF(O7=\"F\",\"\",O9),0)","v":0},{"$f":"IF(AB6=Q8,IF(S4=\"F\",\"\",S8),0)","v":0},{"$f":"IF(AB6=Q8,IF(S8=\"F\",\"\",S4),0)","v":0},{"$f":"IF(AB6=J8,IF(I4=\"F\",\"\",I8),0)","v":0},{"$f":"IF(AB6=J8,IF(I8=\"F\",\"\",I4),0)","v":0},{"$f":"IF(AB6=F6,IF(E10=\"F\",\"\",E6),0)","v":0},{"$f":"IF(AB6=F6,IF(E6=\"F\",\"\",E10),0)","v":0},{"$f":"IF(AB6=F20,IF(E16=\"F\",\"\",E20),0)","v":0},{"$f":"IF(AB6=F20,IF(E20=\"F\",\"\",E16),0)","v":0},0,0,{"$f":"AM6-AN6","v":0},null,null,{"$f":"Z5","v":""},{"$f":"IF(AR6=\"\",\"\",(VLOOKUP(AR6,AB4:AO17,14,FALSE)))","v":""}]
[null,null,"G9",null,null,null,null,null,null,null,null,19,{"$f":"IF(IF(ISNA(VLOOKUP(L7,Inscrits!$A$2:$C$33,2,FALSE)),\"\",VLOOKUP(L7,Inscrits!$A$2:$C$33,2,FALSE))=0,\"\",IF(ISNA(VLOOKUP(L7,Inscrits!$A$2:$C$33,2,FALSE)),\"\",VLOOKUP(L7,Inscrits!$A$2:$C$33,2,FALSE)))","v":"TRIPLET FREDERIC"},{"$f":"IF(IF(ISNA(VLOOKUP(L7,Inscrits!$A$2:$C$33,3,FALSE)),\"\",\"(\"&(VLOOKUP(L7,Inscrits!$A$2:$C$33,3,FALSE))&\")\")=\"()\",\"\",IF(ISNA(VLOOKUP(L7,Inscrits!$A$2:$C$33,3,FALSE)),\"\",\"(\"&(VLOOKUP(L7,Inscrits!$A$2:$C$33,3,FALSE))&\")\"))","v":"(43)"},null,null,null,null,null,null,null,null,null,null,7,{"$f":"IF(F6=\"\",\"\",IF(F6=J4,J8,J4))","v":""},null,{"$f":"M9","v":"BESSON JEROME"},{"$f":"IF(AB7=M9,IF(O7=\"F\",\"\",O9),0)","v":0},{"$f":"IF(AB7=M9,IF(O9=\"F\",\"\",O7),0)","v":0},{"$f":"IF(AB7=Q8,IF(S4=\"F\",\"\",S8),0)","v":0},{"$f":"IF(AB7=Q8,IF(S8=\"F\",\"\",S4),0)","v":0},{"$f":"IF(AB7=J8,IF(I4=\"F\",\"\",I8),0)","v":0},{"$f":"IF(AB7=J8,IF(I8=\"F\",\"\",I4),0)","v":0},{"$f":"IF(AB7=F6,IF(E10=\"F\",\"\",E6),0)","v":0},{"$f":"IF(AB7=F6,IF(E6=\"F\",\"\",E10),0)","v":0},{"$f":"IF(AB7=F20,IF(E16=\"F\",\"\",E20),0)","v":0},{"$f":"IF(AB7=F20,IF(E20=\"F\",\"\",E16),0)","v":0},0,0,{"$f":"AM7-AN7","v":0},null,null,{"$f":"Z15","v":""},{"$f":"IF(AR7=\"\",\"\",(VLOOKUP(AR7,AB4:AO17,14,FALSE)))","v":""}]
["W",{"$f":"IF(OR(E6=\"F\",E6=\"A\"),F10,IF(OR(E10=\"F\",E10=\"A\"),F6,IF(E6=E10,\"\",(IF(E6>E10,F6,F10)))))","v":""},{"$f":"IF(OR(E6=\"F\",E6=\"A\"),G10,IF(OR(E10=\"F\",E10=\"A\"),G6,IF(E6=E10,\"\",(IF(E6>E10,G6,G10)))))","v":""},null,null,"Match 9 - Billard",null,null,null,{"$f":"IF(OR(AND(O7=\"F\",O9=\"F\"),AND(O7=\"A\",O9=\"A\")),M9,IF(OR(O7=\"F\",O7=\"A\"),M7,IF(OR(O9=\"F\",O9=\"A\"),M9,IF(O7=O9,\"\",(IF(O7<O9,M7,M9))))))","v":""},{"$f":"IF(OR(AND(O7=\"F\",O9=\"F\"),AND(O7=\"A\",O9=\"A\")),N9,IF(OR(O7=\"F\",O7=\"A\"),N7,IF(OR(O9=\"F\",O9=\"A\"),N9,IF(O7=O9,\"\",(IF(O7<O9,N7,N9))))))","v":""},null,"Match 2 - Billard",null,null,null,{"$f":"IF(OR(AND(O7=\"F\",O9=\"F\"),AND(O7=\"A\",O9=\"A\")),M7,IF(OR(O7=\"F\",O7=\"A\"),M9,IF(OR(O9=\"F\",O9=\"A\"),M7,IF(O7=O9,\"\",(IF(O7>O9,M7,M9))))))","v":""},{"$f":"IF(OR(AND(O7=\"F\",O9=\"F\"),AND(O7=\"A\",O9=\"A\")),N7,IF(OR(O7=\"F\",O7=\"A\"),N9,IF(OR(O9=\"F\",O9=\"A\"),N7,IF(O7=O9,\"\",(IF(O7>O9,N7,N9))))))","v":""}]
[null,null,null,null,null,null,null,null,null,null,"P2",14,{"$f":"IF(IF(ISNA(VLOOKUP(L9,Inscrits!$A$2:$C$33,2,FALSE)),\"\",VLOOKUP(L9,Inscrits!$A$2:$C$33,2,FALSE))=0,\"\",IF(ISNA(VLOOKUP(L9,Inscrits!$A$2:$C$33,2,FALSE)),\"\",VLOOKUP(L9,Inscrits!$A$2:$C$33,2,FALSE)))","v":"BESSON JEROME"},{"$f":"IF(IF(ISNA(VLOOKUP(L9,Inscrits!$A$2:$C$33,3,FALSE)),\"\",\"(\"&(VLOOKUP(L9,Inscrits!$A$2:$C$33,3,FALSE))&\")\")=\"()\",\"\",IF(ISNA(VLOOKUP(L9,Inscrits!$A$2:$C$33,3,FALSE)),\"\",\"(\"&(VLOOKUP(L9,Inscrits!$A$2:$C$33,3,FALSE))&\")\"))","v":"(18)"},null,null,"G2"]
[null,null,null,null,null,{"$f":"IF(OR(S14=\"F\",S14=\"A\"),Q14,IF(OR(S18=\"F\",S18=\"A\"),Q18,IF(S14=S18,\"\",(IF(S14<S18,Q14,Q18)))))","v":""},{"$f":"IF(OR(S14=\"F\",S14=\"A\"),R14,IF(OR(S18=\"F\",S18=\"A\"),R18,IF(S14=S18,\"\",(IF(S14<S18,R14,R18)))))","v":""}]
[null,null,null,null,null,null,"P6",null,null,null,null,null,null,null,null,null,null,null,null,null,"QUALIFIES"]
[null,null,null,null,null,null,null,null,null,null,null,null,null,null,null,null,null,null,null,null,null,null,null,null,null,null,null,null,null,null,null,null,null,null,null,null,null,null,null,null,null,null,"ELIMINES"]
[null,"QUALIFIES",null,null,null,null,null,null,null,null,"P3",11,{"$f":"IF(IF(ISNA(VLOOKUP(L13,Inscrits!$A$2:$C$33,2,FALSE)),\"\",VLOOKUP(L13,Inscrits!$A$2:$C$33,2,FALSE))=0,\"\",IF(ISNA(VLOOKUP(L13,Inscrits!$A$2:$C$33,2,FALSE)),\"\",VLOOKUP(L13,Inscrits!$A$2:$C$33,2,FALSE)))","v":"SOCKEEL AURORE"},{"$f":"IF(IF(ISNA(VLOOKUP(L13,Inscrits!$A$2:$C$33,3,FALSE)),\"\",\"(\"&(VLOOKUP(L13,Inscrits!$A$2:$C$33,3,FALSE))&\")\")=\"()\",\"\",IF(ISNA(VLOOKUP(L13,Inscrits!$A$2:$C$33,3,FALSE)),\"\",\"(\"&(VLOOKUP(L13,Inscrits!$A$2:$C$33,3,FALSE))&\")\"))","v":"(14)"},null,null,"G3",null,null,null,null,null,null,null,null,null,null,null,"G","P","G","P","G","P","G","P","G","P","G","P","Ga",null,null,"NOM","Ga"]
[null,null,null,null,null,null,null,null,null,{"$f":"IF(OR(AND(O13=\"F\",O15=\"F\"),AND(O13=\"A\",O15=\"A\")),M15,IF(OR(O13=\"F\",O13=\"A\"),M13,IF(OR(O15=\"F\",O15=\"A\"),M15,IF(O13=O15,\"\",(IF(O13<O15,M13,M15))))))","v":""},{"$f":"IF(OR(AND(O13=\"F\",O15=\"F\"),AND(O13=\"A\",O15=\"A\")),N15,IF(OR(O13=\"F\",O13=\"A\"),N13,IF(OR(O15=\"F\",O15=\"A\"),N15,IF(O13=O15,\"\",(IF(O13<O15,N13,N15))))))","v":""},null,"Match 3 - Billard",null,null,null,{"$f":"IF(OR(AND(O13=\"F\",O15=\"F\"),AND(O13=\"A\",O15=\"A\")),M13,IF(OR(O13=\"F\",O13=\"A\"),M15,IF(OR(O15=\"F\",O15=\"A\"),M13,IF(O13=O15,\"\",(IF(O13>O15,M13,M15))))))","v":""},{"$f":"IF(OR(AND(O13=\"F\",O15=\"F\"),AND(O13=\"A\",O15=\"A\")),N13,IF(OR(O13=\"F\",O13=\"A\"),N15,IF(OR(O15=\"F\",O15=\"A\"),N13,IF(O13=O15,\"\",(IF(O13>O15,N13,N15))))))","v":""},null,null,null,null,null,null,2,{"$f":"IF(U16=\"\",\"\",IF(U16=Q14,Q14,Q18))","v":""},null,{"$f":"M13","v":"SOCKEEL AURORE"},{"$f":"IF(AB14=M13,IF(O15=\"F\",\"\",O13),0)","v":0},{"$f":"IF(AB14=M13,IF(O13=\"F\",\"\",O15),0)","v":0},{"$f":"IF(AB14=Q14,IF(S18=\"F\",\"\",S14),0)","v":0},{"$f":"IF(AB14=Q14,IF(S14=\"F\",\"\",S18),0)","v":0},{"$f":"IF(AB14=J14,IF(I18=\"F\",\"\",I14),0)","v":0},{"$f":"IF(AB14=J14,IF(I14=\"F\",\"\",I18),0)","v":0},{"$f":"IF(AB14=F16,IF(E20=\"F\",\"\",E16),0)","v":0},{"$f":"IF(AB14=F16,IF(E16=\"F\",\"\",E20),0)","v":0},{"$f":"IF(AB14=F10,IF(E6=\"F\",\"\",E10),0)","v":0},{"$f":"IF(AB14=F10,IF(E10=\"F\",\"\",E6),0)","v":0},{"$f":"SUM(AC14,AE14,AG14,AI14,AK14)","v":0},0,{"$f":"AM14-AN14","v":0},null,null,{"$f":"Z6","v":""},{"$f":"IF(AR14=\"\",\"\",(VLOOKUP(AR14,AB4:AO17,14,FALSE)))","v":""}]
[null,null,null,null,null,null,"G8",null,null,null,null,22,{"$f":"IF(IF(ISNA(VLOOKUP(L15,Inscrits!$A$2:$C$33,2,FALSE)),\"\",VLOOKUP(L15,Inscrits!$A$2:$C$33,2,FALSE))=0,\"\",IF(ISNA(VLOOKUP(L15,Inscrits!$A$2:$C$33,2,FALSE)),\"\",VLOOKUP(L15,Inscrits!$A$2:$C$33,2,FALSE)))","v":"TRABICHET CHRISTOPHE"},{"$f":"IF(IF(ISNA(VLOOKUP(L15,Inscrits!$A$2:$C$33,3,FALSE)),\"\",\"(\"&(VLOOKUP(L15,Inscrits!$A$2:$C$33,3,FALSE))&\")\")=\"()\",\"\",IF(ISNA(VLOOKUP(L15,Inscrits!$A$2:$C$33,3,FALSE)),\"\",\"(\"&(VLOOKUP(L15,Inscrits!$A$2:$C$33,3,FALSE))&\")\"))","v":"(47)"},null,null,null,null,null,null,"G6",null,null,null,4,{"$f":"IF(B18=\"\",\"\",IF(B18=F16,F16,F20))","v":""},null,{"$f":"M15","v":"TRABICHET CHRISTOPHE"},{"$f":"IF(AB15=M15,IF(O13=\"F\",\"\",O15),0)","v":0},{"$f":"IF(AB15=M15,IF(O15=\"F\",\"\",O13),0)","v":0},{"$f":"IF(AB15=Q14,IF(S18=\"F\",\"\",S14),0)","v":0},{"$f":"IF(AB15=Q14,IF(S14=\"F\",\"\",S18),0)","v":0},{"$f":"IF(AB15=J14,IF(I18=\"F\",\"\",I14),0)","v":0},{"$f":"IF(AB15=J14,IF(I14=\"F\",\"\",I18),0)","v":0},{"$f":"IF(AB15=F16,IF(E20=\"F\",\"\",E16),0)","v":0},{"$f":"IF(AB15=F16,IF(E16=\"F\",\"\",E20),0)","v":0},{"$f":"IF(AB15=F10,IF(E6=\"F\",\"\",E10),0)","v":0},{"$f":"IF(AB15=F10,IF(E10=\"F\",\"\",E6),0)","v":0},0,0,{"$f":"AM15-AN15","v":0},null,null,{"$f":"Z16","v":""},{"$f":"IF(AR15=\"\",\"\",(VLOOKUP(AR15,AB4:AO17,14,FALSE)))","v":""}]
[null,null,null,null,null,{"$f":"IF(OR(I14=\"F\",I14=\"A\"),J18,IF(OR(I18=\"F\",I18=\"A\"),J14,IF(I14=I18,\"\",(IF(I14>I18,J14,J18)))))","v":""},{"$f":"IF(OR(I14=\"F\",I14=\"A\"),K18,IF(OR(I18=\"F\",I18=\"A\"),K14,IF(I14=I18,\"\",(IF(I14>I18,K14,K18)))))","v":""},null,null,"Match 8 - Billard",null,null,null,null,null,null,"Match 6 - Billard",null,null,null,{"$f":"IF(OR(S14=\"F\",S14=\"A\"),Q18,IF(OR(S18=\"F\",S18=\"A\"),Q14,IF(S14=S18,\"\",(IF(S14>S18,Q14,Q18)))))","v":""},{"$f":"IF(OR(S14=\"F\",S14=\"A\"),R18,IF(OR(S18=\"F\",S18=\"A\"),R14,IF(S14=S18,\"\",(IF(S14>S18,R14,R18)))))","v":""},"F",null,6,{"$f":"IF(B18=\"\",\"\",IF(B18=F16,F20,F16))","v":""},null,{"$f":"M17","v":"Blanc 1"},{"$f":"IF(AB16=M17,IF(O19=\"F\",\"\",O17),0)","v":"F"},{"$f":"IF(AB16=M17,IF(O17=\"F\",\"\",O19),0)","v":""},{"$f":"IF(AB16=Q18,IF(S14=\"F\",\"\",S18),0)","v":0},{"$f":"IF(AB16=Q18,IF(S18=\"F\",\"\",S14),0)","v":0},{"$f":"IF(AB16=J18,IF(I14=\"F\",\"\",I18),0)","v":"F"},{"$f":"IF(AB16=J18,IF(I18=\"F\",\"\",I14),0)","v":""},{"$f":"IF(AB16=F16,IF(E20=\"F\",\"\",E16),0)","v":0},{"$f":"IF(AB16=F16,IF(E16=\"F\",\"\",E20),0)","v":0},{"$f":"IF(AB16=F10,IF(E6=\"F\",\"\",E10),0)","v":0},{"$f":"IF(AB16=F10,IF(E10=\"F\",\"\",E6),0)","v":0},0,0,{"$f":"AM16-AN16","v":0},null,null,{"$f":"Z7","v":""},{"$f":"IF(AR16=\"\",\"\",(VLOOKUP(AR16,AB4:AO17,14,FALSE)))","v":""}]
[null,null,"G10",null,null,null,null,null,null,null,null,27,{"$f":"IF(IF(ISNA(VLOOKUP(L17,Inscrits!$A$2:$C$33,2,FALSE)),\"\",VLOOKUP(L17,Inscrits!$A$2:$C$33,2,FALSE))=0,\"\",IF(ISNA(VLOOKUP(L17,Inscrits!$A$2:$C$33,2,FALSE)),\"\",VLOOKUP(L17,Inscrits!$A$2:$C$33,2,FALSE)))","v":"Blanc 1"},{"$f":"IF(IF(ISNA(VLOOKUP(L17,Inscrits!$A$2:$C$33,3,FALSE)),\"\",\"(\"&(VLOOKUP(L17,Inscrits!$A$2:$C$33,3,FALSE))&\")\")=\"()\",\"\",IF(ISNA(VLOOKUP(L17,Inscrits!$A$2:$C$33,3,FALSE)),\"\",\"(\"&(VLOOKUP(L17,Inscrits!$A$2:$C$33,3,FALSE))&\")\"))","v":""},"F",null,null,null,null,null,null,null,null,null,8,{"$f":"IF(F16=\"\",\"\",IF(F16=J14,J18,J14))","v":""},null,{"$f":"M19","v":"TASSET JEROME"},{"$f":"IF(AB17=M19,IF(O17=\"F\",\"\",O19),0)","v":""},{"$f":"IF(AB17=M19,IF(O19=\"F\",\"\",O17),0)","v":"F"},{"$f":"IF(AB17=Q18,IF(S14=\"F\",\"\",S18),0)","v":0},{"$f":"IF(AB17=Q18,IF(S18=\"F\",\"\",S14),0)","v":0},{"$f":"IF(AB17=J18,IF(I14=\"F\",\"\",I18),0)","v":0},{"$f":"IF(AB17=J18,IF(I18=\"F\",\"\",I14),0)","v":0},{"$f":"IF(AB17=F16,IF(E20=\"F\",\"\",E16),0)","v":0},{"$f":"IF(AB17=F16,IF(E16=\"F\",\"\",E20),0)","v":0},{"$f":"IF(AB17=F10,IF(E6=\"F\",\"\",E10),0)","v":0},{"$f":"IF(AB17=F10,IF(E10=\"F\",\"\",E6),0)","v":0},0,0,{"$f":"AM17-AN17","v":0},null,null,{"$f":"Z17","v":""},{"$f":"IF(AR17=\"\",\"\",(VLOOKUP(AR17,AB4:AO17,14,FALSE)))","v":""}]
["X",{"$f":"IF(OR(E16=\"F\",E16=\"A\"),F20,IF(OR(E20=\"F\",E20=\"A\"),F16,IF(E16=E20,\"\",(IF(E16>E20,F16,F20)))))","v":""},{"$f":"IF(OR(E16=\"F\",E16=\"A\"),G20,IF(OR(E20=\"F\",E20=\"A\"),G16,IF(E16=E20,\"\",(IF(E16>E20,G16,G20)))))","v":""},null,null,"Match 10 - Billard",null,null,"F",{"$f":"IF(OR(AND(O17=\"F\",O19=\"F\"),AND(O17=\"A\",O19=\"A\")),M19,IF(OR(O17=\"F\",O17=\"A\"),M17,IF(OR(O19=\"F\",O19=\"A\"),M19,IF(O17=O19,\"\",(IF(O17<O19,M17,M19))))))","v":"Blanc 1"},{"$f":"IF(OR(AND(O17=\"F\",O19=\"F\"),AND(O17=\"A\",O19=\"A\")),N19,IF(OR(O17=\"F\",O17=\"A\"),N17,IF(OR(O19=\"F\",O19=\"A\"),N19,IF(O17=O19,\"\",(IF(O17<O19,N17,N19))))))","v":""},null,"Match 4 - Billard",null,null,null,{"$f":"IF(OR(AND(O17=\"F\",O19=\"F\"),AND(O17=\"A\",O19=\"A\")),M17,IF(OR(O17=\"F\",O17=\"A\"),M19,IF(OR(O19=\"F\",O19=\"A\"),M17,IF(O17=O19,\"\",(IF(O17>O19,M17,M19))))))","v":"TASSET JEROME"},{"$f":"IF(OR(AND(O17=\"F\",O19=\"F\"),AND(O17=\"A\",O19=\"A\")),N17,IF(OR(O17=\"F\",O17=\"A\"),N19,IF(OR(O19=\"F\",O19=\"A\"),N17,IF(O17=O19,\"\",(IF(O17>O19,N17,N19))))))","v":"(8)"}]
[null,null,null,null,null,null,null,null,null,null,"P4",6,{"$f":"IF(IF(ISNA(VLOOKUP(L19,Inscrits!$A$2:$C$33,2,FALSE)),\"\",VLOOKUP(L19,Inscrits!$A$2:$C$33,2,FALSE))=0,\"\",IF(ISNA(VLOOKUP(L19,Inscrits!$A$2:$C$33,2,FALSE)),\"\",VLOOKUP(L19,Inscrits!$A$2:$C$33,2,FALSE)))","v":"TASSET JEROME"},{"$f":"IF(IF(ISNA(VLOOKUP(L19,Inscrits!$A$2:$C$33,3,FALSE)),\"\",\"(\"&(VLOOKUP(L19,Inscrits!$A$2:$C$33,3,FALSE))&\")\")=\"()\",\"\",IF(ISNA(VLOOKUP(L19,Inscrits!$A$2:$C$33,3,FALSE)),\"\",\"(\"&(VLOOKUP(L19,Inscrits!$A$2:$C$33,3,FALSE))&\")\"))","v":"(8)"},null,null,"G4"]
[null,null,null,null,null,{"$f":"IF(OR(S4=\"F\",S4=\"A\"),Q4,IF(OR(S8=\"F\",S8=\"A\"),Q8,IF(S4=S8,\"\",(IF(S4<S8,Q4,Q8)))))","v":""},{"$f":"IF(OR(S4=\"F\",S4=\"A\"),R4,IF(OR(S8=\"F\",S8=\"A\"),R8,IF(S4=S8,\"\",(IF(S4<S8,R4,R8)))))","v":""}]
[null,null,null,null,null,null,"P5",null,null,{"$f":"\"(\"&Accueil!G18&\" manches côté perdant)\"","v":"(3 manches côté perdant)"}]

{"sheet":"4","index":6,"n_rows":21,"n_cols":45,"rows_kept":21,"cut":false,"hidden":false,"merged":[[20,9,21,17],[1,42,1,45],[11,42,11,45],[12,1,12,2],[10,20,10,21],[0,9,1,17]]}
[null,null,null,null,null,null,null,null,null,{"$f":"\"(\"&Accueil!D18&\" manches côté gagnant)\"","v":"(3 manches côté gagnant)"}]
[null,null,null,null,null,null,null,null,null,null,null,null,null,null,null,null,null,null,null,null,null,null,null,null,null,null,null,null,null,null,null,null,null,null,null,null,null,null,null,null,null,null,"QUALIFIES"]
[null,null,null,null,null,null,null,null,null,null,"P2",7,{"$f":"IF(IF(ISNA(VLOOKUP(L3,Inscrits!$A$2:$C$33,2,FALSE)),\"\",VLOOKUP(L3,Inscrits!$A$2:$C$33,2,FALSE))=0,\"\",IF(ISNA(VLOOKUP(L3,Inscrits!$A$2:$C$33,2,FALSE)),\"\",VLOOKUP(L3,Inscrits!$A$2:$C$33,2,FALSE)))","v":"BABEL STEPHANIE"},{"$f":"IF(IF(ISNA(VLOOKUP(L3,Inscrits!$A$2:$C$33,3,FALSE)),\"\",\"(\"&(VLOOKUP(L3,Inscrits!$A$2:$C$33,3,FALSE))&\")\")=\"()\",\"\",IF(ISNA(VLOOKUP(L3,Inscrits!$A$2:$C$33,3,FALSE)),\"\",\"(\"&(VLOOKUP(L3,Inscrits!$A$2:$C$33,3,FALSE))&\")\"))","v":"(9)"},null,null,"G1",null,null,null,null,null,null,null,null,null,null,null,"G","P","G","P","G","P","G","P","G","P","G","P","Ga",null,null,"NOM","Ga"]
[null,null,null,null,null,null,null,null,null,{"$f":"IF(OR(AND(O3=\"F\",O5=\"F\"),AND(O3=\"A\",O5=\"A\")),M5,IF(OR(O3=\"F\",O3=\"A\"),M3,IF(OR(O5=\"F\",O5=\"A\"),M5,IF(O3=O5,\"\",(IF(O3<O5,M3,M5))))))","v":""},{"$f":"IF(OR(AND(O3=\"F\",O5=\"F\"),AND(O3=\"A\",O5=\"A\")),N5,IF(OR(O3=\"F\",O3=\"A\"),N3,IF(OR(O5=\"F\",O5=\"A\"),N5,IF(O3=O5,\"\",(IF(O3<O5,N3,N5))))))","v":""},null,"Match 1 - Billard",null,null,null,{"$f":"IF(OR(AND(O3=\"F\",O5=\"F\"),AND(O3=\"A\",O5=\"A\")),M3,IF(OR(O3=\"F\",O3=\"A\"),M5,IF(OR(O5=\"F\",O5=\"A\"),M3,IF(O3=O5,\"\",(IF(O3>O5,M3,M5))))))","v":""},{"$f":"IF(OR(AND(O3=\"F\",O5=\"F\"),AND(O3=\"A\",O5=\"A\")),N3,IF(OR(O3=\"F\",O3=\"A\"),N5,IF(OR(O5=\"F\",O5=\"A\"),N3,IF(O3=O5,\"\",(IF(O3>O5,N3,N5))))))","v":""},null,null,null,null,null,null,1,{"$f":"IF(U6=\"\",\"\",IF(U6=Q4,Q4,Q8))","v":""},null,{"$f":"M3","v":"BABEL STEPHANIE"},{"$f":"IF(AB4=M3,IF(O5=\"F\",\"\",O3),0)","v":0},{"$f":"IF(AB4=M3,IF(O3=\"F\",\"\",O5),0)","v":0},{"$f":"IF(AB4=Q4,IF(S8=\"F\",\"\",S4),0)","v":0},{"$f":"IF(AB4=Q4,IF(S4=\"F\",\"\",S8),0)","v":0},{"$f":"IF(AB4=J4,IF(I8=\"F\",\"\",I4),0)","v":0},{"$f":"IF(AB4=J4,IF(I4=\"F\",\"\",I8),0)","v":0},{"$f":"IF(AB4=F6,IF(E10=\"F\",\"\",E6),0)","v":0},{"$f":"IF(AB4=F6,IF(E6=\"F\",\"\",E10),0)","v":0},{"$f":"IF(AB4=F20,IF(E16=\"F\",\"\",E20),0)","v":0},{"$f":"IF(AB4=F20,IF(E20=\"F\",\"\",E16),0)","v":0},{"$f":"SUM(AC4,AE4,AG4,AI4,AK4)","v":0},0,{"$f":"AM4-AN4","v":0},null,null,{"$f":"Z4","v":""},{"$f":"IF(AR4=\"\",\"\",(VLOOKUP(AR4,AB4:AO17,14,FALSE)))","v":""}]
[null,null,null,null,null,null,"G7",null,null,null,null,26,{"$f":"IF(IF(ISNA(VLOOKUP(L5,Inscrits!$A$2:$C$33,2,FALSE)),\"\",VLOOKUP(L5,Inscrits!$A$2:$C$33,2,FALSE))=0,\"\",IF(ISNA(VLOOKUP(L5,Inscrits!$A$2:$C$33,2,FALSE)),\"\",VLOOKUP(L5,Inscrits!$A$2:$C$33,2,FALSE)))","v":"ELAMRI JAAFAR"},{"$f":"IF(IF(ISNA(VLOOKUP(L5,Inscrits!$A$2:$C$33,3,FALSE)),\"\",\"(\"&(VLOOKUP(L5,Inscrits!$A$2:$C$33,3,FALSE))&\")\")=\"()\",\"\",IF(ISNA(VLOOKUP(L5,Inscrits!$A$2:$C$33,3,FALSE)),\"\",\"(\"&(VLOOKUP(L5,Inscrits!$A$2:$C$33,3,FALSE))&\")\"))","v":"(NC)"},null,null,null,null,null,null,"G5",null,null,null,3,{"$f":"IF(B8=\"\",\"\",IF(B8=F6,F6,F10))","v":""},null,{"$f":"M5","v":"ELAMRI JAAFAR"},{"$f":"IF(AB5=M5,IF(O3=\"F\",\"\",O5),0)","v":0},{"$f":"IF(AB5=M5,IF(O5=\"F\",\"\",O3),0)","v":0},{"$f":"IF(AB5=Q4,IF(S8=\"F\",\"\",S4),0)","v":0},{"$f":"IF(AB5=Q4,IF(S4=\"F\",\"\",S8),0)","v":0},{"$f":"IF(AB5=J4,IF(I8=\"F\",\"\",I4),0)","v":0},{"$f":"IF(AB5=J4,IF(I4=\"F\",\"\",I8),0)","v":0},{"$f":"IF(AB5=F6,IF(E10=\"F\",\"\",E6),0)","v":0},{"$f":"IF(AB5=F6,IF(E6=\"F\",\"\",E10),0)","v":0},{"$f":"IF(AB5=F20,IF(E16=\"F\",\"\",E20),0)","v":0},{"$f":"IF(AB5=F20,IF(E20=\"F\",\"\",E16),0)","v":0},0,0,{"$f":"AM5-AN5","v":0},null,null,{"$f":"Z14","v":""},{"$f":"IF(AR5=\"\",\"\",(VLOOKUP(AR5,AB4:AO17,14,FALSE)))","v":""}]
[null,null,null,null,null,{"$f":"IF(OR(I4=\"F\",I4=\"A\"),J8,IF(OR(I8=\"F\",I8=\"A\"),J4,IF(I4=I8,\"\",(IF(I4>I8,J4,J8)))))","v":""},{"$f":"IF(OR(I4=\"F\",I4=\"A\"),K8,IF(OR(I8=\"F\",I8=\"A\"),K4,IF(I4=I8,\"\",(IF(I4>I8,K4,K8)))))","v":""},null,null,"Match 7 - Billard",null,null,null,null,null,null,"Match 5 - Billard",null,null,null,{"$f":"IF(OR(S4=\"F\",S4=\"A\"),Q8,IF(OR(S8=\"F\",S8=\"A\"),Q4,IF(S4=S8,\"\",(IF(S4>S8,Q4,Q8)))))","v":""},{"$f":"IF(OR(S4=\"F\",S4=\"A\"),R8,IF(OR(S8=\"F\",S8=\"A\"),R4,IF(S4=S8,\"\",(IF(S4>S8,R4,R8)))))","v":""},"G",null,5,{"$f":"IF(B8=\"\",\"\",IF(B8=F6,F10,F6))","v":""},null,{"$f":"M7","v":"AARAB LAHOUSINE"},{"$f":"IF(AB6=M7,IF(O9=\"F\",\"\",O7),0)","v":0},{"$f":"IF(AB6=M7,IF(O7=\"F\",\"\",O9),0)","v":0},{"$f":"IF(AB6=Q8,IF(S4=\"F\",\"\",S8),0)","v":0},{"$f":"IF(AB6=Q8,IF(S8=\"F\",\"\",S4),0)","v":0},{"$f":"IF(AB6=J8,IF(I4=\"F\",\"\",I8),0)","v":0},{"$f":"IF(AB6=J8,IF(I8=\"F\",\"\",I4),0)","v":0},{"$f":"IF(AB6=F6,IF(E10=\"F\",\"\",E6),0)","v":0},{"$f":"IF(AB6=F6,IF(E6=\"F\",\"\",E10),0)","v":0},{"$f":"IF(AB6=F20,IF(E16=\"F\",\"\",E20),0)","v":0},{"$f":"IF(AB6=F20,IF(E20=\"F\",\"\",E16),0)","v":0},0,0,{"$f":"AM6-AN6","v":0},null,null,{"$f":"Z5","v":""},{"$f":"IF(AR6=\"\",\"\",(VLOOKUP(AR6,AB4:AO17,14,FALSE)))","v":""}]
[null,null,"G9",null,null,null,null,null,null,null,null,23,{"$f":"IF(IF(ISNA(VLOOKUP(L7,Inscrits!$A$2:$C$33,2,FALSE)),\"\",VLOOKUP(L7,Inscrits!$A$2:$C$33,2,FALSE))=0,\"\",IF(ISNA(VLOOKUP(L7,Inscrits!$A$2:$C$33,2,FALSE)),\"\",VLOOKUP(L7,Inscrits!$A$2:$C$33,2,FALSE)))","v":"AARAB LAHOUSINE"},{"$f":"IF(IF(ISNA(VLOOKUP(L7,Inscrits!$A$2:$C$33,3,FALSE)),\"\",\"(\"&(VLOOKUP(L7,Inscrits!$A$2:$C$33,3,FALSE))&\")\")=\"()\",\"\",IF(ISNA(VLOOKUP(L7,Inscrits!$A$2:$C$33,3,FALSE)),\"\",\"(\"&(VLOOKUP(L7,Inscrits!$A$2:$C$33,3,FALSE))&\")\"))","v":"(NC)"},null,null,null,null,null,null,null,null,null,null,7,{"$f":"IF(F6=\"\",\"\",IF(F6=J4,J8,J4))","v":""},null,{"$f":"M9","v":"SENES A MARIO"},{"$f":"IF(AB7=M9,IF(O7=\"F\",\"\",O9),0)","v":0},{"$f":"IF(AB7=M9,IF(O9=\"F\",\"\",O7),0)","v":0},{"$f":"IF(AB7=Q8,IF(S4=\"F\",\"\",S8),0)","v":0},{"$f":"IF(AB7=Q8,IF(S8=\"F\",\"\",S4),0)","v":0},{"$f":"IF(AB7=J8,IF(I4=\"F\",\"\",I8),0)","v":0},{"$f":"IF(AB7=J8,IF(I8=\"F\",\"\",I4),0)","v":0},{"$f":"IF(AB7=F6,IF(E10=\"F\",\"\",E6),0)","v":0},{"$f":"IF(AB7=F6,IF(E6=\"F\",\"\",E10),0)","v":0},{"$f":"IF(AB7=F20,IF(E16=\"F\",\"\",E20),0)","v":0},{"$f":"IF(AB7=F20,IF(E20=\"F\",\"\",E16),0)","v":0},0,0,{"$f":"AM7-AN7","v":0},null,null,{"$f":"Z15","v":""},{"$f":"IF(AR7=\"\",\"\",(VLOOKUP(AR7,AB4:AO17,14,FALSE)))","v":""}]
["Y",{"$f":"IF(OR(E6=\"F\",E6=\"A\"),F10,IF(OR(E10=\"F\",E10=\"A\"),F6,IF(E6=E10,\"\",(IF(E6>E10,F6,F10)))))","v":""},{"$f":"IF(OR(E6=\"F\",E6=\"A\"),G10,IF(OR(E10=\"F\",E10=\"A\"),G6,IF(E6=E10,\"\",(IF(E6>E10,G6,G10)))))","v":""},null,null,"Match 9 - Billard",null,null,null,{"$f":"IF(OR(AND(O7=\"F\",O9=\"F\"),AND(O7=\"A\",O9=\"A\")),M9,IF(OR(O7=\"F\",O7=\"A\"),M7,IF(OR(O9=\"F\",O9=\"A\"),M9,IF(O7=O9,\"\",(IF(O7<O9,M7,M9))))))","v":""},{"$f":"IF(OR(AND(O7=\"F\",O9=\"F\"),AND(O7=\"A\",O9=\"A\")),N9,IF(OR(O7=\"F\",O7=\"A\"),N7,IF(OR(O9=\"F\",O9=\"A\"),N9,IF(O7=O9,\"\",(IF(O7<O9,N7,N9))))))","v":""},null,"Match 2 - Billard",null,null,null,{"$f":"IF(OR(AND(O7=\"F\",O9=\"F\"),AND(O7=\"A\",O9=\"A\")),M7,IF(OR(O7=\"F\",O7=\"A\"),M9,IF(OR(O9=\"F\",O9=\"A\"),M7,IF(O7=O9,\"\",(IF(O7>O9,M7,M9))))))","v":""},{"$f":"IF(OR(AND(O7=\"F\",O9=\"F\"),AND(O7=\"A\",O9=\"A\")),N7,IF(OR(O7=\"F\",O7=\"A\"),N9,IF(OR(O9=\"F\",O9=\"A\"),N7,IF(O7=O9,\"\",(IF(O7>O9,N7,N9))))))","v":""}]
[null,null,null,null,null,null,null,null,null,null,"P2",10,{"$f":"IF(IF(ISNA(VLOOKUP(L9,Inscrits!$A$2:$C$33,2,FALSE)),\"\",VLOOKUP(L9,Inscrits!$A$2:$C$33,2,FALSE))=0,\"\",IF(ISNA(VLOOKUP(L9,Inscrits!$A$2:$C$33,2,FALSE)),\"\",VLOOKUP(L9,Inscrits!$A$2:$C$33,2,FALSE)))","v":"SENES A MARIO"},{"$f":"IF(IF(ISNA(VLOOKUP(L9,Inscrits!$A$2:$C$33,3,FALSE)),\"\",\"(\"&(VLOOKUP(L9,Inscrits!$A$2:$C$33,3,FALSE))&\")\")=\"()\",\"\",IF(ISNA(VLOOKUP(L9,Inscrits!$A$2:$C$33,3,FALSE)),\"\",\"(\"&(VLOOKUP(L9,Inscrits!$A$2:$C$33,3,FALSE))&\")\"))","v":"(13)"},null,null,"G2"]
[null,null,null,null,null,{"$f":"IF(OR(S14=\"F\",S14=\"A\"),Q14,IF(OR(S18=\"F\",S18=\"A\"),Q18,IF(S14=S18,\"\",(IF(S14<S18,Q14,Q18)))))","v":""},{"$f":"IF(OR(S14=\"F\",S14=\"A\"),R14,IF(OR(S18=\"F\",S18=\"A\"),R18,IF(S14=S18,\"\",(IF(S14<S18,R14,R18)))))","v":""}]
[null,null,null,null,null,null,"P6",null,null,null,null,null,null,null,null,null,null,null,null,null,"QUALIFIES"]
[null,null,null,null,null,null,null,null,null,null,null,null,null,null,null,null,null,null,null,null,null,null,null,null,null,null,null,null,null,null,null,null,null,null,null,null,null,null,null,null,null,null,"ELIMINES"]
[null,"QUALIFIES",null,null,null,null,null,null,null,null,"P3",15,{"$f":"IF(IF(ISNA(VLOOKUP(L13,Inscrits!$A$2:$C$33,2,FALSE)),\"\",VLOOKUP(L13,Inscrits!$A$2:$C$33,2,FALSE))=0,\"\",IF(ISNA(VLOOKUP(L13,Inscrits!$A$2:$C$33,2,FALSE)),\"\",VLOOKUP(L13,Inscrits!$A$2:$C$33,2,FALSE)))","v":"DURET CHRISTOPHE"},{"$f":"IF(IF(ISNA(VLOOKUP(L13,Inscrits!$A$2:$C$33,3,FALSE)),\"\",\"(\"&(VLOOKUP(L13,Inscrits!$A$2:$C$33,3,FALSE))&\")\")=\"()\",\"\",IF(ISNA(VLOOKUP(L13,Inscrits!$A$2:$C$33,3,FALSE)),\"\",\"(\"&(VLOOKUP(L13,Inscrits!$A$2:$C$33,3,FALSE))&\")\"))","v":"(24)"},null,null,"G3",null,null,null,null,null,null,null,null,null,null,null,"G","P","G","P","G","P","G","P","G","P","G","P","Ga",null,null,"NOM","Ga"]
[null,null,null,null,null,null,null,null,null,{"$f":"IF(OR(AND(O13=\"F\",O15=\"F\"),AND(O13=\"A\",O15=\"A\")),M15,IF(OR(O13=\"F\",O13=\"A\"),M13,IF(OR(O15=\"F\",O15=\"A\"),M15,IF(O13=O15,\"\",(IF(O13<O15,M13,M15))))))","v":""},{"$f":"IF(OR(AND(O13=\"F\",O15=\"F\"),AND(O13=\"A\",O15=\"A\")),N15,IF(OR(O13=\"F\",O13=\"A\"),N13,IF(OR(O15=\"F\",O15=\"A\"),N15,IF(O13=O15,\"\",(IF(O13<O15,N13,N15))))))","v":""},null,"Match 3 - Billard",null,null,null,{"$f":"IF(OR(AND(O13=\"F\",O15=\"F\"),AND(O13=\"A\",O15=\"A\")),M13,IF(OR(O13=\"F\",O13=\"A\"),M15,IF(OR(O15=\"F\",O15=\"A\"),M13,IF(O13=O15,\"\",(IF(O13>O15,M13,M15))))))","v":""},{"$f":"IF(OR(AND(O13=\"F\",O15=\"F\"),AND(O13=\"A\",O15=\"A\")),N13,IF(OR(O13=\"F\",O13=\"A\"),N15,IF(OR(O15=\"F\",O15=\"A\"),N13,IF(O13=O15,\"\",(IF(O13>O15,N13,N15))))))","v":""},null,null,null,null,null,null,2,{"$f":"IF(U16=\"\",\"\",IF(U16=Q14,Q14,Q18))","v":""},null,{"$f":"M13","v":"DURET CHRISTOPHE"},{"$f":"IF(AB14=M13,IF(O15=\"F\",\"\",O13),0)","v":0},{"$f":"IF(AB14=M13,IF(O13=\"F\",\"\",O15),0)","v":0},{"$f":"IF(AB14=Q14,IF(S18=\"F\",\"\",S14),0)","v":0},{"$f":"IF(AB14=Q14,IF(S14=\"F\",\"\",S18),0)","v":0},{"$f":"IF(AB14=J14,IF(I18=\"F\",\"\",I14),0)","v":0},{"$f":"IF(AB14=J14,IF(I14=\"F\",\"\",I18),0)","v":0},{"$f":"IF(AB14=F16,IF(E20=\"F\",\"\",E16),0)","v":0},{"$f":"IF(AB14=F16,IF(E16=\"F\",\"\",E20),0)","v":0},{"$f":"IF(AB14=F10,IF(E6=\"F\",\"\",E10),0)","v":0},{"$f":"IF(AB14=F10,IF(E10=\"F\",\"\",E6),0)","v":0},{"$f":"SUM(AC14,AE14,AG14,AI14,AK14)","v":0},0,{"$f":"AM14-AN14","v":0},null,null,{"$f":"Z6","v":""},{"$f":"IF(AR14=\"\",\"\",(VLOOKUP(AR14,AB4:AO17,14,FALSE)))","v":""}]
[null,null,null,null,null,null,"G8",null,null,null,null,18,{"$f":"IF(IF(ISNA(VLOOKUP(L15,Inscrits!$A$2:$C$33,2,FALSE)),\"\",VLOOKUP(L15,Inscrits!$A$2:$C$33,2,FALSE))=0,\"\",IF(ISNA(VLOOKUP(L15,Inscrits!$A$2:$C$33,2,FALSE)),\"\",VLOOKUP(L15,Inscrits!$A$2:$C$33,2,FALSE)))","v":"SUDARA BRUNO"},{"$f":"IF(IF(ISNA(VLOOKUP(L15,Inscrits!$A$2:$C$33,3,FALSE)),\"\",\"(\"&(VLOOKUP(L15,Inscrits!$A$2:$C$33,3,FALSE))&\")\")=\"()\",\"\",IF(ISNA(VLOOKUP(L15,Inscrits!$A$2:$C$33,3,FALSE)),\"\",\"(\"&(VLOOKUP(L15,Inscrits!$A$2:$C$33,3,FALSE))&\")\"))","v":"(33)"},null,null,null,null,null,null,"G6",null,null,null,4,{"$f":"IF(B18=\"\",\"\",IF(B18=F16,F16,F20))","v":""},null,{"$f":"M15","v":"SUDARA BRUNO"},{"$f":"IF(AB15=M15,IF(O13=\"F\",\"\",O15),0)","v":0},{"$f":"IF(AB15=M15,IF(O15=\"F\",\"\",O13),0)","v":0},{"$f":"IF(AB15=Q14,IF(S18=\"F\",\"\",S14),0)","v":0},{"$f":"IF(AB15=Q14,IF(S14=\"F\",\"\",S18),0)","v":0},{"$f":"IF(AB15=J14,IF(I18=\"F\",\"\",I14),0)","v":0},{"$f":"IF(AB15=J14,IF(I14=\"F\",\"\",I18),0)","v":0},{"$f":"IF(AB15=F16,IF(E20=\"F\",\"\",E16),0)","v":0},{"$f":"IF(AB15=F16,IF(E16=\"F\",\"\",E20),0)","v":0},{"$f":"IF(AB15=F10,IF(E6=\"F\",\"\",E10),0)","v":0},{"$f":"IF(AB15=F10,IF(E10=\"F\",\"\",E6),0)","v":0},0,0,{"$f":"AM15-AN15","v":0},null,null,{"$f":"Z16","v":""},{"$f":"IF(AR15=\"\",\"\",(VLOOKUP(AR15,AB4:AO17,14,FALSE)))","v":""}]
[null,null,null,null,null,{"$f":"IF(OR(I14=\"F\",I14=\"A\"),J18,IF(OR(I18=\"F\",I18=\"A\"),J14,IF(I14=I18,\"\",(IF(I14>I18,J14,J18)))))","v":""},{"$f":"IF(OR(I14=\"F\",I14=\"A\"),K18,IF(OR(I18=\"F\",I18=\"A\"),K14,IF(I14=I18,\"\",(IF(I14>I18,K14,K18)))))","v":""},null,null,"Match 8 - Billard",null,null,null,null,null,null,"Match 6 - Billard",null,null,null,{"$f":"IF(OR(S14=\"F\",S14=\"A\"),Q18,IF(OR(S18=\"F\",S18=\"A\"),Q14,IF(S14=S18,\"\",(IF(S14>S18,Q14,Q18)))))","v":""},{"$f":"IF(OR(S14=\"F\",S14=\"A\"),R18,IF(OR(S18=\"F\",S18=\"A\"),R14,IF(S14=S18,\"\",(IF(S14>S18,R14,R18)))))","v":""},"H",null,6,{"$f":"IF(B18=\"\",\"\",IF(B18=F16,F20,F16))","v":""},null,{"$f":"M17","v":"Blanc 5"},{"$f":"IF(AB16=M17,IF(O19=\"F\",\"\",O17),0)","v":"F"},{"$f":"IF(AB16=M17,IF(O17=\"F\",\"\",O19),0)","v":""},{"$f":"IF(AB16=Q18,IF(S14=\"F\",\"\",S18),0)","v":0},{"$f":"IF(AB16=Q18,IF(S18=\"F\",\"\",S14),0)","v":0},{"$f":"IF(AB16=J18,IF(I14=\"F\",\"\",I18),0)","v":0},{"$f":"IF(AB16=J18,IF(I18=\"F\",\"\",I14),0)","v":0},{"$f":"IF(AB16=F16,IF(E20=\"F\",\"\",E16),0)","v":0},{"$f":"IF(AB16=F16,IF(E16=\"F\",\"\",E20),0)","v":0},{"$f":"IF(AB16=F10,IF(E6=\"F\",\"\",E10),0)","v":0},{"$f":"IF(AB16=F10,IF(E10=\"F\",\"\",E6),0)","v":0},0,0,{"$f":"AM16-AN16","v":0},null,null,{"$f":"Z7","v":""},{"$f":"IF(AR16=\"\",\"\",(VLOOKUP(AR16,AB4:AO17,14,FALSE)))","v":""}]
[null,null,"G10",null,null,null,null,null,null,null,null,31,{"$f":"IF(IF(ISNA(VLOOKUP(L17,Inscrits!$A$2:$C$33,2,FALSE)),\"\",VLOOKUP(L17,Inscrits!$A$2:$C$33,2,FALSE))=0,\"\",IF(ISNA(VLOOKUP(L17,Inscrits!$A$2:$C$33,2,FALSE)),\"\",VLOOKUP(L17,Inscrits!$A$2:$C$33,2,FALSE)))","v":"Blanc 5"},{"$f":"IF(IF(ISNA(VLOOKUP(L17,Inscrits!$A$2:$C$33,3,FALSE)),\"\",\"(\"&(VLOOKUP(L17,Inscrits!$A$2:$C$33,3,FALSE))&\")\")=\"()\",\"\",IF(ISNA(VLOOKUP(L17,Inscrits!$A$2:$C$33,3,FALSE)),\"\",\"(\"&(VLOOKUP(L17,Inscrits!$A$2:$C$33,3,FALSE))&\")\"))","v":""},"F",null,null,null,null,null,null,null,null,null,8,{"$f":"IF(F16=\"\",\"\",IF(F16=J14,J18,J14))","v":""},null,{"$f":"M19","v":"CENDRIER DAVID"},{"$f":"IF(AB17=M19,IF(O17=\"F\",\"\",O19),0)","v":""},{"$f":"IF(AB17=M19,IF(O19=\"F\",\"\",O17),0)","v":"F"},{"$f":"IF(AB17=Q18,IF(S14=\"F\",\"\",S18),0)","v":0},{"$f":"IF(AB17=Q18,IF(S18=\"F\",\"\",S14),0)","v":0},{"$f":"IF(AB17=J18,IF(I14=\"F\",\"\",I18),0)","v":0},{"$f":"IF(AB17=J18,IF(I18=\"F\",\"\",I14),0)","v":0},{"$f":"IF(AB17=F16,IF(E20=\"F\",\"\",E16),0)","v":0},{"$f":"IF(AB17=F16,IF(E16=\"F\",\"\",E20),0)","v":0},{"$f":"IF(AB17=F10,IF(E6=\"F\",\"\",E10),0)","v":0},{"$f":"IF(AB17=F10,IF(E10=\"F\",\"\",E6),0)","v":0},0,0,{"$f":"AM17-AN17","v":0},null,null,{"$f":"Z17","v":""},{"$f":"IF(AR17=\"\",\"\",(VLOOKUP(AR17,AB4:AO17,14,FALSE)))","v":""}]
["Z",{"$f":"IF(OR(E16=\"F\",E16=\"A\"),F20,IF(OR(E20=\"F\",E20=\"A\"),F16,IF(E16=E20,\"\",(IF(E16>E20,F16,F20)))))","v":""},{"$f":"IF(OR(E16=\"F\",E16=\"A\"),G20,IF(OR(E20=\"F\",E20=\"A\"),G16,IF(E16=E20,\"\",(IF(E16>E20,G16,G20)))))","v":""},null,null,"Match 10 - Billard",null,null,null,{"$f":"IF(OR(AND(O17=\"F\",O19=\"F\"),AND(O17=\"A\",O19=\"A\")),M19,IF(OR(O17=\"F\",O17=\"A\"),M17,IF(OR(O19=\"F\",O19=\"A\"),M19,IF(O17=O19,\"\",(IF(O17<O19,M17,M19))))))","v":"Blanc 5"},{"$f":"IF(OR(AND(O17=\"F\",O19=\"F\"),AND(O17=\"A\",O19=\"A\")),N19,IF(OR(O17=\"F\",O17=\"A\"),N17,IF(OR(O19=\"F\",O19=\"A\"),N19,IF(O17=O19,\"\",(IF(O17<O19,N17,N19))))))","v":""},null,"Match 4 - Billard",null,null,null,{"$f":"IF(OR(AND(O17=\"F\",O19=\"F\"),AND(O17=\"A\",O19=\"A\")),M17,IF(OR(O17=\"F\",O17=\"A\"),M19,IF(OR(O19=\"F\",O19=\"A\"),M17,IF(O17=O19,\"\",(IF(O17>O19,M17,M19))))))","v":"CENDRIER DAVID"},{"$f":"IF(OR(AND(O17=\"F\",O19=\"F\"),AND(O17=\"A\",O19=\"A\")),N17,IF(OR(O17=\"F\",O17=\"A\"),N19,IF(OR(O19=\"F\",O19=\"A\"),N17,IF(O17=O19,\"\",(IF(O17>O19,N17,N19))))))","v":"(2)"}]
[null,null,null,null,null,null,null,null,null,null,"P4",2,{"$f":"IF(IF(ISNA(VLOOKUP(L19,Inscrits!$A$2:$C$33,2,FALSE)),\"\",VLOOKUP(L19,Inscrits!$A$2:$C$33,2,FALSE))=0,\"\",IF(ISNA(VLOOKUP(L19,Inscrits!$A$2:$C$33,2,FALSE)),\"\",VLOOKUP(L19,Inscrits!$A$2:$C$33,2,FALSE)))","v":"CENDRIER DAVID"},{"$f":"IF(IF(ISNA(VLOOKUP(L19,Inscrits!$A$2:$C$33,3,FALSE)),\"\",\"(\"&(VLOOKUP(L19,Inscrits!$A$2:$C$33,3,FALSE))&\")\")=\"()\",\"\",IF(ISNA(VLOOKUP(L19,Inscrits!$A$2:$C$33,3,FALSE)),\"\",\"(\"&(VLOOKUP(L19,Inscrits!$A$2:$C$33,3,FALSE))&\")\"))","v":"(2)"},null,null,"G4"]
[null,null,null,null,null,{"$f":"IF(OR(S4=\"F\",S4=\"A\"),Q4,IF(OR(S8=\"F\",S8=\"A\"),Q8,IF(S4=S8,\"\",(IF(S4<S8,Q4,Q8)))))","v":""},{"$f":"IF(OR(S4=\"F\",S4=\"A\"),R4,IF(OR(S8=\"F\",S8=\"A\"),R8,IF(S4=S8,\"\",(IF(S4<S8,R4,R8)))))","v":""}]
[null,null,null,null,null,null,"P5",null,null,{"$f":"\"(\"&Accueil!G18&\" manches côté perdant)\"","v":"(3 manches côté perdant)"}]

{"sheet":"Final","index":7,"n_rows":35,"n_cols":35,"rows_kept":35,"cut":false,"hidden":false,"merged":[[1,5,1,7],[1,9,1,11],[1,13,1,15],[0,1,0,3],[1,1,1,3],[0,13,0,15],[0,9,0,11],[0,5,0,7]]}
[null,"1/8 de finale",null,null,null,"1/4 de finale",null,null,null,"1/2 finale",null,null,null,"Finale"]
[null,{"$f":"\"(\"&Accueil!D20&\" manches)\"","v":"(4 manches)"},null,null,null,{"$f":"\"(\"&Accueil!G20&\" manches)\"","v":"(4 manches)"},null,null,null,{"$f":"\"(\"&Accueil!D22&\" manches)\"","v":"(4 manches)"},null,null,null,{"$f":"\"(\"&Accueil!G22&\" manches)\"","v":"(5 manches)"}]
[null,"Match 1 - Billard",null,null,null,null,null,null,null,null,null,null,null,null,null,null,null,null,null,null,null,"JOUEURS","1/8","1/4","1/2","Finale","GA Final",null,"JOUEURS","GA Poules",null,"JOUEURS","GA Poules","GA Final","GA TOTAL"]
["A",{"$f":"IF('1'!U6=0,\"\",'1'!U6)","v":""},{"$f":"IF('1'!V6=0,\"\",'1'!V6)","v":""},null,null,null,null,null,null,null,null,null,null,null,null,null,null,null,null,null,null,{"$f":"B4","v":""},{"$f":"IF(AND(D4=\"A\",D5=\"A\"),0,IF(D4=\"A\",-D5,IF(D5=\"A\",D4,D4-D5)))","v":0},{"$f":"IF(F5=V4,IF(AND(H5=\"A\",H7=\"A\"),0,IF(OR(W4>0,D5=\"A\"),IF(H5=\"A\",-H7,IF(H7=\"A\",H5,H5-H7)),0)),0)","v":0},{"$f":"IF(J6=V4,IF(AND(L6=\"A\",L12=\"A\"),0,IF(OR(X4>0,H7=\"A\"),IF(L6=\"A\",-L12,IF(L12=\"A\",L6,L6-L12)),0)),0)","v":0},{"$f":"IF(N9=V4,IF(AND(P9=\"A\",P21=\"A\"),0,IF(OR(Y4>0,L12=\"A\"),IF(P9=\"A\",-P21,IF(P21=\"A\",P9,P9-P21)),0)),0)","v":0},{"$f":"SUM(W4:Z4)","v":0},null,{"$f":"'1'!AR4","v":""},{"$f":"'1'!AS4","v":""},null,{"$f":"IF(Inscrits!B2=0,\"\",Inscrits!B2)","v":"DUARTE JOSE"},{"$f":"VLOOKUP(AF4,$AC$4:$AD$35,2,FALSE)","v":{"$error":"#N/A"}},{"$f":"VLOOKUP(AF4,$V$4:$AA$35,6,FALSE)","v":{"$error":"#N/A"}},{"$f":"AG4+AH4","v":{"$error":"#N/A"}}]
["W",{"$f":"IF('3'!B8=0,\"\",'3'!B8)","v":""},{"$f":"IF('3'!C8=0,\"\",'3'!C8)","v":""},null,null,{"$f":"IF(AND(D4=\"A\",D5=\"A\"),B4,IF(D4=\"A\",B5,IF(D5=\"A\",B4,IF(D4=D5,\"\",(IF(D4>D5,B4,B5))))))","v":""},{"$f":"IF(AND(D4=\"A\",D5=\"A\"),C4,IF(D4=\"A\",C5,IF(D5=\"A\",C4,IF(D4=D5,\"\",(IF(D4>D5,C4,C5))))))","v":""},null,null,null,null,null,null,null,null,null,null,null,null,null,null,{"$f":"B5","v":""},{"$f":"IF(AND(D4=\"A\",D5=\"A\"),0,IF(D5=\"A\",-D4,IF(D4=\"A\",D5,D5-D4)))","v":0},{"$f":"IF(F5=V5,IF(AND(H5=\"A\",H7=\"A\"),0,IF(OR(W5>0,D4=\"A\"),IF(H5=\"A\",-H7,IF(H7=\"A\",H5,H5-H7)),0)),0)","v":0},{"$f":"IF(J6=V5,IF(AND(L6=\"A\",L12=\"A\"),0,IF(OR(X5>0,H7=\"A\"),IF(L6=\"A\",-L12,IF(L12=\"A\",L6,L6-L12)),0)),0)","v":0},{"$f":"IF(N9=V5,IF(AND(P9=\"A\",P21=\"A\"),0,IF(OR(Y5>0,L12=\"A\"),IF(P9=\"A\",-P21,IF(P21=\"A\",P9,P9-P21)),0)),0)","v":0},{"$f":"SUM(W5:Z5)","v":0},null,{"$f":"'1'!AR5","v":""},{"$f":"'1'!AS5","v":""},null,{"$f":"IF(Inscrits!B3=0,\"\",Inscrits!B3)","v":"CENDRIER DAVID"},{"$f":"VLOOKUP(AF5,$AC$4:$AD$35,2,FALSE)","v":{"$error":"#N/A"}},{"$f":"VLOOKUP(AF5,$V$4:$AA$35,6,FALSE)","v":{"$error":"#N/A"}},{"$error":"#N/A"}]
[null,"Match 2 - Billard",null,null,null,"Match 9 - Billard",null,null,null,{"$f":"IF(AND(H5=\"A\",H7=\"A\"),F5,IF(H5=\"A\",F7,IF(H7=\"A\",F5,IF(H5=H7,\"\",(IF(H5>H7,F5,F7))))))","v":""},{"$f":"IF(AND(H5=\"A\",H7=\"A\"),G5,IF(H5=\"A\",G7,IF(H7=\"A\",G5,IF(H5=H7,\"\",(IF(H5>H7,G5,G7))))))","v":""},null,null,null,null,null,null,null,null,null,null,{"$f":"B7","v":""},{"$f":"IF(AND(D7=\"A\",D8=\"A\"),0,IF(D7=\"A\",-D8,IF(D8=\"A\",D7,D7-D8)))","v":0},{"$f":"IF(F7=V6,IF(AND(H5=\"A\",H7=\"A\"),0,IF(OR(W6>0,D8=\"A\"),IF(H7=\"A\",-H5,IF(H5=\"A\",H7,H7-H5)),0)),0)","v":0},{"$f":"IF(J6=V6,IF(AND(L6=\"A\",L12=\"A\"),0,IF(OR(X6>0,H5=\"A\"),IF(L6=\"A\",-L12,IF(L12=\"A\",L6,L6-L12)),0)),0)","v":0},{"$f":"IF(N9=V6,IF(AND(P9=\"A\",P21=\"A\"),0,IF(OR(Y6>0,L12=\"A\"),IF(P9=\"A\",-P21,IF(P21=\"A\",P9,P9-P21)),0)),0)","v":0},0,null,{"$f":"'1'!AR6","v":""},{"$f":"'1'!AS6","v":""},null,{"$f":"IF(Inscrits!B4=0,\"\",Inscrits!B4)","v":"DE ALMEIDA DUARTE FREDERICO"},{"$error":"#N/A"},{"$error":"#N/A"},{"$error":"#N/A"}]
["B",{"$f":"IF('1'!U16=0,\"\",'1'!U16)","v":""},{"$f":"IF('1'!V16=0,\"\",'1'!V16)","v":""},null,null,{"$f":"IF(AND(D7=\"A\",D8=\"A\"),B7,IF(D7=\"A\",B8,IF(D8=\"A\",B7,IF(D7=D8,\"\",(IF(D7>D8,B7,B8))))))","v":""},{"$f":"IF(AND(D7=\"A\",D8=\"A\"),C7,IF(D7=\"A\",C8,IF(D8=\"A\",C7,IF(D7=D8,\"\",(IF(D7>D8,C7,C8))))))","v":""},null,null,null,null,null,null,null,null,null,null,null,null,null,null,{"$f":"B8","v":""},{"$f":"IF(AND(D7=\"A\",D8=\"A\"),0,IF(D8=\"A\",-D7,IF(D7=\"A\",D8,D8-D7)))","v":0},{"$f":"IF(F7=V7,IF(AND(H5=\"A\",H7=\"A\"),0,IF(OR(W7>0,D7=\"A\"),IF(H7=\"A\",-H5,IF(H5=\"A\",H7,H7-H5)),0)),0)","v":0},{"$f":"IF(J6=V7,IF(AND(L6=\"A\",L12=\"A\"),0,IF(OR(X7>0,H5=\"A\"),IF(L6=\"A\",-L12,IF(L12=\"A\",L6,L6-L12)),0)),0)","v":0},{"$f":"IF(N9=V7,IF(AND(P9=\"A\",P21=\"A\"),0,IF(OR(Y7>0,L12=\"A\"),IF(P9=\"A\",-P21,IF(P21=\"A\",P9,P9-P21)),0)),0)","v":0},0,null,{"$f":"'1'!AR7","v":""},{"$f":"'1'!AS7","v":""},null,{"$f":"IF(Inscrits!B5=0,\"\",Inscrits!B5)","v":"MONTPELLIER BRUNO"},{"$error":"#N/A"},{"$error":"#N/A"},{"$error":"#N/A"}]
["X",{"$f":"IF('4'!B18=0,\"\",'4'!B18)","v":""},{"$f":"IF('4'!C18=0,\"\",'4'!C18)","v":""},null,null,null,null,null,null,null,null,null,null,null,null,null,null,null,null,null,null,{"$f":"B10","v":""},{"$f":"IF(AND(D10=\"A\",D11=\"A\"),0,IF(D10=\"A\",-D11,IF(D11=\"A\",D10,D10-D11)))","v":0},{"$f":"IF(F11=V8,IF(AND(H11=\"A\",H13=\"A\"),0,IF(OR(W8>0,D11=\"A\"),IF(H11=\"A\",-H13,IF(H13=\"A\",H11,H11-H13)),0)),0)","v":0},{"$f":"IF(J12=V8,IF(AND(L6=\"A\",L12=\"A\"),0,IF(OR(X8>0,H13=\"A\"),IF(L12=\"A\",-L6,IF(L6=\"A\",L12,L12-L6)),0)),0)","v":0},{"$f":"IF(N9=V8,IF(AND(P9=\"A\",P21=\"A\"),0,IF(OR(Y8>0,L6=\"A\"),IF(P9=\"A\",-P21,IF(P21=\"A\",P9,P9-P21)),0)),0)","v":0},0,null,{"$f":"'1'!AR14","v":""},{"$f":"'1'!AS14","v":""},null,{"$f":"IF(Inscrits!B6=0,\"\",Inscrits!B6)","v":"GROS ERIC"},{"$error":"#N/A"},{"$error":"#N/A"},{"$error":"#N/A"}]
[null,"Match 3 - Billard",null,null,null,null,null,null,null,"Match 13 - Billard",null,null,null,{"$f":"IF(AND(L6=\"A\",L12=\"A\"),J6,IF(L6=\"A\",J12,IF(L12=\"A\",J6,IF(L6=L12,\"\",(IF(L6>L12,J6,J12))))))","v":""},{"$f":"IF(AND(L6=\"A\",L12=\"A\"),K6,IF(L6=\"A\",K12,IF(L12=\"A\",K6,IF(L6=L12,\"\",(IF(L6>L12,K6,K12))))))","v":""},null,null,null,null,null,null,{"$f":"B11","v":""},{"$f":"IF(AND(D10=\"A\",D11=\"A\"),0,IF(D11=\"A\",-D10,IF(D10=\"A\",D11,D11-D10)))","v":0},{"$f":"IF(F11=V9,IF(AND(H11=\"A\",H13=\"A\"),0,IF(OR(W9>0,D10=\"A\"),IF(H11=\"A\",-H13,IF(H13=\"A\",H11,H11-H13)),0)),0)","v":0},{"$f":"IF(J12=V9,IF(AND(L6=\"A\",L12=\"A\"),0,IF(OR(X9>0,H13=\"A\"),IF(L12=\"A\",-L6,IF(L6=\"A\",L12,L12-L6)),0)),0)","v":0},{"$f":"IF(N9=V9,IF(AND(P9=\"A\",P21=\"A\"),0,IF(OR(Y9>0,L6=\"A\"),IF(P9=\"A\",-P21,IF(P21=\"A\",P9,P9-P21)),0)),0)","v":0},0,null,{"$f":"'1'!AR15","v":""},{"$f":"'1'!AS15","v":""},null,{"$f":"IF(Inscrits!B7=0,\"\",Inscrits!B7)","v":"TASSET JEROME"},{"$error":"#N/A"},{"$error":"#N/A"},{"$error":"#N/A"}]
["C",{"$f":"IF('2'!U6=0,\"\",'2'!U6)","v":""},{"$f":"IF('2'!V6=0,\"\",'2'!V6)","v":""},null,null,null,null,null,null,null,null,null,null,null,null,null,null,null,null,null,null,{"$f":"B13","v":""},{"$f":"IF(AND(D13=\"A\",D14=\"A\"),0,IF(D13=\"A\",-D14,IF(D14=\"A\",D13,D13-D14)))","v":0},{"$f":"IF(F13=V10,IF(AND(H11=\"A\",H13=\"A\"),0,IF(OR(W10>0,D14=\"A\"),IF(H13=\"A\",-H11,IF(H11=\"A\",H13,H13-H11)),0)),0)","v":0},{"$f":"IF(J12=V10,IF(AND(L6=\"A\",L12=\"A\"),0,IF(OR(X10>0,H11=\"A\"),IF(L12=\"A\",-L6,IF(L6=\"A\",L12,L12-L6)),0)),0)","v":0},{"$f":"IF(N9=V10,IF(AND(P9=\"A\",P21=\"A\"),0,IF(OR(Y10>0,L6=\"A\"),IF(P9=\"A\",-P21,IF(P21=\"A\",P9,P9-P21)),0)),0)","v":0},0,null,{"$f":"'1'!AR16","v":""},{"$f":"'1'!AS16","v":""},null,{"$f":"IF(Inscrits!B8=0,\"\",Inscrits!B8)","v":"BABEL STEPHANIE"},{"$error":"#N/A"},{"$error":"#N/A"},{"$error":"#N/A"}]
["Y",{"$f":"IF('4'!B8=0,\"\",'4'!B8)","v":""},{"$f":"IF('4'!C8=0,\"\",'4'!C8)","v":""},null,null,{"$f":"IF(AND(D10=\"A\",D11=\"A\"),B10,IF(D10=\"A\",B11,IF(D11=\"A\",B10,IF(D10=D11,\"\",(IF(D10>D11,B10,B11))))))","v":""},{"$f":"IF(AND(D10=\"A\",D11=\"A\"),C10,IF(D10=\"A\",C11,IF(D11=\"A\",C10,IF(D10=D11,\"\",(IF(D10>D11,C10,C11))))))","v":""},null,null,null,null,null,null,null,null,null,null,null,null,null,null,{"$f":"B14","v":""},{"$f":"IF(AND(D13=\"A\",D14=\"A\"),0,IF(D14=\"A\",-D13,IF(D13=\"A\",D14,D14-D13)))","v":0},{"$f":"IF(F13=V11,IF(AND(H11=\"A\",H13=\"A\"),0,IF(OR(W11>0,D13=\"A\"),IF(H13=\"A\",-H11,IF(H11=\"A\",H13,H13-H11)),0)),0)","v":0},{"$f":"IF(J12=V11,IF(AND(L6=\"A\",L12=\"A\"),0,IF(OR(X11>0,H11=\"A\"),IF(L12=\"A\",-L6,IF(L6=\"A\",L12,L12-L6)),0)),0)","v":0},{"$f":"IF(N9=V11,IF(AND(P9=\"A\",P21=\"A\"),0,IF(OR(Y11>0,L6=\"A\"),IF(P9=\"A\",-P21,IF(P21=\"A\",P9,P9-P21)),0)),0)","v":0},0,null,{"$f":"'1'!AR17","v":""},{"$f":"'1'!AS17","v":""},null,{"$f":"IF(Inscrits!B9=0,\"\",Inscrits!B9)","v":"CARNIATO LORENZO"},{"$error":"#N/A"},{"$error":"#N/A"},{"$error":"#N/A"}]
[null,"Match 4 - Billard",null,null,null,"Match 10 - Billard",null,null,null,{"$f":"IF(AND(H11=\"A\",H13=\"A\"),F11,IF(H11=\"A\",F13,IF(H13=\"A\",F11,IF(H11=H13,\"\",(IF(H11>H13,F11,F13))))))","v":""},{"$f":"IF(AND(H11=\"A\",H13=\"A\"),G11,IF(H11=\"A\",G13,IF(H13=\"A\",G11,IF(H11=H13,\"\",(IF(H11>H13,G11,G13))))))","v":""},null,null,null,null,null,null,null,null,null,null,{"$f":"B16","v":""},{"$f":"IF(AND(D16=\"A\",D17=\"A\"),0,IF(D16=\"A\",-D17,IF(D17=\"A\",D16,D16-D17)))","v":0},{"$f":"IF(F17=V12,IF(AND(H17=\"A\",H19=\"A\"),0,IF(OR(W12>0,D17=\"A\"),IF(H17=\"A\",-H19,IF(H19=\"A\",H17,H17-H19)),0)),0)","v":0},{"$f":"IF(J18=V12,IF(AND(L18=\"A\",L24=\"A\"),0,IF(OR(X12>0,H19=\"A\"),IF(L18=\"A\",-L24,IF(L24=\"A\",L18,L18-L24)),0)),0)","v":0},{"$f":"IF(N21=V12,IF(AND(P9=\"A\",P21=\"A\"),0,IF(OR(Y12>0,L24=\"A\"),IF(P21=\"A\",-P9,IF(P9=\"A\",P21,P21-P9)),0)),0)","v":0},0,null,{"$f":"'2'!AR4","v":""},{"$f":"'2'!AS4","v":""},null,{"$f":"IF(Inscrits!B10=0,\"\",Inscrits!B10)","v":"BERRAHOU SOLANGE"},{"$error":"#N/A"},{"$error":"#N/A"},{"$error":"#N/A"}]
["D",{"$f":"IF('2'!U16=0,\"\",'2'!U16)","v":""},{"$f":"IF('2'!V16=0,\"\",'2'!V16)","v":""},null,null,{"$f":"IF(AND(D13=\"A\",D14=\"A\"),B13,IF(D13=\"A\",B14,IF(D14=\"A\",B13,IF(D13=D14,\"\",(IF(D13>D14,B13,B14))))))","v":""},{"$f":"IF(AND(D13=\"A\",D14=\"A\"),C13,IF(D13=\"A\",C14,IF(D14=\"A\",C13,IF(D13=D14,\"\",(IF(D13>D14,C13,C14))))))","v":""},null,null,null,null,null,null,null,null,null,null,null,null,null,null,{"$f":"B17","v":""},{"$f":"IF(AND(D16=\"A\",D17=\"A\"),0,IF(D17=\"A\",-D16,IF(D16=\"A\",D17,D17-D16)))","v":0},{"$f":"IF(F17=V13,IF(AND(H17=\"A\",H19=\"A\"),0,IF(OR(W13>0,D16=\"A\"),IF(H17=\"A\",-H19,IF(H19=\"A\",H17,H17-H19)),0)),0)","v":0},{"$f":"IF(J18=V13,IF(AND(L18=\"A\",L24=\"A\"),0,IF(OR(X13>0,H19=\"A\"),IF(L18=\"A\",-L24,IF(L24=\"A\",L18,L18-L24)),0)),0)","v":0},{"$f":"IF(N21=V13,IF(AND(P9=\"A\",P21=\"A\"),0,IF(OR(Y13>0,L24=\"A\"),IF(P21=\"A\",-P9,IF(P9=\"A\",P21,P21-P9)),0)),0)","v":0},0,null,{"$f":"'2'!AR5","v":""},{"$f":"'2'!AS5","v":""},null,{"$f":"IF(Inscrits!B11=0,\"\",Inscrits!B11)","v":"SENES A MARIO"},{"$error":"#N/A"},{"$error":"#N/A"},{"$error":"#N/A"}]
["Z",{"$f":"IF('3'!B18=0,\"\",'3'!B18)","v":""},{"$f":"IF('3'!C18=0,\"\",'3'!C18)","v":""},null,null,null,null,null,null,null,null,null,null,null,null,null,null,null,null,null,null,{"$f":"B19","v":""},{"$f":"IF(AND(D19=\"A\",D20=\"A\"),0,IF(D19=\"A\",-D20,IF(D20=\"A\",D19,D19-D20)))","v":0},{"$f":"IF(F19=V14,IF(AND(H17=\"A\",H19=\"A\"),0,IF(OR(W14>0,D20=\"A\"),IF(H19=\"A\",-H17,IF(H17=\"A\",H19,H19-H17)),0)),0)","v":0},{"$f":"IF(J18=V14,IF(AND(L18=\"A\",L24=\"A\"),0,IF(OR(X14>0,H17=\"A\"),IF(L18=\"A\",-L24,IF(L24=\"A\",L18,L18-L24)),0)),0)","v":0},{"$f":"IF(N21=V14,IF(AND(P9=\"A\",P21=\"A\"),0,IF(OR(Y14>0,L24=\"A\"),IF(P21=\"A\",-P9,IF(P9=\"A\",P21,P21-P9)),0)),0)","v":0},0,null,{"$f":"'2'!AR6","v":""},{"$f":"'2'!AS6","v":""},null,{"$f":"IF(Inscrits!B12=0,\"\",Inscrits!B12)","v":"SOCKEEL AURORE"},{"$error":"#N/A"},{"$error":"#N/A"},{"$error":"#N/A"}]
[null,"Match 5 - Billard",null,null,null,null,null,null,null,null,null,null,null,"Match 15 - Billard",null,null,null,{"$f":"IF(AND(P9=\"A\",P21=\"A\"),N9,IF(P9=\"A\",N21,IF(P21=\"A\",N9,IF(P9=P21,\"\",(IF(P9>P21,N9,N21))))))","v":""},{"$f":"IF(AND(P9=\"F\",P21=\"F\"),O9,IF(P9=\"F\",O21,IF(P21=\"F\",O9,IF(P9=P21,\"\",(IF(P9>P21,O9,O21))))))","v":""},null,null,{"$f":"B20","v":""},{"$f":"IF(AND(D19=\"A\",D20=\"A\"),0,IF(D20=\"A\",-D19,IF(D19=\"A\",D20,D20-D19)))","v":0},{"$f":"IF(F19=V15,IF(AND(H17=\"A\",H19=\"A\"),0,IF(OR(W15>0,D19=\"A\"),IF(H19=\"A\",-H17,IF(H17=\"A\",H19,H19-H17)),0)),0)","v":0},{"$f":"IF(J18=V15,IF(AND(L18=\"A\",L24=\"A\"),0,IF(OR(X15>0,H17=\"A\"),IF(L18=\"A\",-L24,IF(L24=\"A\",L18,L18-L24)),0)),0)","v":0},{"$f":"IF(N21=V15,IF(AND(P9=\"A\",P21=\"A\"),0,IF(OR(Y15>0,L24=\"A\"),IF(P21=\"A\",-P9,IF(P9=\"A\",P21,P21-P9)),0)),0)","v":0},0,null,{"$f":"'2'!AR7","v":""},{"$f":"'2'!AS7","v":""},null,{"$f":"IF(Inscrits!B13=0,\"\",Inscrits!B13)","v":"SOCKEEL YANNICK"},{"$error":"#N/A"},{"$error":"#N/A"},{"$error":"#N/A"}]
["E",{"$f":"IF('3'!U6=0,\"\",'3'!U6)","v":""},{"$f":"IF('3'!V6=0,\"\",'3'!V6)","v":""},null,null,null,null,null,null,null,null,null,null,null,null,null,null,null,null,null,null,{"$f":"B22","v":""},{"$f":"IF(AND(D22=\"A\",D23=\"A\"),0,IF(D22=\"A\",-D23,IF(D23=\"A\",D22,D22-D23)))","v":0},{"$f":"IF(F23=V16,IF(AND(H23=\"A\",H25=\"A\"),0,IF(OR(W16>0,D23=\"A\"),IF(H23=\"A\",-H25,IF(H25=\"A\",H23,H23-H25)),0)),0)","v":0},{"$f":"IF(J24=V16,IF(AND(L18=\"A\",L24=\"A\"),0,IF(OR(X16>0,H25=\"A\"),IF(L24=\"A\",-L18,IF(L18=\"A\",L24,L24-L18)),0)),0)","v":0},{"$f":"IF(N21=V16,IF(AND(P9=\"A\",P21=\"A\"),0,IF(OR(Y16>0,L18=\"A\"),IF(P21=\"A\",-P9,IF(P9=\"A\",P21,P21-P9)),0)),0)","v":0},0,null,{"$f":"'2'!AR14","v":""},{"$f":"'2'!AS14","v":""},null,{"$f":"IF(Inscrits!B14=0,\"\",Inscrits!B14)","v":"SOCKEEL MARIE PIERRE"},{"$error":"#N/A"},{"$error":"#N/A"},{"$error":"#N/A"}]
["S",{"$f":"IF('2'!B8=0,\"\",'2'!B8)","v":""},{"$f":"IF('2'!C8=0,\"\",'2'!C8)","v":""},null,null,{"$f":"IF(AND(D16=\"A\",D17=\"A\"),B16,IF(D16=\"A\",B17,IF(D17=\"A\",B16,IF(D16=D17,\"\",(IF(D16>D17,B16,B17))))))","v":""},{"$f":"IF(AND(D16=\"A\",D17=\"A\"),C16,IF(D16=\"A\",C17,IF(D17=\"A\",C16,IF(D16=D17,\"\",(IF(D16>D17,C16,C17))))))","v":""},null,null,null,null,null,null,null,null,null,null,null,null,null,null,{"$f":"B23","v":""},{"$f":"IF(AND(D22=\"A\",D23=\"A\"),0,IF(D23=\"A\",-D22,IF(D22=\"A\",D23,D23-D22)))","v":0},{"$f":"IF(F23=V17,IF(AND(H23=\"A\",H25=\"A\"),0,IF(OR(W17>0,D22=\"A\"),IF(H23=\"A\",-H25,IF(H25=\"A\",H23,H23-H25)),0)),0)","v":0},{"$f":"IF(J24=V17,IF(AND(L18=\"A\",L24=\"A\"),0,IF(OR(X17>0,H25=\"A\"),IF(L24=\"A\",-L18,IF(L18=\"A\",L24,L24-L18)),0)),0)","v":0},{"$f":"IF(N21=V17,IF(AND(P9=\"A\",P21=\"A\"),0,IF(OR(Y17>0,L18=\"A\"),IF(P21=\"A\",-P9,IF(P9=\"A\",P21,P21-P9)),0)),0)","v":0},0,null,{"$f":"'2'!AR15","v":""},{"$f":"'2'!AS15","v":""},null,{"$f":"IF(Inscrits!B15=0,\"\",Inscrits!B15)","v":"BESSON JEROME"},{"$error":"#N/A"},{"$error":"#N/A"},{"$error":"#N/A"}]
[null,"Match 6 - Billard",null,null,null,"Match 11 - Billard",null,null,null,{"$f":"IF(AND(H17=\"A\",H19=\"A\"),F17,IF(H17=\"A\",F19,IF(H19=\"A\",F17,IF(H17=H19,\"\",(IF(H17>H19,F17,F19))))))","v":""},{"$f":"IF(AND(H17=\"A\",H19=\"A\"),G17,IF(H17=\"A\",G19,IF(H19=\"A\",G17,IF(H17=H19,\"\",(IF(H17>H19,G17,G19))))))","v":""},null,null,null,null,null,null,null,null,null,null,{"$f":"B25","v":""},{"$f":"IF(AND(D25=\"A\",D26=\"A\"),0,IF(D25=\"A\",-D26,IF(D26=\"A\",D25,D25-D26)))","v":0},{"$f":"IF(F25=V18,IF(AND(H23=\"A\",H25=\"A\"),0,IF(OR(W18>0,D26=\"A\"),IF(H25=\"A\",-H23,IF(H23=\"A\",H25,H25-H23)),0)),0)","v":0},{"$f":"IF(J24=V18,IF(AND(L18=\"A\",L24=\"A\"),0,IF(OR(X18>0,H23=\"A\"),IF(L24=\"A\",-L18,IF(L18=\"A\",L24,L24-L18)),0)),0)","v":0},{"$f":"IF(N21=V18,IF(AND(P9=\"A\",P21=\"A\"),0,IF(OR(Y18>0,L18=\"A\"),IF(P21=\"A\",-P9,IF(P9=\"A\",P21,P21-P9)),0)),0)","v":0},0,null,{"$f":"'2'!AR16","v":""},{"$f":"'2'!AS16","v":""},null,{"$f":"IF(Inscrits!B16=0,\"\",Inscrits!B16)","v":"DURET CHRISTOPHE"},{"$error":"#N/A"},{"$error":"#N/A"},{"$error":"#N/A"}]
["F",{"$f":"IF('3'!U16=0,\"\",'3'!U16)","v":""},{"$f":"IF('3'!V16=0,\"\",'3'!V16)","v":""},null,null,{"$f":"IF(AND(D19=\"A\",D20=\"A\"),B19,IF(D19=\"A\",B20,IF(D20=\"A\",B19,IF(D19=D20,\"\",(IF(D19>D20,B19,B20))))))","v":""},{"$f":"IF(AND(D19=\"A\",D20=\"A\"),C19,IF(D19=\"A\",C20,IF(D20=\"A\",C19,IF(D19=D20,\"\",(IF(D19>D20,C19,C20))))))","v":""},null,null,null,null,null,null,null,null,null,null,null,null,null,null,{"$f":"B26","v":""},{"$f":"IF(AND(D25=\"A\",D26=\"A\"),0,IF(D26=\"A\",-D25,IF(D25=\"A\",D26,D26-D25)))","v":0},{"$f":"IF(F25=V19,IF(AND(H23=\"A\",H25=\"A\"),0,IF(OR(W19>0,D25=\"A\"),IF(H25=\"A\",-H23,IF(H23=\"A\",H25,H25-H23)),0)),0)","v":0},{"$f":"IF(J24=V19,IF(AND(L18=\"A\",L24=\"A\"),0,IF(OR(X19>0,H23=\"A\"),IF(L24=\"A\",-L18,IF(L18=\"A\",L24,L24-L18)),0)),0)","v":0},{"$f":"IF(N21=V19,IF(AND(P9=\"A\",P21=\"A\"),0,IF(OR(Y19>0,L18=\"A\"),IF(P21=\"A\",-P9,IF(P9=\"A\",P21,P21-P9)),0)),0)","v":0},0,null,{"$f":"'2'!AR17","v":""},{"$f":"'2'!AS17","v":""},null,{"$f":"IF(Inscrits!B17=0,\"\",Inscrits!B17)","v":"BALHAND SEBASTIEN"},{"$error":"#N/A"},{"$error":"#N/A"},{"$error":"#N/A"}]
["T",{"$f":"IF('1'!B18=0,\"\",'1'!B18)","v":""},{"$f":"IF('1'!C18=0,\"\",'1'!C18)","v":""},null,null,null,null,null,null,null,null,null,null,null,null,null,null,null,null,null,null,{"$f":"'1'!AR14","v":""},null,null,null,null,0,null,{"$f":"'3'!AR4","v":""},{"$f":"'3'!AS4","v":""},null,{"$f":"IF(Inscrits!B18=0,\"\",Inscrits!B18)","v":"ADON MARC OLIVIER"},{"$error":"#N/A"},{"$error":"#N/A"},{"$error":"#N/A"}]
[null,"Match 7 - Billard",null,null,null,null,null,null,null,"Match 14 - Billard",null,null,null,{"$f":"IF(AND(L18=\"A\",L24=\"A\"),J18,IF(L18=\"A\",J24,IF(L24=\"A\",J18,IF(L18=L24,\"\",(IF(L18>L24,J18,J24))))))","v":""},{"$f":"IF(AND(L18=\"A\",L24=\"A\"),K18,IF(L18=\"A\",K24,IF(L24=\"A\",K18,IF(L18=L24,\"\",(IF(L18>L24,K18,K24))))))","v":""},null,null,null,null,null,null,{"$f":"'1'!AR15","v":""},null,null,null,null,0,null,{"$f":"'3'!AR5","v":""},{"$f":"'3'!AS5","v":""},null,{"$f":"IF(Inscrits!B19=0,\"\",Inscrits!B19)","v":"SUDARA BRUNO"},{"$error":"#N/A"},{"$error":"#N/A"},{"$error":"#N/A"}]
["G",{"$f":"IF('4'!U6=0,\"\",'4'!U6)","v":""},{"$f":"IF('4'!V6=0,\"\",'4'!V6)","v":""},null,null,null,null,null,null,null,null,null,null,null,null,null,null,null,null,null,null,{"$f":"'1'!AR16","v":""},null,null,null,null,0,null,{"$f":"'3'!AR6","v":""},{"$f":"'3'!AS6","v":""},null,{"$f":"IF(Inscrits!B20=0,\"\",Inscrits!B20)","v":"TRIPLET FREDERIC"},{"$error":"#N/A"},{"$error":"#N/A"},{"$error":"#N/A"}]
["U",{"$f":"IF('1'!B8=0,\"\",'1'!B8)","v":""},{"$f":"IF('1'!C8=0,\"\",'1'!C8)","v":""},null,null,{"$f":"IF(AND(D22=\"A\",D23=\"A\"),B22,IF(D22=\"A\",B23,IF(D23=\"A\",B22,IF(D22=D23,\"\",(IF(D22>D23,B22,B23))))))","v":""},{"$f":"IF(AND(D22=\"A\",D23=\"A\"),C22,IF(D22=\"A\",C23,IF(D23=\"A\",C22,IF(D22=D23,\"\",(IF(D22>D23,C22,C23))))))","v":""},null,null,null,null,null,null,null,null,null,null,null,null,null,null,{"$f":"'1'!AR17","v":""},null,null,null,null,0,null,{"$f":"'3'!AR7","v":""},{"$f":"'3'!AS7","v":""},null,{"$f":"IF(Inscrits!B21=0,\"\",Inscrits!B21)","v":"GIRARD FREDERIC"},{"$error":"#N/A"},{"$error":"#N/A"},{"$error":"#N/A"}]
[null,"Match 8 - Billard",null,null,null,"Match 12 - Billard",null,null,null,{"$f":"IF(AND(H23=\"A\",H25=\"A\"),F23,IF(H23=\"A\",F25,IF(H25=\"A\",F23,IF(H23=H25,\"\",(IF(H23>H25,F23,F25))))))","v":""},{"$f":"IF(AND(H23=\"A\",H25=\"A\"),G23,IF(H23=\"A\",G25,IF(H25=\"A\",G23,IF(H23=H25,\"\",(IF(H23>H25,G23,G25))))))","v":""},null,null,null,null,null,null,null,null,null,null,{"$f":"'2'!AR14","v":""},null,null,null,null,0,null,{"$f":"'3'!AR14","v":""},{"$f":"'3'!AS14","v":""},null,{"$f":"IF(Inscrits!B22=0,\"\",Inscrits!B22)","v":"GOSSUIN JUSTINE"},{"$error":"#N/A"},{"$error":"#N/A"},{"$error":"#N/A"}]
["H",{"$f":"IF('4'!U16=0,\"\",'4'!U16)","v":""},{"$f":"IF('4'!V16=0,\"\",'4'!V16)","v":""},null,null,{"$f":"IF(AND(D25=\"A\",D26=\"A\"),B25,IF(D25=\"A\",B26,IF(D26=\"A\",B25,IF(D25=D26,\"\",(IF(D25>D26,B25,B26))))))","v":""},{"$f":"IF(AND(D25=\"A\",D26=\"A\"),C25,IF(D25=\"A\",C26,IF(D26=\"A\",C25,IF(D25=D26,\"\",(IF(D25>D26,C25,C26))))))","v":""},null,null,null,null,null,null,null,null,null,null,null,null,null,null,{"$f":"'2'!AR15","v":""},null,null,null,null,0,null,{"$f":"'3'!AR15","v":""},{"$f":"'3'!AS15","v":""},null,{"$f":"IF(Inscrits!B23=0,\"\",Inscrits!B23)","v":"TRABICHET CHRISTOPHE"},{"$error":"#N/A"},{"$error":"#N/A"},{"$error":"#N/A"}]
["V",{"$f":"IF('2'!B18=0,\"\",'2'!B18)","v":""},{"$f":"IF('2'!C18=0,\"\",'2'!C18)","v":""},null,null,null,null,null,null,null,null,null,null,null,null,null,null,null,null,null,null,{"$f":"'2'!AR16","v":""},null,null,null,null,0,null,{"$f":"'3'!AR16","v":""},{"$f":"'3'!AS16","v":""},null,{"$f":"IF(Inscrits!B24=0,\"\",Inscrits!B24)","v":"AARAB LAHOUSINE"},{"$error":"#N/A"},{"$error":"#N/A"},{"$error":"#N/A"}]
[null,null,null,null,null,null,null,null,null,null,null,null,null,null,null,null,null,null,null,null,null,{"$f":"'2'!AR17","v":""},null,null,null,null,0,null,{"$f":"'3'!AR17","v":""},{"$f":"'3'!AS17","v":""},null,{"$f":"IF(Inscrits!B25=0,\"\",Inscrits!B25)","v":"KEBE MAMADOU"},{"$error":"#N/A"},{"$error":"#N/A"},{"$error":"#N/A"}]
[null,null,null,null,null,null,null,null,null,null,null,null,null,null,null,null,null,null,null,null,null,{"$f":"'3'!AR14","v":""},null,null,null,null,0,null,{"$f":"'4'!AR4","v":""},{"$f":"'4'!AS4","v":""},null,{"$f":"IF(Inscrits!B26=0,\"\",Inscrits!B26)","v":"KUSAR TONY"},{"$error":"#N/A"},{"$error":"#N/A"},{"$error":"#N/A"}]
[null,null,null,null,null,null,null,null,null,null,null,null,null,null,null,null,null,null,null,null,null,{"$f":"'3'!AR15","v":""},null,null,null,null,0,null,{"$f":"'4'!AR5","v":""},{"$f":"'4'!AS5","v":""},null,{"$f":"IF(Inscrits!B27=0,\"\",Inscrits!B27)","v":"ELAMRI JAAFAR"},{"$error":"#N/A"},{"$error":"#N/A"},{"$error":"#N/A"}]
[null,null,null,null,null,null,null,null,null,null,null,null,null,null,null,null,null,null,null,null,null,{"$f":"'3'!AR16","v":""},null,null,null,null,0,null,{"$f":"'4'!AR6","v":""},{"$f":"'4'!AS6","v":""},null,{"$f":"IF(Inscrits!B28=0,\"\",Inscrits!B28)","v":"Blanc 1"},{"$error":"#N/A"},{"$error":"#N/A"},{"$error":"#N/A"}]
[null,null,null,null,null,null,null,null,null,null,null,null,null,null,null,null,null,null,null,null,null,{"$f":"'3'!AR17","v":""},null,null,null,null,0,null,{"$f":"'4'!AR7","v":""},{"$f":"'4'!AS7","v":""},null,{"$f":"IF(Inscrits!B29=0,\"\",Inscrits!B29)","v":"Blanc 2"},{"$error":"#N/A"},{"$error":"#N/A"},{"$error":"#N/A"}]
[null,null,null,null,null,null,null,null,null,null,null,null,null,null,null,null,null,null,null,null,null,{"$f":"'4'!AR14","v":""},null,null,null,null,0,null,{"$f":"'4'!AR14","v":""},{"$f":"'4'!AS14","v":""},null,{"$f":"IF(Inscrits!B30=0,\"\",Inscrits!B30)","v":"Blanc 3"},{"$error":"#N/A"},{"$error":"#N/A"},{"$error":"#N/A"}]
[null,null,null,null,null,null,null,null,null,null,null,null,null,null,null,null,null,null,null,null,null,{"$f":"'4'!AR15","v":""},null,null,null,null,0,null,{"$f":"'4'!AR15","v":""},{"$f":"'4'!AS15","v":""},null,{"$f":"IF(Inscrits!B31=0,\"\",Inscrits!B31)","v":"Blanc 4"},{"$error":"#N/A"},{"$error":"#N/A"},{"$error":"#N/A"}]
[null,null,null,null,null,null,null,null,null,null,null,null,null,null,null,null,null,null,null,null,null,{"$f":"'4'!AR16","v":""},null,null,null,null,0,null,{"$f":"'4'!AR16","v":""},{"$f":"'4'!AS16","v":""},null,{"$f":"IF(Inscrits!B32=0,\"\",Inscrits!B32)","v":"Blanc 5"},{"$error":"#N/A"},{"$error":"#N/A"},{"$error":"#N/A"}]
[null,null,null,null,null,null,null,null,null,null,null,null,null,null,null,null,null,null,null,null,null,{"$f":"'4'!AR17","v":""},null,null,null,null,0,null,{"$f":"'4'!AR17","v":""},{"$f":"'4'!AS17","v":""},null,{"$f":"IF(Inscrits!B33=0,\"\",Inscrits!B33)","v":"Blanc 6"},{"$error":"#N/A"},{"$error":"#N/A"},{"$error":"#N/A"}]

{"sheet":"Classement","index":8,"n_rows":33,"n_cols":12,"rows_kept":33,"cut":false,"hidden":false,"merged":[]}
[null,null,"Formules Initiales","Nom & Prénom","Place","Points","GA","CF","RF","Club","Licence","Division"]
[null,null,1,{"$f":"Final!R15","v":""},null,{"$f":"IF(ISNA(IF(LEFT(Division,2)=\"R1\",VLOOKUP(E2,Points!$A$2:$D$18,2,FALSE),IF(LEFT(Division,2)=\"R2\",VLOOKUP(E2,Points!$A$2:$D$18,3,FALSE),IF(LEFT(Division,2)=\"R3\",VLOOKUP(E2,Points!$A$2:$D$18,4,FALSE),\"DIV ???\")))),0,IF(LEFT(Division,2)=\"R1\",VLOOKUP(E2,Points!$A$2:$D$18,2,FALSE),IF(LEFT(Division,2)=\"R2\",VLOOKUP(E2,Points!$A$2:$D$18,3,FALSE),IF(LEFT(Division,2)=\"R3\",VLOOKUP(E2,Points!$A$2:$D$18,4,FALSE),\"DIV ???\"))))","v":0},{"$f":"IF(ISERROR(VLOOKUP(D2,Final!$AF$4:$AI$35,4,FALSE)),\"\",VLOOKUP(D2,Final!$AF$4:$AI$35,4,FALSE))","v":""},null,null,{"$f":"IF(ISNA(VLOOKUP(D2,Inscrits!B:E,3,FALSE)),\"\",VLOOKUP(D2,Inscrits!B:E,3,FALSE))","v":""},{"$f":"IF(ISNA(VLOOKUP(D2,Inscrits!B:E,4,FALSE)),\"\",VLOOKUP(D2,Inscrits!B:E,4,FALSE))","v":""},{"$f":"IF(NB_JOUEURS_UP>0,IF(LEN(Division)=2,\"R\"&RIGHT(Division,1)-1&\"\",IF(LEN(Division)=3,IF(RIGHT(LEFT(Division,2),1)=\"2\",\"R1\",IF(Nb_R2=1,\"R2\",\"R\"&RIGHT(LEFT(Division,2),1)-1&\"\"&RIGHT(Division,1)&\"\")),IF(LEN(Division)=4,IF(RIGHT(LEFT(Division,2),1)=\"2\",\"R1\",\"R\"&RIGHT(LEFT(Division,2),1)-1&\"\"&RIGHT(LEFT(Division,3),1)&\"\"),\"?\"))),Division)","v":"R1"}]
[null,null,2,{"$f":"IF(Final!P21=\"A\",Final!N21,IF(Final!P9=\"A\",Final!N9,IF(Final!P9<Final!P21,Final!N9,Final!N21)))","v":""},null,{"$f":"IF(ISNA(IF(LEFT(Division,2)=\"R1\",VLOOKUP(E3,Points!$A$2:$D$18,2,FALSE),IF(LEFT(Division,2)=\"R2\",VLOOKUP(E3,Points!$A$2:$D$18,3,FALSE),IF(LEFT(Division,2)=\"R3\",VLOOKUP(E3,Points!$A$2:$D$18,4,FALSE),\"DIV ???\")))),0,IF(LEFT(Division,2)=\"R1\",VLOOKUP(E3,Points!$A$2:$D$18,2,FALSE),IF(LEFT(Division,2)=\"R2\",VLOOKUP(E3,Points!$A$2:$D$18,3,FALSE),IF(LEFT(Division,2)=\"R3\",VLOOKUP(E3,Points!$A$2:$D$18,4,FALSE),\"DIV ???\"))))","v":0},{"$f":"IF(ISERROR(VLOOKUP(D3,Final!$AF$4:$AI$35,4,FALSE)),\"\",VLOOKUP(D3,Final!$AF$4:$AI$35,4,FALSE))","v":""},null,null,{"$f":"IF(ISNA(VLOOKUP(D3,Inscrits!B:E,3,FALSE)),\"\",VLOOKUP(D3,Inscrits!B:E,3,FALSE))","v":""},{"$f":"IF(ISNA(VLOOKUP(D3,Inscrits!B:E,4,FALSE)),\"\",VLOOKUP(D3,Inscrits!B:E,4,FALSE))","v":""},{"$f":"IF(NB_JOUEURS_UP>1,IF(LEN(Division)=2,\"R\"&RIGHT(Division,1)-1&\"\",IF(LEN(Division)=3,IF(RIGHT(LEFT(Division,2),1)=\"2\",\"R1\",IF(Nb_R2=1,\"R2\",\"R\"&RIGHT(LEFT(Division,2),1)-1&\"\"&RIGHT(Division,1)&\"\")),IF(LEN(Division)=4,IF(RIGHT(LEFT(Division,2),1)=\"2\",\"R1\",\"R\"&RIGHT(LEFT(Division,2),1)-1&\"\"&RIGHT(LEFT(Division,3),1)&\"\"),\"?\"))),Division)","v":"R1"}]
[null,null,3,{"$f":"IF(Final!L12=\"A\",Final!J12,IF(Final!L6=\"A\",Final!J6,IF(Final!L6<Final!L12,Final!J6,Final!J12)))","v":""},null,{"$f":"IF(ISNA(IF(LEFT(Division,2)=\"R1\",VLOOKUP(E4,Points!$A$2:$D$18,2,FALSE),IF(LEFT(Division,2)=\"R2\",VLOOKUP(E4,Points!$A$2:$D$18,3,FALSE),IF(LEFT(Division,2)=\"R3\",VLOOKUP(E4,Points!$A$2:$D$18,4,FALSE),\"DIV ???\")))),0,IF(LEFT(Division,2)=\"R1\",VLOOKUP(E4,Points!$A$2:$D$18,2,FALSE),IF(LEFT(Division,2)=\"R2\",VLOOKUP(E4,Points!$A$2:$D$18,3,FALSE),IF(LEFT(Division,2)=\"R3\",VLOOKUP(E4,Points!$A$2:$D$18,4,FALSE),\"DIV ???\"))))","v":0},{"$f":"IF(ISERROR(VLOOKUP(D4,Final!$AF$4:$AI$35,4,FALSE)),\"\",VLOOKUP(D4,Final!$AF$4:$AI$35,4,FALSE))","v":""},null,null,{"$f":"IF(ISNA(VLOOKUP(D4,Inscrits!B:E,3,FALSE)),\"\",VLOOKUP(D4,Inscrits!B:E,3,FALSE))","v":""},{"$f":"IF(ISNA(VLOOKUP(D4,Inscrits!B:E,4,FALSE)),\"\",VLOOKUP(D4,Inscrits!B:E,4,FALSE))","v":""},{"$f":"IF(NB_JOUEURS_UP>2,IF(LEN(Division)=2,\"R\"&RIGHT(Division,1)-1&\"\",IF(LEN(Division)=3,IF(RIGHT(LEFT(Division,2),1)=\"2\",\"R1\",IF(Nb_R2=1,\"R2\",\"R\"&RIGHT(LEFT(Division,2),1)-1&\"\"&RIGHT(Division,1)&\"\")),IF(LEN(Division)=4,IF(RIGHT(LEFT(Division,2),1)=\"2\",\"R1\",\"R\"&RIGHT(LEFT(Division,2),1)-1&\"\"&RIGHT(LEFT(Division,3),1)&\"\"),\"?\"))),Division)","v":"R1"}]
[null,null,4,{"$f":"IF(Final!L24=\"A\",Final!J24,IF(Final!L18=\"A\",Final!J18,IF(Final!L18<Final!L24,Final!J18,Final!J24)))","v":""},null,{"$f":"IF(ISNA(IF(LEFT(Division,2)=\"R1\",VLOOKUP(E5,Points!$A$2:$D$18,2,FALSE),IF(LEFT(Division,2)=\"R2\",VLOOKUP(E5,Points!$A$2:$D$18,3,FALSE),IF(LEFT(Division,2)=\"R3\",VLOOKUP(E5,Points!$A$2:$D$18,4,FALSE),\"DIV ???\")))),0,IF(LEFT(Division,2)=\"R1\",VLOOKUP(E5,Points!$A$2:$D$18,2,FALSE),IF(LEFT(Division,2)=\"R2\",VLOOKUP(E5,Points!$A$2:$D$18,3,FALSE),IF(LEFT(Division,2)=\"R3\",VLOOKUP(E5,Points!$A$2:$D$18,4,FALSE),\"DIV ???\"))))","v":0},{"$f":"IF(ISERROR(VLOOKUP(D5,Final!$AF$4:$AI$35,4,FALSE)),\"\",VLOOKUP(D5,Final!$AF$4:$AI$35,4,FALSE))","v":""},null,null,{"$f":"IF(ISNA(VLOOKUP(D5,Inscrits!B:E,3,FALSE)),\"\",VLOOKUP(D5,Inscrits!B:E,3,FALSE))","v":""},{"$f":"IF(ISNA(VLOOKUP(D5,Inscrits!B:E,4,FALSE)),\"\",VLOOKUP(D5,Inscrits!B:E,4,FALSE))","v":""},{"$f":"IF(NB_JOUEURS_UP>3,IF(LEN(Division)=2,\"R\"&RIGHT(Division,1)-1&\"\",IF(LEN(Division)=3,IF(RIGHT(LEFT(Division,2),1)=\"2\",\"R1\",IF(Nb_R2=1,\"R2\",\"R\"&RIGHT(LEFT(Division,2),1)-1&\"\"&RIGHT(Division,1)&\"\")),IF(LEN(Division)=4,IF(RIGHT(LEFT(Division,2),1)=\"2\",\"R1\",\"R\"&RIGHT(LEFT(Division,2),1)-1&\"\"&RIGHT(LEFT(Division,3),1)&\"\"),\"?\"))),Division)","v":"R1"}]
[null,null,5,{"$f":"IF(Final!H7=\"A\",Final!F7,IF(Final!H5=\"A\",Final!F5,IF(Final!H5<Final!H7,Final!F5,Final!F7)))","v":""},null,{"$f":"IF(ISNA(IF(LEFT(Division,2)=\"R1\",VLOOKUP(E6,Points!$A$2:$D$18,2,FALSE),IF(LEFT(Division,2)=\"R2\",VLOOKUP(E6,Points!$A$2:$D$18,3,FALSE),IF(LEFT(Division,2)=\"R3\",VLOOKUP(E6,Points!$A$2:$D$18,4,FALSE),\"DIV ???\")))),0,IF(LEFT(Division,2)=\"R1\",VLOOKUP(E6,Points!$A$2:$D$18,2,FALSE),IF(LEFT(Division,2)=\"R2\",VLOOKUP(E6,Points!$A$2:$D$18,3,FALSE),IF(LEFT(Division,2)=\"R3\",VLOOKUP(E6,Points!$A$2:$D$18,4,FALSE),\"DIV ???\"))))","v":0},{"$f":"IF(ISERROR(VLOOKUP(D6,Final!$AF$4:$AI$35,4,FALSE)),\"\",VLOOKUP(D6,Final!$AF$4:$AI$35,4,FALSE))","v":""},null,null,{"$f":"IF(ISNA(VLOOKUP(D6,Inscrits!B:E,3,FALSE)),\"\",VLOOKUP(D6,Inscrits!B:E,3,FALSE))","v":""},{"$f":"IF(ISNA(VLOOKUP(D6,Inscrits!B:E,4,FALSE)),\"\",VLOOKUP(D6,Inscrits!B:E,4,FALSE))","v":""},{"$f":"IF(NB_JOUEURS_UP>4,IF(LEN(Division)=2,\"R\"&RIGHT(Division,1)-1&\"\",IF(LEN(Division)=3,IF(RIGHT(LEFT(Division,2),1)=\"2\",\"R1\",IF(Nb_R2=1,\"R2\",\"R\"&RIGHT(LEFT(Division,2),1)-1&\"\"&RIGHT(Division,1)&\"\")),IF(LEN(Division)=4,IF(RIGHT(LEFT(Division,2),1)=\"2\",\"R1\",\"R\"&RIGHT(LEFT(Division,2),1)-1&\"\"&RIGHT(LEFT(Division,3),1)&\"\"),\"?\"))),Division)","v":"R1"}]
[null,null,6,{"$f":"IF(Final!H13=\"A\",Final!F13,IF(Final!H11=\"A\",Final!F11,IF(Final!H11<Final!H13,Final!F11,Final!F13)))","v":""},null,{"$f":"IF(ISNA(IF(LEFT(Division,2)=\"R1\",VLOOKUP(E7,Points!$A$2:$D$18,2,FALSE),IF(LEFT(Division,2)=\"R2\",VLOOKUP(E7,Points!$A$2:$D$18,3,FALSE),IF(LEFT(Division,2)=\"R3\",VLOOKUP(E7,Points!$A$2:$D$18,4,FALSE),\"DIV ???\")))),0,IF(LEFT(Division,2)=\"R1\",VLOOKUP(E7,Points!$A$2:$D$18,2,FALSE),IF(LEFT(Division,2)=\"R2\",VLOOKUP(E7,Points!$A$2:$D$18,3,FALSE),IF(LEFT(Division,2)=\"R3\",VLOOKUP(E7,Points!$A$2:$D$18,4,FALSE),\"DIV ???\"))))","v":0},{"$f":"IF(ISERROR(VLOOKUP(D7,Final!$AF$4:$AI$35,4,FALSE)),\"\",VLOOKUP(D7,Final!$AF$4:$AI$35,4,FALSE))","v":""},null,null,{"$f":"IF(ISNA(VLOOKUP(D7,Inscrits!B:E,3,FALSE)),\"\",VLOOKUP(D7,Inscrits!B:E,3,FALSE))","v":""},{"$f":"IF(ISNA(VLOOKUP(D7,Inscrits!B:E,4,FALSE)),\"\",VLOOKUP(D7,Inscrits!B:E,4,FALSE))","v":""},{"$f":"IF(NB_JOUEURS_UP>5,IF(LEN(Division)=2,\"R\"&RIGHT(Division,1)-1&\"\",IF(LEN(Division)=3,IF(RIGHT(LEFT(Division,2),1)=\"2\",\"R1\",IF(Nb_R2=1,\"R2\",\"R\"&RIGHT(LEFT(Division,2),1)-1&\"\"&RIGHT(Division,1)&\"\")),IF(LEN(Division)=4,IF(RIGHT(LEFT(Division,2),1)=\"2\",\"R1\",\"R\"&RIGHT(LEFT(Division,2),1)-1&\"\"&RIGHT(LEFT(Division,3),1)&\"\"),\"?\"))),Division)","v":"R1"}]
[null,null,7,{"$f":"IF(Final!H19=\"A\",Final!F19,IF(Final!H17=\"A\",Final!F17,IF(Final!H17<Final!H19,Final!F17,Final!F19)))","v":""},null,{"$f":"IF(ISNA(IF(LEFT(Division,2)=\"R1\",VLOOKUP(E8,Points!$A$2:$D$18,2,FALSE),IF(LEFT(Division,2)=\"R2\",VLOOKUP(E8,Points!$A$2:$D$18,3,FALSE),IF(LEFT(Division,2)=\"R3\",VLOOKUP(E8,Points!$A$2:$D$18,4,FALSE),\"DIV ???\")))),0,IF(LEFT(Division,2)=\"R1\",VLOOKUP(E8,Points!$A$2:$D$18,2,FALSE),IF(LEFT(Division,2)=\"R2\",VLOOKUP(E8,Points!$A$2:$D$18,3,FALSE),IF(LEFT(Division,2)=\"R3\",VLOOKUP(E8,Points!$A$2:$D$18,4,FALSE),\"DIV ???\"))))","v":0},{"$f":"IF(ISERROR(VLOOKUP(D8,Final!$AF$4:$AI$35,4,FALSE)),\"\",VLOOKUP(D8,Final!$AF$4:$AI$35,4,FALSE))","v":""},null,null,{"$f":"IF(ISNA(VLOOKUP(D8,Inscrits!B:E,3,FALSE)),\"\",VLOOKUP(D8,Inscrits!B:E,3,FALSE))","v":""},{"$f":"IF(ISNA(VLOOKUP(D8,Inscrits!B:E,4,FALSE)),\"\",VLOOKUP(D8,Inscrits!B:E,4,FALSE))","v":""},{"$f":"IF(NB_JOUEURS_UP>6,IF(LEN(Division)=2,\"R\"&RIGHT(Division,1)-1&\"\",IF(LEN(Division)=3,IF(RIGHT(LEFT(Division,2),1)=\"2\",\"R1\",IF(Nb_R2=1,\"R2\",\"R\"&RIGHT(LEFT(Division,2),1)-1&\"\"&RIGHT(Division,1)&\"\")),IF(LEN(Division)=4,IF(RIGHT(LEFT(Division,2),1)=\"2\",\"R1\",\"R\"&RIGHT(LEFT(Division,2),1)-1&\"\"&RIGHT(LEFT(Division,3),1)&\"\"),\"?\"))),Division)","v":"R1"}]
[null,null,8,{"$f":"IF(Final!H25=\"A\",Final!F25,IF(Final!H23=\"A\",Final!F23,IF(Final!H23<Final!H25,Final!F23,Final!F25)))","v":""},null,{"$f":"IF(ISNA(IF(LEFT(Division,2)=\"R1\",VLOOKUP(E9,Points!$A$2:$D$18,2,FALSE),IF(LEFT(Division,2)=\"R2\",VLOOKUP(E9,Points!$A$2:$D$18,3,FALSE),IF(LEFT(Division,2)=\"R3\",VLOOKUP(E9,Points!$A$2:$D$18,4,FALSE),\"DIV ???\")))),0,IF(LEFT(Division,2)=\"R1\",VLOOKUP(E9,Points!$A$2:$D$18,2,FALSE),IF(LEFT(Division,2)=\"R2\",VLOOKUP(E9,Points!$A$2:$D$18,3,FALSE),IF(LEFT(Division,2)=\"R3\",VLOOKUP(E9,Points!$A$2:$D$18,4,FALSE),\"DIV ???\"))))","v":0},{"$f":"IF(ISERROR(VLOOKUP(D9,Final!$AF$4:$AI$35,4,FALSE)),\"\",VLOOKUP(D9,Final!$AF$4:$AI$35,4,FALSE))","v":""},null,null,{"$f":"IF(ISNA(VLOOKUP(D9,Inscrits!B:E,3,FALSE)),\"\",VLOOKUP(D9,Inscrits!B:E,3,FALSE))","v":""},{"$f":"IF(ISNA(VLOOKUP(D9,Inscrits!B:E,4,FALSE)),\"\",VLOOKUP(D9,Inscrits!B:E,4,FALSE))","v":""},{"$f":"IF(NB_JOUEURS_UP>7,IF(LEN(Division)=2,\"R\"&RIGHT(Division,1)-1&\"\",IF(LEN(Division)=3,IF(RIGHT(LEFT(Division,2),1)=\"2\",\"R1\",IF(Nb_R2=1,\"R2\",\"R\"&RIGHT(LEFT(Division,2),1)-1&\"\"&RIGHT(Division,1)&\"\")),IF(LEN(Division)=4,IF(RIGHT(LEFT(Division,2),1)=\"2\",\"R1\",\"R\"&RIGHT(LEFT(Division,2),1)-1&\"\"&RIGHT(LEFT(Division,3),1)&\"\"),\"?\"))),Division)","v":"R1"}]
[null,null,9,{"$f":"IF(Final!D5=\"A\",Final!B5,IF(Final!D4=\"A\",Final!B4,IF(Final!D4<Final!D5,Final!B4,Final!B5)))","v":""},null,{"$f":"IF(ISNA(IF(LEFT(Division,2)=\"R1\",VLOOKUP(E10,Points!$A$2:$D$18,2,FALSE),IF(LEFT(Division,2)=\"R2\",VLOOKUP(E10,Points!$A$2:$D$18,3,FALSE),IF(LEFT(Division,2)=\"R3\",VLOOKUP(E10,Points!$A$2:$D$18,4,FALSE),\"DIV ???\")))),0,IF(LEFT(Division,2)=\"R1\",VLOOKUP(E10,Points!$A$2:$D$18,2,FALSE),IF(LEFT(Division,2)=\"R2\",VLOOKUP(E10,Points!$A$2:$D$18,3,FALSE),IF(LEFT(Division,2)=\"R3\",VLOOKUP(E10,Points!$A$2:$D$18,4,FALSE),\"DIV ???\"))))","v":0},{"$f":"IF(ISERROR(VLOOKUP(D10,Final!$AF$4:$AI$35,4,FALSE)),\"\",VLOOKUP(D10,Final!$AF$4:$AI$35,4,FALSE))","v":""},null,null,{"$f":"IF(ISNA(VLOOKUP(D10,Inscrits!B:E,3,FALSE)),\"\",VLOOKUP(D10,Inscrits!B:E,3,FALSE))","v":""},{"$f":"IF(ISNA(VLOOKUP(D10,Inscrits!B:E,4,FALSE)),\"\",VLOOKUP(D10,Inscrits!B:E,4,FALSE))","v":""},{"$f":"Division","v":"R1"}]
[null,null,10,{"$f":"IF(Final!D8=\"A\",Final!B8,IF(Final!D7=\"A\",Final!B7,IF(Final!D7<Final!D8,Final!B7,Final!B8)))","v":""},null,{"$f":"IF(ISNA(IF(LEFT(Division,2)=\"R1\",VLOOKUP(E11,Points!$A$2:$D$18,2,FALSE),IF(LEFT(Division,2)=\"R2\",VLOOKUP(E11,Points!$A$2:$D$18,3,FALSE),IF(LEFT(Division,2)=\"R3\",VLOOKUP(E11,Points!$A$2:$D$18,4,FALSE),\"DIV ???\")))),0,IF(LEFT(Division,2)=\"R1\",VLOOKUP(E11,Points!$A$2:$D$18,2,FALSE),IF(LEFT(Division,2)=\"R2\",VLOOKUP(E11,Points!$A$2:$D$18,3,FALSE),IF(LEFT(Division,2)=\"R3\",VLOOKUP(E11,Points!$A$2:$D$18,4,FALSE),\"DIV ???\"))))","v":0},{"$f":"IF(ISERROR(VLOOKUP(D11,Final!$AF$4:$AI$35,4,FALSE)),\"\",VLOOKUP(D11,Final!$AF$4:$AI$35,4,FALSE))","v":""},null,null,{"$f":"IF(ISNA(VLOOKUP(D11,Inscrits!B:E,3,FALSE)),\"\",VLOOKUP(D11,Inscrits!B:E,3,FALSE))","v":""},{"$f":"IF(ISNA(VLOOKUP(D11,Inscrits!B:E,4,FALSE)),\"\",VLOOKUP(D11,Inscrits!B:E,4,FALSE))","v":""},{"$f":"Division","v":"R1"}]
[null,null,11,{"$f":"IF(Final!D11=\"A\",Final!B11,IF(Final!D10=\"A\",Final!B10,IF(Final!D10<Final!D11,Final!B10,Final!B11)))","v":""},null,{"$f":"IF(ISNA(IF(LEFT(Division,2)=\"R1\",VLOOKUP(E12,Points!$A$2:$D$18,2,FALSE),IF(LEFT(Division,2)=\"R2\",VLOOKUP(E12,Points!$A$2:$D$18,3,FALSE),IF(LEFT(Division,2)=\"R3\",VLOOKUP(E12,Points!$A$2:$D$18,4,FALSE),\"DIV ???\")))),0,IF(LEFT(Division,2)=\"R1\",VLOOKUP(E12,Points!$A$2:$D$18,2,FALSE),IF(LEFT(Division,2)=\"R2\",VLOOKUP(E12,Points!$A$2:$D$18,3,FALSE),IF(LEFT(Division,2)=\"R3\",VLOOKUP(E12,Points!$A$2:$D$18,4,FALSE),\"DIV ???\"))))","v":0},{"$f":"IF(ISERROR(VLOOKUP(D12,Final!$AF$4:$AI$35,4,FALSE)),\"\",VLOOKUP(D12,Final!$AF$4:$AI$35,4,FALSE))","v":""},null,null,{"$f":"IF(ISNA(VLOOKUP(D12,Inscrits!B:E,3,FALSE)),\"\",VLOOKUP(D12,Inscrits!B:E,3,FALSE))","v":""},{"$f":"IF(ISNA(VLOOKUP(D12,Inscrits!B:E,4,FALSE)),\"\",VLOOKUP(D12,Inscrits!B:E,4,FALSE))","v":""},"R1"]
[null,null,12,{"$f":"IF(Final!D14=\"A\",Final!B14,IF(Final!D13=\"A\",Final!B13,IF(Final!D13<Final!D14,Final!B13,Final!B14)))","v":""},null,{"$f":"IF(ISNA(IF(LEFT(Division,2)=\"R1\",VLOOKUP(E13,Points!$A$2:$D$18,2,FALSE),IF(LEFT(Division,2)=\"R2\",VLOOKUP(E13,Points!$A$2:$D$18,3,FALSE),IF(LEFT(Division,2)=\"R3\",VLOOKUP(E13,Points!$A$2:$D$18,4,FALSE),\"DIV ???\")))),0,IF(LEFT(Division,2)=\"R1\",VLOOKUP(E13,Points!$A$2:$D$18,2,FALSE),IF(LEFT(Division,2)=\"R2\",VLOOKUP(E13,Points!$A$2:$D$18,3,FALSE),IF(LEFT(Division,2)=\"R3\",VLOOKUP(E13,Points!$A$2:$D$18,4,FALSE),\"DIV ???\"))))","v":0},{"$f":"IF(ISERROR(VLOOKUP(D13,Final!$AF$4:$AI$35,4,FALSE)),\"\",VLOOKUP(D13,Final!$AF$4:$AI$35,4,FALSE))","v":""},null,null,{"$f":"IF(ISNA(VLOOKUP(D13,Inscrits!B:E,3,FALSE)),\"\",VLOOKUP(D13,Inscrits!B:E,3,FALSE))","v":""},{"$f":"IF(ISNA(VLOOKUP(D13,Inscrits!B:E,4,FALSE)),\"\",VLOOKUP(D13,Inscrits!B:E,4,FALSE))","v":""},"R1"]
[null,null,13,{"$f":"IF(Final!D17=\"A\",Final!B17,IF(Final!D16=\"A\",Final!B16,IF(Final!D16<Final!D17,Final!B16,Final!B17)))","v":""},null,{"$f":"IF(ISNA(IF(LEFT(Division,2)=\"R1\",VLOOKUP(E14,Points!$A$2:$D$18,2,FALSE),IF(LEFT(Division,2)=\"R2\",VLOOKUP(E14,Points!$A$2:$D$18,3,FALSE),IF(LEFT(Division,2)=\"R3\",VLOOKUP(E14,Points!$A$2:$D$18,4,FALSE),\"DIV ???\")))),0,IF(LEFT(Division,2)=\"R1\",VLOOKUP(E14,Points!$A$2:$D$18,2,FALSE),IF(LEFT(Division,2)=\"R2\",VLOOKUP(E14,Points!$A$2:$D$18,3,FALSE),IF(LEFT(Division,2)=\"R3\",VLOOKUP(E14,Points!$A$2:$D$18,4,FALSE),\"DIV ???\"))))","v":0},{"$f":"IF(ISERROR(VLOOKUP(D14,Final!$AF$4:$AI$35,4,FALSE)),\"\",VLOOKUP(D14,Final!$AF$4:$AI$35,4,FALSE))","v":""},null,null,{"$f":"IF(ISNA(VLOOKUP(D14,Inscrits!B:E,3,FALSE)),\"\",VLOOKUP(D14,Inscrits!B:E,3,FALSE))","v":""},{"$f":"IF(ISNA(VLOOKUP(D14,Inscrits!B:E,4,FALSE)),\"\",VLOOKUP(D14,Inscrits!B:E,4,FALSE))","v":""},"R1"]
[null,null,14,{"$f":"IF(Final!D20=\"A\",Final!B20,IF(Final!D19=\"A\",Final!B19,IF(Final!D19<Final!D20,Final!B19,Final!B20)))","v":""},null,{"$f":"IF(ISNA(IF(LEFT(Division,2)=\"R1\",VLOOKUP(E15,Points!$A$2:$D$18,2,FALSE),IF(LEFT(Division,2)=\"R2\",VLOOKUP(E15,Points!$A$2:$D$18,3,FALSE),IF(LEFT(Division,2)=\"R3\",VLOOKUP(E15,Points!$A$2:$D$18,4,FALSE),\"DIV ???\")))),0,IF(LEFT(Division,2)=\"R1\",VLOOKUP(E15,Points!$A$2:$D$18,2,FALSE),IF(LEFT(Division,2)=\"R2\",VLOOKUP(E15,Points!$A$2:$D$18,3,FALSE),IF(LEFT(Division,2)=\"R3\",VLOOKUP(E15,Points!$A$2:$D$18,4,FALSE),\"DIV ???\"))))","v":0},{"$f":"IF(ISERROR(VLOOKUP(D15,Final!$AF$4:$AI$35,4,FALSE)),\"\",VLOOKUP(D15,Final!$AF$4:$AI$35,4,FALSE))","v":""},null,null,{"$f":"IF(ISNA(VLOOKUP(D15,Inscrits!B:E,3,FALSE)),\"\",VLOOKUP(D15,Inscrits!B:E,3,FALSE))","v":""},{"$f":"IF(ISNA(VLOOKUP(D15,Inscrits!B:E,4,FALSE)),\"\",VLOOKUP(D15,Inscrits!B:E,4,FALSE))","v":""},"R1"]
[null,null,15,{"$f":"IF(Final!D23=\"A\",Final!B23,IF(Final!D22=\"A\",Final!B22,IF(Final!D22<Final!D23,Final!B22,Final!B23)))","v":""},null,{"$f":"IF(ISNA(IF(LEFT(Division,2)=\"R1\",VLOOKUP(E16,Points!$A$2:$D$18,2,FALSE),IF(LEFT(Division,2)=\"R2\",VLOOKUP(E16,Points!$A$2:$D$18,3,FALSE),IF(LEFT(Division,2)=\"R3\",VLOOKUP(E16,Points!$A$2:$D$18,4,FALSE),\"DIV ???\")))),0,IF(LEFT(Division,2)=\"R1\",VLOOKUP(E16,Points!$A$2:$D$18,2,FALSE),IF(LEFT(Division,2)=\"R2\",VLOOKUP(E16,Points!$A$2:$D$18,3,FALSE),IF(LEFT(Division,2)=\"R3\",VLOOKUP(E16,Points!$A$2:$D$18,4,FALSE),\"DIV ???\"))))","v":0},{"$f":"IF(ISERROR(VLOOKUP(D16,Final!$AF$4:$AI$35,4,FALSE)),\"\",VLOOKUP(D16,Final!$AF$4:$AI$35,4,FALSE))","v":""},null,null,{"$f":"IF(ISNA(VLOOKUP(D16,Inscrits!B:E,3,FALSE)),\"\",VLOOKUP(D16,Inscrits!B:E,3,FALSE))","v":""},{"$f":"IF(ISNA(VLOOKUP(D16,Inscrits!B:E,4,FALSE)),\"\",VLOOKUP(D16,Inscrits!B:E,4,FALSE))","v":""},"R1"]
[null,null,16,{"$f":"IF(Final!D26=\"A\",Final!B26,IF(Final!D25=\"A\",Final!B25,IF(Final!D25<Final!D26,Final!B25,Final!B26)))","v":""},null,{"$f":"IF(ISNA(IF(LEFT(Division,2)=\"R1\",VLOOKUP(E17,Points!$A$2:$D$18,2,FALSE),IF(LEFT(Division,2)=\"R2\",VLOOKUP(E17,Points!$A$2:$D$18,3,FALSE),IF(LEFT(Division,2)=\"R3\",VLOOKUP(E17,Points!$A$2:$D$18,4,FALSE),\"DIV ???\")))),0,IF(LEFT(Division,2)=\"R1\",VLOOKUP(E17,Points!$A$2:$D$18,2,FALSE),IF(LEFT(Division,2)=\"R2\",VLOOKUP(E17,Points!$A$2:$D$18,3,FALSE),IF(LEFT(Division,2)=\"R3\",VLOOKUP(E17,Points!$A$2:$D$18,4,FALSE),\"DIV ???\"))))","v":0},{"$f":"IF(ISERROR(VLOOKUP(D17,Final!$AF$4:$AI$35,4,FALSE)),\"\",VLOOKUP(D17,Final!$AF$4:$AI$35,4,FALSE))","v":""},null,null,{"$f":"IF(ISNA(VLOOKUP(D17,Inscrits!B:E,3,FALSE)),\"\",VLOOKUP(D17,Inscrits!B:E,3,FALSE))","v":""},{"$f":"IF(ISNA(VLOOKUP(D17,Inscrits!B:E,4,FALSE)),\"\",VLOOKUP(D17,Inscrits!B:E,4,FALSE))","v":""},"R1"]
[null,null,17,{"$f":"'1'!AR14","v":""},null,{"$f":"IF(ISNA(IF(LEFT(Division,2)=\"R1\",VLOOKUP(E18,Points!$A$2:$D$18,2,FALSE),IF(LEFT(Division,2)=\"R2\",VLOOKUP(E18,Points!$A$2:$D$18,3,FALSE),IF(LEFT(Division,2)=\"R3\",VLOOKUP(E18,Points!$A$2:$D$18,4,FALSE),\"DIV ???\")))),0,IF(LEFT(Division,2)=\"R1\",VLOOKUP(E18,Points!$A$2:$D$18,2,FALSE),IF(LEFT(Division,2)=\"R2\",VLOOKUP(E18,Points!$A$2:$D$18,3,FALSE),IF(LEFT(Division,2)=\"R3\",VLOOKUP(E18,Points!$A$2:$D$18,4,FALSE),\"DIV ???\"))))","v":0},{"$f":"IF(ISERROR(VLOOKUP(D18,Final!$AF$4:$AI$35,4,FALSE)),\"\",VLOOKUP(D18,Final!$AF$4:$AI$35,4,FALSE))","v":""},null,null,{"$f":"IF(ISNA(VLOOKUP(D18,Inscrits!B:E,3,FALSE)),\"\",VLOOKUP(D18,Inscrits!B:E,3,FALSE))","v":""},{"$f":"IF(ISNA(VLOOKUP(D18,Inscrits!B:E,4,FALSE)),\"\",VLOOKUP(D18,Inscrits!B:E,4,FALSE))","v":""},"R1"]
[null,null,18,{"$f":"'1'!AR15","v":""},null,{"$f":"IF(ISNA(IF(LEFT(Division,2)=\"R1\",VLOOKUP(E19,Points!$A$2:$D$18,2,FALSE),IF(LEFT(Division,2)=\"R2\",VLOOKUP(E19,Points!$A$2:$D$18,3,FALSE),IF(LEFT(Division,2)=\"R3\",VLOOKUP(E19,Points!$A$2:$D$18,4,FALSE),\"DIV ???\")))),0,IF(LEFT(Division,2)=\"R1\",VLOOKUP(E19,Points!$A$2:$D$18,2,FALSE),IF(LEFT(Division,2)=\"R2\",VLOOKUP(E19,Points!$A$2:$D$18,3,FALSE),IF(LEFT(Division,2)=\"R3\",VLOOKUP(E19,Points!$A$2:$D$18,4,FALSE),\"DIV ???\"))))","v":0},{"$f":"IF(ISERROR(VLOOKUP(D19,Final!$AF$4:$AI$35,4,FALSE)),\"\",VLOOKUP(D19,Final!$AF$4:$AI$35,4,FALSE))","v":""},null,null,{"$f":"IF(ISNA(VLOOKUP(D19,Inscrits!B:E,3,FALSE)),\"\",VLOOKUP(D19,Inscrits!B:E,3,FALSE))","v":""},{"$f":"IF(ISNA(VLOOKUP(D19,Inscrits!B:E,4,FALSE)),\"\",VLOOKUP(D19,Inscrits!B:E,4,FALSE))","v":""},"R1"]
[null,null,19,{"$f":"'2'!AR14","v":""},null,{"$f":"IF(ISNA(IF(LEFT(Division,2)=\"R1\",VLOOKUP(E20,Points!$A$2:$D$18,2,FALSE),IF(LEFT(Division,2)=\"R2\",VLOOKUP(E20,Points!$A$2:$D$18,3,FALSE),IF(LEFT(Division,2)=\"R3\",VLOOKUP(E20,Points!$A$2:$D$18,4,FALSE),\"DIV ???\")))),0,IF(LEFT(Division,2)=\"R1\",VLOOKUP(E20,Points!$A$2:$D$18,2,FALSE),IF(LEFT(Division,2)=\"R2\",VLOOKUP(E20,Points!$A$2:$D$18,3,FALSE),IF(LEFT(Division,2)=\"R3\",VLOOKUP(E20,Points!$A$2:$D$18,4,FALSE),\"DIV ???\"))))","v":0},{"$f":"IF(ISERROR(VLOOKUP(D20,Final!$AF$4:$AI$35,4,FALSE)),\"\",VLOOKUP(D20,Final!$AF$4:$AI$35,4,FALSE))","v":""},null,null,{"$f":"IF(ISNA(VLOOKUP(D20,Inscrits!B:E,3,FALSE)),\"\",VLOOKUP(D20,Inscrits!B:E,3,FALSE))","v":""},{"$f":"IF(ISNA(VLOOKUP(D20,Inscrits!B:E,4,FALSE)),\"\",VLOOKUP(D20,Inscrits!B:E,4,FALSE))","v":""},"R1"]
[null,null,20,{"$f":"'2'!AR15","v":""},null,{"$f":"IF(ISNA(IF(LEFT(Division,2)=\"R1\",VLOOKUP(E21,Points!$A$2:$D$18,2,FALSE),IF(LEFT(Division,2)=\"R2\",VLOOKUP(E21,Points!$A$2:$D$18,3,FALSE),IF(LEFT(Division,2)=\"R3\",VLOOKUP(E21,Points!$A$2:$D$18,4,FALSE),\"DIV ???\")))),0,IF(LEFT(Division,2)=\"R1\",VLOOKUP(E21,Points!$A$2:$D$18,2,FALSE),IF(LEFT(Division,2)=\"R2\",VLOOKUP(E21,Points!$A$2:$D$18,3,FALSE),IF(LEFT(Division,2)=\"R3\",VLOOKUP(E21,Points!$A$2:$D$18,4,FALSE),\"DIV ???\"))))","v":0},{"$f":"IF(ISERROR(VLOOKUP(D21,Final!$AF$4:$AI$35,4,FALSE)),\"\",VLOOKUP(D21,Final!$AF$4:$AI$35,4,FALSE))","v":""},null,null,{"$f":"IF(ISNA(VLOOKUP(D21,Inscrits!B:E,3,FALSE)),\"\",VLOOKUP(D21,Inscrits!B:E,3,FALSE))","v":""},{"$f":"IF(ISNA(VLOOKUP(D21,Inscrits!B:E,4,FALSE)),\"\",VLOOKUP(D21,Inscrits!B:E,4,FALSE))","v":""},"R1"]
[null,null,21,{"$f":"'3'!AR14","v":""},null,{"$f":"IF(ISNA(IF(LEFT(Division,2)=\"R1\",VLOOKUP(E22,Points!$A$2:$D$18,2,FALSE),IF(LEFT(Division,2)=\"R2\",VLOOKUP(E22,Points!$A$2:$D$18,3,FALSE),IF(LEFT(Division,2)=\"R3\",VLOOKUP(E22,Points!$A$2:$D$18,4,FALSE),\"DIV ???\")))),0,IF(LEFT(Division,2)=\"R1\",VLOOKUP(E22,Points!$A$2:$D$18,2,FALSE),IF(LEFT(Division,2)=\"R2\",VLOOKUP(E22,Points!$A$2:$D$18,3,FALSE),IF(LEFT(Division,2)=\"R3\",VLOOKUP(E22,Points!$A$2:$D$18,4,FALSE),\"DIV ???\"))))","v":0},{"$f":"IF(ISERROR(VLOOKUP(D22,Final!$AF$4:$AI$35,4,FALSE)),\"\",VLOOKUP(D22,Final!$AF$4:$AI$35,4,FALSE))","v":""},null,null,{"$f":"IF(ISNA(VLOOKUP(D22,Inscrits!B:E,3,FALSE)),\"\",VLOOKUP(D22,Inscrits!B:E,3,FALSE))","v":""},{"$f":"IF(ISNA(VLOOKUP(D22,Inscrits!B:E,4,FALSE)),\"\",VLOOKUP(D22,Inscrits!B:E,4,FALSE))","v":""},"R1"]
[null,null,22,{"$f":"'3'!AR15","v":""},null,{"$f":"IF(ISNA(IF(LEFT(Division,2)=\"R1\",VLOOKUP(E23,Points!$A$2:$D$18,2,FALSE),IF(LEFT(Division,2)=\"R2\",VLOOKUP(E23,Points!$A$2:$D$18,3,FALSE),IF(LEFT(Division,2)=\"R3\",VLOOKUP(E23,Points!$A$2:$D$18,4,FALSE),\"DIV ???\")))),0,IF(LEFT(Division,2)=\"R1\",VLOOKUP(E23,Points!$A$2:$D$18,2,FALSE),IF(LEFT(Division,2)=\"R2\",VLOOKUP(E23,Points!$A$2:$D$18,3,FALSE),IF(LEFT(Division,2)=\"R3\",VLOOKUP(E23,Points!$A$2:$D$18,4,FALSE),\"DIV ???\"))))","v":0},{"$f":"IF(ISERROR(VLOOKUP(D23,Final!$AF$4:$AI$35,4,FALSE)),\"\",VLOOKUP(D23,Final!$AF$4:$AI$35,4,FALSE))","v":""},null,null,{"$f":"IF(ISNA(VLOOKUP(D23,Inscrits!B:E,3,FALSE)),\"\",VLOOKUP(D23,Inscrits!B:E,3,FALSE))","v":""},{"$f":"IF(ISNA(VLOOKUP(D23,Inscrits!B:E,4,FALSE)),\"\",VLOOKUP(D23,Inscrits!B:E,4,FALSE))","v":""},{"$f":"Division","v":"R1"}]
[null,null,23,{"$f":"'4'!AR14","v":""},null,{"$f":"IF(ISNA(IF(LEFT(Division,2)=\"R1\",VLOOKUP(E24,Points!$A$2:$D$18,2,FALSE),IF(LEFT(Division,2)=\"R2\",VLOOKUP(E24,Points!$A$2:$D$18,3,FALSE),IF(LEFT(Division,2)=\"R3\",VLOOKUP(E24,Points!$A$2:$D$18,4,FALSE),\"DIV ???\")))),0,IF(LEFT(Division,2)=\"R1\",VLOOKUP(E24,Points!$A$2:$D$18,2,FALSE),IF(LEFT(Division,2)=\"R2\",VLOOKUP(E24,Points!$A$2:$D$18,3,FALSE),IF(LEFT(Division,2)=\"R3\",VLOOKUP(E24,Points!$A$2:$D$18,4,FALSE),\"DIV ???\"))))","v":0},{"$f":"IF(ISERROR(VLOOKUP(D24,Final!$AF$4:$AI$35,4,FALSE)),\"\",VLOOKUP(D24,Final!$AF$4:$AI$35,4,FALSE))","v":""},null,null,{"$f":"IF(ISNA(VLOOKUP(D24,Inscrits!B:E,3,FALSE)),\"\",VLOOKUP(D24,Inscrits!B:E,3,FALSE))","v":""},{"$f":"IF(ISNA(VLOOKUP(D24,Inscrits!B:E,4,FALSE)),\"\",VLOOKUP(D24,Inscrits!B:E,4,FALSE))","v":""},"R1"]
[null,null,24,{"$f":"'4'!AR15","v":""},null,{"$f":"IF(ISNA(IF(LEFT(Division,2)=\"R1\",VLOOKUP(E25,Points!$A$2:$D$18,2,FALSE),IF(LEFT(Division,2)=\"R2\",VLOOKUP(E25,Points!$A$2:$D$18,3,FALSE),IF(LEFT(Division,2)=\"R3\",VLOOKUP(E25,Points!$A$2:$D$18,4,FALSE),\"DIV ???\")))),0,IF(LEFT(Division,2)=\"R1\",VLOOKUP(E25,Points!$A$2:$D$18,2,FALSE),IF(LEFT(Division,2)=\"R2\",VLOOKUP(E25,Points!$A$2:$D$18,3,FALSE),IF(LEFT(Division,2)=\"R3\",VLOOKUP(E25,Points!$A$2:$D$18,4,FALSE),\"DIV ???\"))))","v":0},{"$f":"IF(ISERROR(VLOOKUP(D25,Final!$AF$4:$AI$35,4,FALSE)),\"\",VLOOKUP(D25,Final!$AF$4:$AI$35,4,FALSE))","v":""},null,null,{"$f":"IF(ISNA(VLOOKUP(D25,Inscrits!B:E,3,FALSE)),\"\",VLOOKUP(D25,Inscrits!B:E,3,FALSE))","v":""},{"$f":"IF(ISNA(VLOOKUP(D25,Inscrits!B:E,4,FALSE)),\"\",VLOOKUP(D25,Inscrits!B:E,4,FALSE))","v":""},"R1"]
[null,null,25,{"$f":"'1'!AR16","v":""},null,{"$f":"IF(ISNA(IF(LEFT(Division,2)=\"R1\",VLOOKUP(E26,Points!$A$2:$D$18,2,FALSE),IF(LEFT(Division,2)=\"R2\",VLOOKUP(E26,Points!$A$2:$D$18,3,FALSE),IF(LEFT(Division,2)=\"R3\",VLOOKUP(E26,Points!$A$2:$D$18,4,FALSE),\"DIV ???\")))),0,IF(LEFT(Division,2)=\"R1\",VLOOKUP(E26,Points!$A$2:$D$18,2,FALSE),IF(LEFT(Division,2)=\"R2\",VLOOKUP(E26,Points!$A$2:$D$18,3,FALSE),IF(LEFT(Division,2)=\"R3\",VLOOKUP(E26,Points!$A$2:$D$18,4,FALSE),\"DIV ???\"))))","v":0},{"$f":"IF(ISERROR(VLOOKUP(D26,Final!$AF$4:$AI$35,4,FALSE)),\"\",VLOOKUP(D26,Final!$AF$4:$AI$35,4,FALSE))","v":""},null,null,{"$f":"IF(ISNA(VLOOKUP(D26,Inscrits!B:E,3,FALSE)),\"\",VLOOKUP(D26,Inscrits!B:E,3,FALSE))","v":""},{"$f":"IF(ISNA(VLOOKUP(D26,Inscrits!B:E,4,FALSE)),\"\",VLOOKUP(D26,Inscrits!B:E,4,FALSE))","v":""},{"$f":"IF(NB_JOUEURS_DOWN>7,\"Relégué(e)\",Division)","v":"R1"}]
[null,null,26,{"$f":"'1'!AR17","v":""},null,{"$f":"IF(ISNA(IF(LEFT(Division,2)=\"R1\",VLOOKUP(E27,Points!$A$2:$D$18,2,FALSE),IF(LEFT(Division,2)=\"R2\",VLOOKUP(E27,Points!$A$2:$D$18,3,FALSE),IF(LEFT(Division,2)=\"R3\",VLOOKUP(E27,Points!$A$2:$D$18,4,FALSE),\"DIV ???\")))),0,IF(LEFT(Division,2)=\"R1\",VLOOKUP(E27,Points!$A$2:$D$18,2,FALSE),IF(LEFT(Division,2)=\"R2\",VLOOKUP(E27,Points!$A$2:$D$18,3,FALSE),IF(LEFT(Division,2)=\"R3\",VLOOKUP(E27,Points!$A$2:$D$18,4,FALSE),\"DIV ???\"))))","v":0},{"$f":"IF(ISERROR(VLOOKUP(D27,Final!$AF$4:$AI$35,4,FALSE)),\"\",VLOOKUP(D27,Final!$AF$4:$AI$35,4,FALSE))","v":""},null,null,{"$f":"IF(ISNA(VLOOKUP(D27,Inscrits!B:E,3,FALSE)),\"\",VLOOKUP(D27,Inscrits!B:E,3,FALSE))","v":""},{"$f":"IF(ISNA(VLOOKUP(D27,Inscrits!B:E,4,FALSE)),\"\",VLOOKUP(D27,Inscrits!B:E,4,FALSE))","v":""},{"$f":"IF(NB_JOUEURS_DOWN>6,\"Relégué(e)\",Division)","v":"R1"}]
[null,null,27,{"$f":"'2'!AR16","v":""},null,{"$f":"IF(ISNA(IF(LEFT(Division,2)=\"R1\",VLOOKUP(E28,Points!$A$2:$D$18,2,FALSE),IF(LEFT(Division,2)=\"R2\",VLOOKUP(E28,Points!$A$2:$D$18,3,FALSE),IF(LEFT(Division,2)=\"R3\",VLOOKUP(E28,Points!$A$2:$D$18,4,FALSE),\"DIV ???\")))),0,IF(LEFT(Division,2)=\"R1\",VLOOKUP(E28,Points!$A$2:$D$18,2,FALSE),IF(LEFT(Division,2)=\"R2\",VLOOKUP(E28,Points!$A$2:$D$18,3,FALSE),IF(LEFT(Division,2)=\"R3\",VLOOKUP(E28,Points!$A$2:$D$18,4,FALSE),\"DIV ???\"))))","v":0},{"$f":"IF(ISERROR(VLOOKUP(D28,Final!$AF$4:$AI$35,4,FALSE)),\"\",VLOOKUP(D28,Final!$AF$4:$AI$35,4,FALSE))","v":""},null,null,{"$f":"IF(ISNA(VLOOKUP(D28,Inscrits!B:E,3,FALSE)),\"\",VLOOKUP(D28,Inscrits!B:E,3,FALSE))","v":""},{"$f":"IF(ISNA(VLOOKUP(D28,Inscrits!B:E,4,FALSE)),\"\",VLOOKUP(D28,Inscrits!B:E,4,FALSE))","v":""},{"$f":"IF(NB_JOUEURS_DOWN>5,\"Relégué(e)\",Division)","v":"R1"}]
[null,null,28,{"$f":"'2'!AR17","v":""},null,{"$f":"IF(ISNA(IF(LEFT(Division,2)=\"R1\",VLOOKUP(E29,Points!$A$2:$D$18,2,FALSE),IF(LEFT(Division,2)=\"R2\",VLOOKUP(E29,Points!$A$2:$D$18,3,FALSE),IF(LEFT(Division,2)=\"R3\",VLOOKUP(E29,Points!$A$2:$D$18,4,FALSE),\"DIV ???\")))),0,IF(LEFT(Division,2)=\"R1\",VLOOKUP(E29,Points!$A$2:$D$18,2,FALSE),IF(LEFT(Division,2)=\"R2\",VLOOKUP(E29,Points!$A$2:$D$18,3,FALSE),IF(LEFT(Division,2)=\"R3\",VLOOKUP(E29,Points!$A$2:$D$18,4,FALSE),\"DIV ???\"))))","v":0},{"$f":"IF(ISERROR(VLOOKUP(D29,Final!$AF$4:$AI$35,4,FALSE)),\"\",VLOOKUP(D29,Final!$AF$4:$AI$35,4,FALSE))","v":""},null,null,{"$f":"IF(ISNA(VLOOKUP(D29,Inscrits!B:E,3,FALSE)),\"\",VLOOKUP(D29,Inscrits!B:E,3,FALSE))","v":""},{"$f":"IF(ISNA(VLOOKUP(D29,Inscrits!B:E,4,FALSE)),\"\",VLOOKUP(D29,Inscrits!B:E,4,FALSE))","v":""},{"$f":"IF(NB_JOUEURS_DOWN>4,\"Relégué(e)\",Division)","v":"R1"}]
[null,null,29,{"$f":"'3'!AR16","v":""},null,{"$f":"IF(ISNA(IF(LEFT(Division,2)=\"R1\",VLOOKUP(E30,Points!$A$2:$D$18,2,FALSE),IF(LEFT(Division,2)=\"R2\",VLOOKUP(E30,Points!$A$2:$D$18,3,FALSE),IF(LEFT(Division,2)=\"R3\",VLOOKUP(E30,Points!$A$2:$D$18,4,FALSE),\"DIV ???\")))),0,IF(LEFT(Division,2)=\"R1\",VLOOKUP(E30,Points!$A$2:$D$18,2,FALSE),IF(LEFT(Division,2)=\"R2\",VLOOKUP(E30,Points!$A$2:$D$18,3,FALSE),IF(LEFT(Division,2)=\"R3\",VLOOKUP(E30,Points!$A$2:$D$18,4,FALSE),\"DIV ???\"))))","v":0},{"$f":"IF(ISERROR(VLOOKUP(D30,Final!$AF$4:$AI$35,4,FALSE)),\"\",VLOOKUP(D30,Final!$AF$4:$AI$35,4,FALSE))","v":""},null,null,{"$f":"IF(ISNA(VLOOKUP(D30,Inscrits!B:E,3,FALSE)),\"\",VLOOKUP(D30,Inscrits!B:E,3,FALSE))","v":""},{"$f":"IF(ISNA(VLOOKUP(D30,Inscrits!B:E,4,FALSE)),\"\",VLOOKUP(D30,Inscrits!B:E,4,FALSE))","v":""},{"$f":"IF(NB_JOUEURS_DOWN>3,\"Relégué(e)\",Division)","v":"R1"}]
[null,null,30,{"$f":"'3'!AR17","v":""},null,{"$f":"IF(ISNA(IF(LEFT(Division,2)=\"R1\",VLOOKUP(E31,Points!$A$2:$D$18,2,FALSE),IF(LEFT(Division,2)=\"R2\",VLOOKUP(E31,Points!$A$2:$D$18,3,FALSE),IF(LEFT(Division,2)=\"R3\",VLOOKUP(E31,Points!$A$2:$D$18,4,FALSE),\"DIV ???\")))),0,IF(LEFT(Division,2)=\"R1\",VLOOKUP(E31,Points!$A$2:$D$18,2,FALSE),IF(LEFT(Division,2)=\"R2\",VLOOKUP(E31,Points!$A$2:$D$18,3,FALSE),IF(LEFT(Division,2)=\"R3\",VLOOKUP(E31,Points!$A$2:$D$18,4,FALSE),\"DIV ???\"))))","v":0},{"$f":"IF(ISERROR(VLOOKUP(D31,Final!$AF$4:$AI$35,4,FALSE)),\"\",VLOOKUP(D31,Final!$AF$4:$AI$35,4,FALSE))","v":""},null,null,{"$f":"IF(ISNA(VLOOKUP(D31,Inscrits!B:E,3,FALSE)),\"\",VLOOKUP(D31,Inscrits!B:E,3,FALSE))","v":""},{"$f":"IF(ISNA(VLOOKUP(D31,Inscrits!B:E,4,FALSE)),\"\",VLOOKUP(D31,Inscrits!B:E,4,FALSE))","v":""},{"$f":"IF(NB_JOUEURS_DOWN>2,\"Relégué(e)\",Division)","v":"R1"}]
[null,null,31,{"$f":"'4'!AR16","v":""},null,{"$f":"IF(ISNA(IF(LEFT(Division,2)=\"R1\",VLOOKUP(E32,Points!$A$2:$D$18,2,FALSE),IF(LEFT(Division,2)=\"R2\",VLOOKUP(E32,Points!$A$2:$D$18,3,FALSE),IF(LEFT(Division,2)=\"R3\",VLOOKUP(E32,Points!$A$2:$D$18,4,FALSE),\"DIV ???\")))),0,IF(LEFT(Division,2)=\"R1\",VLOOKUP(E32,Points!$A$2:$D$18,2,FALSE),IF(LEFT(Division,2)=\"R2\",VLOOKUP(E32,Points!$A$2:$D$18,3,FALSE),IF(LEFT(Division,2)=\"R3\",VLOOKUP(E32,Points!$A$2:$D$18,4,FALSE),\"DIV ???\"))))","v":0},{"$f":"IF(ISERROR(VLOOKUP(D32,Final!$AF$4:$AI$35,4,FALSE)),\"\",VLOOKUP(D32,Final!$AF$4:$AI$35,4,FALSE))","v":""},null,null,{"$f":"IF(ISNA(VLOOKUP(D32,Inscrits!B:E,3,FALSE)),\"\",VLOOKUP(D32,Inscrits!B:E,3,FALSE))","v":""},{"$f":"IF(ISNA(VLOOKUP(D32,Inscrits!B:E,4,FALSE)),\"\",VLOOKUP(D32,Inscrits!B:E,4,FALSE))","v":""},{"$f":"IF(NB_JOUEURS_DOWN>1,\"Relégué(e)\",Division)","v":"R1"}]
[null,null,32,{"$f":"'4'!AR17","v":""},null,{"$f":"IF(ISNA(IF(LEFT(Division,2)=\"R1\",VLOOKUP(E33,Points!$A$2:$D$18,2,FALSE),IF(LEFT(Division,2)=\"R2\",VLOOKUP(E33,Points!$A$2:$D$18,3,FALSE),IF(LEFT(Division,2)=\"R3\",VLOOKUP(E33,Points!$A$2:$D$18,4,FALSE),\"DIV ???\")))),0,IF(LEFT(Division,2)=\"R1\",VLOOKUP(E33,Points!$A$2:$D$18,2,FALSE),IF(LEFT(Division,2)=\"R2\",VLOOKUP(E33,Points!$A$2:$D$18,3,FALSE),IF(LEFT(Division,2)=\"R3\",VLOOKUP(E33,Points!$A$2:$D$18,4,FALSE),\"DIV ???\"))))","v":0},{"$f":"IF(ISERROR(VLOOKUP(D33,Final!$AF$4:$AI$35,4,FALSE)),\"\",VLOOKUP(D33,Final!$AF$4:$AI$35,4,FALSE))","v":""},null,null,{"$f":"IF(ISNA(VLOOKUP(D33,Inscrits!B:E,3,FALSE)),\"\",VLOOKUP(D33,Inscrits!B:E,3,FALSE))","v":""},{"$f":"IF(ISNA(VLOOKUP(D33,Inscrits!B:E,4,FALSE)),\"\",VLOOKUP(D33,Inscrits!B:E,4,FALSE))","v":""},{"$f":"IF(NB_JOUEURS_DOWN>0,\"Relégué(e)\",Division)","v":"R1"}]

{"sheet":"Feuil1","index":9,"n_rows":987,"n_cols":3,"rows_kept":987,"cut":false,"hidden":true,"merged":[]}
["NOM PRENOM","Licence","Nom Club"]
["AARAB LAHOUSINE","163282F","CLUB CHAMBERIEN DE BILLARD"]
["ABDOULZABAR CARIME","113202Y","GROUPE SPORTIF LUGDUNUM"]
["ABLONDI LAURENT","151373L","CERCLE DES CHEFS D ATELIER"]
["ABOUAF DANIEL","015873N","ACADEMIE BILLARD OUEST LYONNAIS"]
["ABRIAL NICOLE","153509H","AMICALE BILLARD CLUB DE DAVEZIEUX"]
["ACCARD ROBERT","163731T","ACADEMIE ANNECIENNE DE BILLARD"]
["ACCETTOLA ELIO","152956G","ACADEMIE DE BILLARD DE CHASSIEU"]
["ACHARD LOUIS","016009T","ACAD. DE BILLARD DE SAINT-ETIENNE"]
["ACHARD PATRICK","020465D","ACADEMIE DE BILLARD DE HAUTE LOIRE"]
["ADON MARC OLIVIER","161258F","ACADEMIE DE BILLARD DE LA VALSERINE"]
["AGNEL FLORENT","163554B","LES SQUALES"]
["ALLEGRE GUY","160649T","ASS. SPORTIVE MUNICIPALE ST ETIENNE"]
["ALONSO LUCIEN","122424Q","A.B. DE BOURGOIN-JALLIEU"]
["ALTISEN ELIOS","152592L","GROUPE SPORTIF LUGDUNUM"]
["ANDRE PASCAL","100896Q","BILLARD CLUB DE LA PLAINE DU FOREZ"]
["ANDRIEU EVELYNE","153556J","BILLARD CLUB GRENOBLOIS"]
["ANDRIEU JEAN PIERRE","153555H","BILLARD CLUB GRENOBLOIS"]
["ANGELO NATHANAEL","159829C","CHARLEMAGNE SNOOKER CLUB"]
["ANNEIX JACQUES","121510M","BILLARD CLUB BOURBON"]
["ARCIDIACONO ANTOINE","160875P","GROUPE SPORTIF LUGDUNUM"]
["ARMAND BRUNO","015777V","VALENCE BILLARD CLUB"]
["ARMAND JEAN LOUIS","015866G","BILLARD CLUB ROMANAIS PEAGEOIS"]
["ARMANDI JEAN CLAUDE","152479N","BILLARD CLUB BOURBON"]
["ARNAUD JEAN PHILIPPE","159063V","BILLARD CLUB DE CLARAFOND ARCINE"]
["ARNAUD PHILIPPE","100971N","CLUB DE BILLARD MONTBRISONNAIS"]
["ARTICO JOEL","162532Q","BILLARD STELLA THONON"]
["AUBERT PIERRE","130057F","ACADEMIE ANNECIENNE DE BILLARD"]
["AUBERT ROUECHE ERIC","022383X","CLUB OMNISPORTS DE SAINT FONS"]
["AUBRY DOMINIQUE","140567L","ACADEMIE DE BILLARD D AUBENAS"]
["AUDIN GUY","136248I","ACADEMIE ANNECIENNE DE BILLARD"]
["AUFFRET MARCEL","148023V","BILLARD STELLA THONON"]
["AUGAGNEUR JEAN PAUL","016143X","ASS. SPORTIVE MUNICIPALE ST ETIENNE"]
["AURAND LOUIS","015881V","BILLARD CLUB PONTOIS"]
["AVEDISSIAN HENRI","100953V","ACADEMIE DE BILLARD DE CHASSIEU"]
["AVET BERNARD","147114G","BILLARD CLUB AIXOIS"]
["AZUELOS MAXIME","126989F","CLUB CHAMBERIEN DE BILLARD"]
["BABEL STEPHANIE","159062T","BILLARD CLUB DE CLARAFOND ARCINE"]
["BACCAM BOUNLIENG","137597F","NIGHT BILLARD CLUB"]
["BACCAM HELENE","146104K","NIGHT BILLARD CLUB"]
["BACHELET DANIEL","159789J","A.B. DE BOURGOIN-JALLIEU"]
["BAILLY CLAUDE","016416K","CLUB CHAMBERIEN DE BILLARD"]
["BAILLY FABRICE","126039R","BILLARD CLUB LYONNAIS 8 POOL"]
["BAIZET CHRISTIAN","015869J","BILLARD CLUB ROMANAIS PEAGEOIS"]
["BALHAND SEBASTIEN","160643M","CLUB CHAMBERIEN DE BILLARD"]
["BANCILHON JEAN","143441Z","BILLARD CLUB ROMANAIS PEAGEOIS"]
["BAPST CHRISTIAN","160730G","SAINT CHAMOND BILLARD CLUB"]
["BARBIER YANN","138977H","Licenciés indépendants 42"]
["BARGE EMMANUEL","159354L","LES SQUALES"]
["BARRALON FREDERIC","140811V","BILLARD CLUB DE SAINT-GALMIER"]
["BARRAUD PIERRE","132960W","BILLARD CLUB DE VILLEFRANCHE"]
["BARROIS ALAIN","151506F","CLUB CHAMBERIEN DE BILLARD"]
["BARSE BRUNO","149764M","BILLARD CLUB VICHY"]
["BATAILLE RAYMOND","015826S","BILLARD CLUB PONTOIS"]
["BAUDIN LILIANE","160876Q","GROUPE SPORTIF LUGDUNUM"]
["BAUMANN CLAUDE","161105P","LE TAPIS VERT ROANNAIS"]
["BAUP PASCAL","016085R","ACADEMIE ANNECIENNE DE BILLARD"]
["BAVUSO FRANCOIS","015996G","ACAD. DE BILLARD DE SAINT-ETIENNE"]
["BAYET BENOIT","132971H","CLUB DE BILLARD MONTBRISONNAIS"]
["BAYET BRUNO","137591Z","CLUB DE BILLARD MONTBRISONNAIS"]
["BEAUCLAIR JEAN RENE","150876W","ACADEMIE DE BILLARD DE LA VALSERINE"]
["BEAUD CHRISTOPHE","158185Q","CLUB CHAMBERIEN DE BILLARD"]
["BEAUFILS JEAN PATRICK","149841W","CLUB CHAMBERIEN DE BILLARD"]
["BECCHIA CLAUDE","160179H","ACADEMIE ANNECIENNE DE BILLARD"]
["BEE JEAN LUC","144173D","B.S.CLERMONTOIS"]
["BELBECIR MOURAD","130046U","BILLARD CLUB 109"]
["BELGUERMI NICOLAS","157793P","ACAD. DE BILLARD DE SAINT-ETIENNE"]
["BELLEGY LUCIEN","162798E","CLUB DE BILLARD MONTBRISONNAIS"]
["BELLET SYLVAIN","162814X","CHARLEMAGNE SNOOKER CLUB"]
["BEN ALLAL YASSINE","132940C","BILLARD CLUB 109"]
["BENABDESSELAM YASSINE","163592S","Licenciés indépendants 42"]
["BENITA CLAUDE","162934C","CLUB CHAMBERIEN DE BILLARD"]
["BENOIT LUCIEN","137590Y","CLUB DE BILLARD MONTBRISONNAIS"]
["BERARD HERVE","135834K","BILLARD CLUB 109"]
["BERCHE JEAN LUC","156508S","BILLARD CLUB ISSOIRE"]
["BERENGUER MANUEL","137610S","ACADEMIE DE BILLARD DE CHASSIEU"]
["BERGER CHRISTIAN","016488E","BILLARD CLUB DE SAINT-GALMIER"]
["BERGER MICHEL","127290U","VALENCE BILLARD CLUB"]
["BERGNES LENNY","155901H","BILLARD CLUB PONTOIS"]
["BERLIAT PATRICIA","149474X","BILLARD CLUB PONTOIS"]
["BERLIAT REGIS","137600I","BILLARD CLUB PONTOIS"]
["BERNARD ALAIN","142693F","CLUB DE BILLARD MONTBRISONNAIS"]
["BERNILLON MARCEL","100867N","CLUB OMNISPORTS DE SAINT FONS"]
["BERRAHOU SOLANGE","153217Q","ACADEMIE DE BILLARD DE LA VALSERINE"]
["BERRIN RENAUD","125035B","CERCLE DES CHEFS D ATELIER"]
["BERRUYER ROGER","015900O","BILLARD CLUB ROMANAIS PEAGEOIS"]
["BERTHELIER PATRICK","015959V","LE TAPIS VERT ROANNAIS"]
["BERTHET JACQUES","151771T","CERCLE DES CHEFS D ATELIER"]
["BERTHIER DOMINIQUE","100869P","CLUB OMNISPORTS DE SAINT FONS"]
["BERTHOLON GERARD","016073F","ACAD. DE BILLARD DE SAINT-ETIENNE"]
["BERTOTTO CHRISTIAN","129026O","BILLARD CLUB ISSOIRE"]
["BERTRAND ADRIEN","160731H","ACADEMIE DE BILLARD DE CHASSIEU"]
["BESNIER ALAIN","149988F","GROUPE SPORTIF LUGDUNUM"]
["BESSE DANIEL","159641Y","BILLARD CLUB GRENOBLOIS"]
["BESSE YVES","136247H","ACADEMIE ANNECIENNE DE BILLARD"]
["BESSON JEAN BAPTISTE","107766W","CERCLE DES CHEFS D ATELIER"]
["BESSON JEROME","150947Y","BILLARD CLUB DE CLARAFOND ARCINE"]
["BETTES JEAN LOUIS","100973P","BILLARD CLUB ROMANAIS PEAGEOIS"]
["BEZIER RENAUD","136030Y","ACADEMIE BILLARD OUEST LYONNAIS"]
["BIENNE CYRIL","137839N","CHARLEMAGNE SNOOKER CLUB"]
["BIGNANI PATRICK","157066Z","ACADEMIE DE BILLARD D AUBENAS"]
["BILLARD JEAN LOUIS","100915J","CLUB CHAMBERIEN DE BILLARD"]
["BLANC FRANCIS","112458I","ACADEMIE BILLARD OUEST LYONNAIS"]
["BLANCHARD CLAUDE","112490O","ACADEMIE ANNECIENNE DE BILLARD"]
["BLANCHET PATRICK","138188Y","BLACKBALL BILLARD CLUB BESAYES 26"]
["BLANCHIN GERARD","136202O","LE TAPIS VERT ROANNAIS"]
["BLETON CLAUDE","014638A","CERCLE DES CHEFS D ATELIER"]
["BLONDELLE CLEMENT","163788F","BILLARD CLUB 8 POOL EVIAN"]
["BLONDOT YVES","016219V","ACADEMIE ANNECIENNE DE BILLARD"]
["BLUET JEAN MARIE","133632S","ACADEMIE DE BILLARD DE CHASSIEU"]
["BOBEE GREGORY","100009N","BILLARD CLUB DE SAINT-GALMIER"]
["BOCHARD PHILIPPE","156521G","BILLARD CLUB ISSOIRE"]
["BODEREAU AMELIE","156787W","CLERMONT AUVERGNE BILLARD CLUB"]
["BODEREAU JOHANNY","152681H","CLERMONT AUVERGNE BILLARD CLUB"]
["BOISSIERAS JEAN","016378Y","GROUPE SPORTIF LUGDUNUM"]
["BOISSIERE VINCENT","143741N","BILLARD CLUB GRENOBLOIS"]
["BOISSOU ROBERT","015787F","CLUB CHAMBERIEN DE BILLARD"]
["BONDOUY FREDERIK","146112S","ACADEMIE DE BILLARD D AUBENAS"]
["BONNAMOUR ETIENNE","145637L","CLUB DE BILLARD MONTBRISONNAIS"]
["BONNARD MARTINE","160605W","ACADEMIE DE BILLARD DE CHASSIEU"]
["BONNEFOI RICHARD","015796O","CLUB OMNISPORTS DE SAINT FONS"]
["BONNEFOND CHRISTIAN","148303Z","ACADEMIE BILLARD OUEST LYONNAIS"]
["BONTOUX SYLVIE","157880J","EIGHT'S POOL GAME"]
["BORDET LEO","163047A","ACADEMIE DE BILLARD DE CHASSIEU"]
["BORGEAT CHRISTIANE","156534W","ACADEMIE DE BILLARD DE LA VALSERINE"]
["BORNET PHILIPPE","016337J","CERCLE DES CHEFS D ATELIER"]
["BORY PHILIPPE","016111R","CLUB DE BILLARD MONTBRISONNAIS"]
["BOSIA JULIEN","133771B","BILLARD CLUB DE GAILLARD"]
["BOTTON JACKY","015843J","BILLARD CLUB PONTOIS"]
["BOUDAILLIER PIERRE","011105D","B.S.CLERMONTOIS"]
["BOULADE COLETTE","160877R","GROUPE SPORTIF LUGDUNUM"]
["BOULAND DANIEL","157063W","ACADEMIE ANNECIENNE DE BILLARD"]
["BOURDIC CLAUDE","130420E","A.B. DE BOURGOIN-JALLIEU"]
["BOURDIER JACQUES","152907D","BILLARD CLUB VICHY"]
["BOURDIN JACQUES","011141N","BILLARD CLUB MONTLUCONNAIS"]
["BOURGEOIS GERARD","016056O","BILLARD STELLA THONON"]
["BOURHIS JEAN","021913V","BILLARD CLUB PONTOIS"]
["BOURLIER MAX","016222Y","ACADEMIE ANNECIENNE DE BILLARD"]
["BOURREAU JEAN LUC","156432K","LE TAPIS VERT ROANNAIS"]
["BOUTET MAYEUL","155880K","BILLARD CLUB VICHY"]
["BOUVAIST JEAN MARC","160878S","GROUPE SPORTIF LUGDUNUM"]
["BOUVAIST MARTINE","160879T","GROUPE SPORTIF LUGDUNUM"]
["BOUVET ANDRE","015703Z","ACADEMIE BILLARD OUEST LYONNAIS"]
["BOUZOUZOU HAMID","162644M","BILLARD CLUB 109"]
["BOYER BERNARD","145377L","BILLARD CLUB ROMANAIS PEAGEOIS"]
["BOYER THIERRY","142216W","CERCLE DES CHEFS D ATELIER"]
["BRACEIRO JOSE","127310O","LES SQUALES"]
["BRAYAT KEVIN","135588Y","BIG BEN BLACKBALL"]
["BRAYER DENIS","016411F","ACADEMIE ANNECIENNE DE BILLARD"]
["BREDA YVES","112866A","BILLARD CLUB AIXOIS"]
["BREGRE LILOU","162580S","BIG BEN BLACKBALL"]
["BREGRE MAELYS","162579R","BIG BEN BLACKBALL"]
["BREGRE SEBASTIEN","159347D","BIG BEN BLACKBALL"]
["BRENDEL CHRISTIAN","135920S","BILLARD CLUB DE BOURG EN BRESSE"]
["BRICHET CHRISTIAN","100921P","ACADEMIE ANNECIENNE DE BILLARD"]
["BRISSE THIERRY","135925X","ACADEMIE DE BILLARD DE HAUTE LOIRE"]
["BROC AIME","112484I","ACADEMIE DE BILLARD DE HAUTE LOIRE"]
["BROCHAND EVELYNE","163160Y","CERCLE DES CHEFS D ATELIER"]
["BROCHAND PATRICK","015727X","CERCLE DES CHEFS D ATELIER"]
["BROCHIER PATRICK","152651A","ACADEMIE DE BILLARD DE CHASSIEU"]
["BRUN CHRISTOPHE","155902J","BILLARD CLUB PONTOIS"]
["BRUNET GILLES","155127R","SAINT CHAMOND BILLARD CLUB"]
["BRUNET MARC","163037P","B.S.CLERMONTOIS"]
["BRUNET MAURICE","156980F","BILLARD CLUB DE BOURG EN BRESSE"]
["BRUNETAUD ALAIN","150014J","BILLARD CLUB AIXOIS"]
["BRUYAS ANTOINE","100972O","ACAD. DE BILLARD DE SAINT-ETIENNE"]
["BUGIS ANDRE","152401D","BILLARD CLUB AIXOIS"]
["BUISSON JACQUES","152593M","GROUPE SPORTIF LUGDUNUM"]
["BUISSONNIERE DUSTIN","155923G","BILLARD CLUB VICHY"]
["BUSSONNET JACKY","119288A","BILLARD CLUB VICHY"]
["CABANES PHILIPPE","015748S","BILLARD CLUB PONTOIS"]
["CABANET FLORENCE","150869N","NIGHT BILLARD CLUB"]
["CABARET MICHEL","127650Q","BILLARD CLUB GRENOBLOIS"]
["CADET DAVID CHRISTOPHER","161384S","BILLARD CLUB LYONNAIS 8 POOL"]
["CADORE JEAN LUC","112460K","ACADEMIE BILLARD OUEST LYONNAIS"]
["CADOUX DAMIEN","155631P","ASSOCIATION DU LAKE PUB 74"]
["CAESTEKER MARCEL","156463T","BILLARD CLUB ISSOIRE"]
["CAILLAT ANDRE","011036M","BILLARD CLUB MOULINS"]
["CAILLON ANNE CLAIRE","159763F","ACADEMIE DE BILLARD DE CHASSIEU"]
["CALISTRI LIONEL","156114P","GROUPE SPORTIF LUGDUNUM"]
["CALYAKA ABDURRAHMAN","161059P","SAINT CHAMOND BILLARD CLUB"]
["CAMBERLIN FABIEN","012125J","CLUB DE BILLARD MONTBRISONNAIS"]
["CAO VAN TRUONG JULIEN","122563Z","GROUPE SPORTIF LUGDUNUM"]
["CARAVATI PASCAL","152780Q","BILLARD CLUB ROMANAIS PEAGEOIS"]
["CARDOT MICHEL","153644E","ACADEMIE DE BILLARD DE CHASSIEU"]
["CARENZI ROLLAND","159396G","BILLARD CLUB AIXOIS"]
["CARLIER QUENTIN","162480J","BLACKBALL BILLARD CLUB BESAYES 26"]
["CARNAT ROBERT","015983T","LE TAPIS VERT ROANNAIS"]
["CARNIATO LORENZO","107379Z","BILLARD CLUB 8 POOL EVIAN"]
["CARRERES MANUEL","152673Z","LE TAPIS VERT ROANNAIS"]
["CARRET THALLER EVELYNE","158097V","CERCLE DES CHEFS D ATELIER"]
["CARRIER JULIEN","145222M","ASSOCIATION DU LAKE PUB 74"]
["CARRION TORRES ALBERTO","156554S","CERCLE DES CHEFS D ATELIER"]
["CARRON GERARD","015822O","GROUPE SPORTIF LUGDUNUM"]
["CAS MICHEL","134297H","BILLARD CLUB GRENOBLOIS"]
["CASSIS MAXIME","108521X","BILLARD CLUB GRENOBLOIS"]
["CATIL DAVID","163092Z","LES SQUALES"]
["CATTIN LOUIS","122482W","ACADEMIE BILLARD OUEST LYONNAIS"]
["CELETTE MICHEL","143750W","BILLARD CLUB GRENOBLOIS"]
["CENDRIER DAVID","104768O","ASSOCIATION DU LAKE PUB 74"]
["CERVERA IRIS","141633L","BILLARD CLUB GRENOBLOIS"]
["CHABRAY DANIEL","107387H","BILLARD CLUB ROMANAIS PEAGEOIS"]
["CHADELAUD JEAN MICHEL","016247X","BILLARD CLUB ALBERTVILLE"]
["CHAIR MOURAD","148985Q","NIGHT BILLARD CLUB"]
["CHALAND JEAN","015728Y","CERCLE DES CHEFS D ATELIER"]
["CHAMBON PIERRE","145364Y","CLUB DE BILLARD MONTBRISONNAIS"]
["CHAMONAZ VANESSA","100904Y","BILLARD CLUB PONTOIS"]
["CHANNAUX PATRCK","149865X","BILLARD CLUB DE SAINT-GALMIER"]
["CHANTREAU DIDIER","150082H","ACADEMIE ANNECIENNE DE BILLARD"]
["CHAPATON DOMINIQUE","100834G","BILLARD CLUB 109"]
["CHAPEAUX EMILE","015813F","BILLARD CLUB DE VILLEFRANCHE"]
["CHAPON JEAN MARIE","143193L","ACADEMIE DE BILLARD DE LA VALSERINE"]
["CHAPPERT ADRIEN LUDOVIC","163543P","CLUB CHAMBERIEN DE BILLARD"]
["CHAPUT FRANCOIS","150688R","CERCLE DES CHEFS D ATELIER"]
["CHARDON JACQUES","150746E","ACADEMIE ANNECIENNE DE BILLARD"]
["CHASTAGNER PHILIPPE","157824Y","CERCLE DES CHEFS D ATELIER"]
["CHATENOUD ARNAUD","150950B","BILLARD CLUB DE CLARAFOND ARCINE"]
["CHAUMAZ SERGE","163675H","ACADEMIE ANNECIENNE DE BILLARD"]
["CHAUSSAT JEAN MARC","016054M","ACAD. DE BILLARD DE SAINT-ETIENNE"]
["CHAUVET IVAN","137566A","BILLARD CLUB ISSOIRE"]
["CHEFDEBIEN DIDIER","163547T","CERCLE DES CHEFS D ATELIER"]
["CHEMIN PIERRE","139524I","CLUB CHAMBERIEN DE BILLARD"]
["CHERPIN GUY","131290Q","LE TAPIS VERT ROANNAIS"]
["CHEUNG LANDRY","114665F","BILLARD CLUB 109"]
["CHIEZE MIREILLE","128996K","NIGHT BILLARD CLUB"]
["CHOPIN TANGUY","160807Q","ASSOCIATION DU LAKE PUB 74"]
["CIVRAIS CHRISTIAN","122570G","LE TAPIS VERT ROANNAIS"]
["CLARET GEORGES","158186R","CLUB CHAMBERIEN DE BILLARD"]
["CLARET NOEL","015712I","CERCLE DES CHEFS D ATELIER"]
["CLEMENT GERARD","143279T","CERCLE DES CHEFS D ATELIER"]
["CLEMENT JEAN LOUP","150689S","CERCLE DES CHEFS D ATELIER"]
["CLERMONT PASCAL","155702R","CLUB OMNISPORTS DE SAINT FONS"]
["CLUZEL JACQUES","107706O","BILLARD CLUB GRENOBLOIS"]
["COCHEZ FREDERIC","122770Y","CLERMONT AUVERGNE BILLARD CLUB"]
["COEURET JACQUES","015888C","A.B. DE BOURGOIN-JALLIEU"]
["COFFY JEROME","146267R","BILLARD CLUB PONTOIS"]
["COLLET JEAN CLAUDE","147331S","LE TAPIS VERT ROANNAIS"]
["COLLIER LOIC","138974E","LES SQUALES"]
["COMBAZ GUY","153539Q","CLUB CHAMBERIEN DE BILLARD"]
["COMBY CHANTAL","100977T","LA CARAMBOLE LISSILOISE"]
["COMTE MICHEL","149125S","ACADEMIE ANNECIENNE DE BILLARD"]
["CONSTANTIN JACQUES","137433X","BILLARD STELLA THONON"]
["CONTAMINE ALAIN","010957L","BILLARD CLUB MONTLUCONNAIS"]
["CORBY JEAN CLAUDE","160166T","BILLARD CLUB AIXOIS"]
["CORNET ROGER","016154I","ACADEMIE BILLARD OUEST LYONNAIS"]
["CORREIA MARC","107696E","ACADEMIE ANNECIENNE DE BILLARD"]
["CORVAISIER DOMINIQUE","140814Y","CLUB OMNISPORTS DE SAINT FONS"]
["COSNARD SEBASTIEN","145351L","BILLARD CLUB DE GAILLARD"]
["COSNIER ROMAIN","131320U","BIG BEN BLACKBALL"]
["COSTA GERARD","159237J","BILLARD CLUB AIXOIS"]
["COTTIN EMMANUEL","150468C","SAINT CHAMOND BILLARD CLUB"]
["COUMERT OLIVIER","145345F","CERCLE DES CHEFS D ATELIER"]
["COURVOISIER MYRIAM","152649Y","ACADEMIE DE BILLARD DE CHASSIEU"]
["COUSTENOBLE CHRISTOPHE","133106M","BILLARD STELLA THONON"]
["COUTAREL YVES","129879J","ACADEMIE BILLARD OUEST LYONNAIS"]
["CROIX GERARD","119734E","ACADEMIE DE BILLARD DE CHASSIEU"]
["CROS DAVID","144305F","LES SQUALES"]
["CUBIZOLLES ALAIN","122400S","CLERMONT AUVERGNE BILLARD CLUB"]
["CUBIZOLLES EVA","131904G","CLERMONT AUVERGNE BILLARD CLUB"]
["CUCCO FREDERIC","107701J","BILLARD CLUB PONTOIS"]
["CUNY ALAIN","016165T","AMICALE BILLARD CLUB DE DAVEZIEUX"]
["CUNY BERNARD","142704Q","CLUB OMNISPORTS DE SAINT FONS"]
["CURT ALAIN","131284K","BILLARD CLUB ALBERTVILLE"]
["CUZIN JACQUES","156083F","ACADEMIE BILLARD OUEST LYONNAIS"]
["DA ENCARNACAO JOSE","143275P","BILLARD CLUB 109"]
["DA SILVA JOSEPH","146345R","CLERMONT AUVERGNE BILLARD CLUB"]
["DAGNIAUX DANIEL","113580M","BILLARD STELLA THONON"]
["DALLOYEAU CHRISTIAN","015758C","BILLARD STELLA THONON"]
["DAMIER NICOLAS","105671H","BILLARD CLUB ROMANAIS PEAGEOIS"]
["DANANCIER DOMINIQUE","015730A","CERCLE DES CHEFS D ATELIER"]
["DANIEL ANDRE","137609R","ACADEMIE DE BILLARD DE CHASSIEU"]
["DARAKDJIAN CLAUDE","137613V","VALENCE BILLARD CLUB"]
["DAUBERT PATRICE","162917J","BILLARD CLUB DE VILLEFRANCHE"]
["DAVID PATRICK","016194W","Licenciés indépendants 69"]
["DE ALMEIDA DUARTE FREDERICO","146972C","BILLARD CLUB DE CLARAFOND ARCINE"]
["DE BORTOLI PATRICK","158189V","CLUB CHAMBERIEN DE BILLARD"]
["DE DOMENICO ROBERTO","141464Y","BILLARD STELLA THONON"]
["DE L ESPINAY JEAN MARC","157224W","CERCLE DES CHEFS D ATELIER"]
["DE MENA CAMILLE","156719X","CERCLE DES CHEFS D ATELIER"]
["DEBENOIT FRANCK","145373H","CLUB OMNISPORTS DE SAINT FONS"]
["DEBRAY SERGE","155357R","ACADEMIE ANNECIENNE DE BILLARD"]
["DECALF JEAN","153544W","CLUB CHAMBERIEN DE BILLARD"]
["DECLERIEUX YOAN","123645P","BILLARD CLUB LYONNAIS 8 POOL"]
["DECOMBE JEAN PIERRE","107336I","BILLARD CLUB DE VILLEFRANCHE"]
["DECROUX BERNARD","015771P","VALENCE BILLARD CLUB"]
["DEFOSSE MICHEL","016486C","LE TAPIS VERT ROANNAIS"]
["DEFRANOUX FRANCIS","152400C","BILLARD CLUB AIXOIS"]
["DEJONGHE JEAN MICHEL","110372C","BILLARD CLUB VICHY"]
["DEL MEDICO REMI","163771M","CLUB CHAMBERIEN DE BILLARD"]
["DELANGE GUY","015805X","BILLARD CLUB DE VILLEFRANCHE"]
["DELATTRE SERGE","140563H","A.B. DE BOURGOIN-JALLIEU"]
["DELEPAUT ANDRE","147555L","BILLARD CLUB DE GAILLARD"]
["DELLA BOSCA PAOLO","132952O","BILLARD CLUB 109"]
["DELORME ANDRE","122491F","ASS. SPORTIVE MUNICIPALE ST ETIENNE"]
["DELORME JOSEPH","117149T","ASS. SPORTIVE MUNICIPALE ST ETIENNE"]
["DELORME STEPHANE","127292W","BILLARD CLUB ROMANAIS PEAGEOIS"]
["DELORME STEPHANE","163504X","BILLARD CLUB LYONNAIS 8 POOL"]
["DELOUCHE ANTOINE","127765B","CLERMONT AUVERGNE BILLARD CLUB"]
["DEMARTY ALAIN","149078R","BILLARD CLUB MOULINS"]
["DEMELLAYER ALEXIS","144452W","CHARLEMAGNE SNOOKER CLUB"]
["DEMONET ANTOINE","157695H","CLUB DE BILLARD MONTBRISONNAIS"]
["DEMONET DAVID","129874E","CHARLEMAGNE SNOOKER CLUB"]
["DENIAU GEORGES","140693H","ACADEMIE ANNECIENNE DE BILLARD"]
["DENIS DANIEL","159156W","AMIC.SPOR.MONTMARAULTOISE BILLARD"]
["DENNI THIERRY","146999G","GROUPE SPORTIF LUGDUNUM"]
["DEODATI PIERRE","160681D","BILLARD CLUB ROMANAIS PEAGEOIS"]
["DEPOND DOMINIQUE","012951D","CERCLE DES CHEFS D ATELIER"]
["DEPUYDT EDDY","159235G","THE BLACK 8 POOL"]
["DEROUALLIERE JEAN MARC","122086Q","BILLARD CLUB PONTOIS"]
["DEROUEN PHILIPPE","100919N","ACADEMIE ANNECIENNE DE BILLARD"]
["DERVILLERS VINCENT","124159J","LE BLACKBALL MARSANNAIS"]
["DESBAR MAXIME","162869G","BILLARD CLUB ROMANAIS PEAGEOIS"]
["DESMIDT FRANCOIS","135458Y","CERCLE DES CHEFS D ATELIER"]
["DESPREZ SERGE","010959N","BILLARD CLUB MONTLUCONNAIS"]
["DESRAYAUD CHRISTOPHE","015939B","GROUPE SPORTIF LUGDUNUM"]
["DESSERLE GUY","131551R","LE TAPIS VERT ROANNAIS"]
["DESSERT STEPHANE","016132M","ACAD. DE BILLARD DE SAINT-ETIENNE"]
["DEVANNE FREDERIC","132887B","BILLARD CLUB GRENOBLOIS"]
["DEVEDEUX MARC","144035V","ACADEMIE BILLARD OUEST LYONNAIS"]
["DEVERGNE JEAN","117134E","CLUB CHAMBERIEN DE BILLARD"]
["DEZEMPTE MICHEL","149951Q","BILLARD CLUB DE VILLEFRANCHE"]
["DI BELLA STEPHANIE","155784F","NIGHT BILLARD CLUB"]
["DI DONATO JEAN","157320A","ACAD. DE BILLARD DE SAINT-ETIENNE"]
["DIDIER JEAN PAUL","011026C","BILLARD CLUB MOULINS"]
["DIEBLING JACQUES","163277A","ACADEMIE ANNECIENNE DE BILLARD"]
["DOMAS SOPHIE","159765H","ACADEMIE DE BILLARD DE CHASSIEU"]
["DOMINGO XAVIER","108968C","BILLARD CLUB ROMANAIS PEAGEOIS"]
["DOMINICI ALBERT","113208E","BILLARD CLUB DE SAINT-GALMIER"]
["DONATO LAURENT","146971B","ACADEMIE DE BILLARD DE LA VALSERINE"]
["DONSBECK CLAUDE","145229T","ACADEMIE DE BILLARD DE LA VALSERINE"]
["DORIER ALAIN","015743N","BILLARD CLUB ROMANAIS PEAGEOIS"]
["DORTET ALAIN","139158G","BILLARD CLUB VICHY"]
["DREME BERNARD","156425C","ACADEMIE DE BILLARD DE CHASSIEU"]
["DREVON JEANINE","160880V","GROUPE SPORTIF LUGDUNUM"]
["DRIOT JACKY","016189R","CLUB DE BILLARD MONTBRISONNAIS"]
["DUARTE JOSE","146968Y","ACADEMIE DE BILLARD DE LA VALSERINE"]
["DUBART JACQUES","100928W","LES SQUALES"]
["DUBOIS GABY","119305R","BILLARD CLUB MONTLUCONNAIS"]
["DUBROEUCQ PHILIPPE","156212W","CHARLEMAGNE SNOOKER CLUB"]
["DUBUISSON EMMA","162910B","ACADEMIE DE BILLARD DE LA VALSERINE"]
["DUDIT FABIEN","130105B","BILLARD CLUB DE BOURG EN BRESSE"]
["DUGAS GERARD","130059H","BILLARD CLUB AIXOIS"]
["DUHEM SYLVAIN","143434S","BILLARD CLUB ROMANAIS PEAGEOIS"]
["DUJOUX JEAN YVES","154985M","B.S.CLERMONTOIS"]
["DUMAS YVES","160881W","GROUPE SPORTIF LUGDUNUM"]
["DUMONT ALAIN","147111D","BILLARD CLUB AIXOIS"]
["DUMONT ALEXIS","145217H","LES SQUALES"]
["DUMOULIN LAURENT","147330R","LE TAPIS VERT ROANNAIS"]
["DUPAS GILLES","156788X","ASS. SPORTIVE MUNICIPALE ST ETIENNE"]
["DUPLOMB GUY","015992C","VALENCE BILLARD CLUB"]
["DUPONT GERARD","139528M","ACADEMIE BILLARD OUEST LYONNAIS"]
["DUPRE RAMBAUD FREDERIC","122306C","LES SQUALES"]
["DUPRE RAMBAUD NATAEL","149436F","LES SQUALES"]
["DUQUENNE RICHARD","129878I","LA CARAMBOLE LISSILOISE"]
["DURAND MICHEL","101757T","AMICALE BILLARD CLUB DE DAVEZIEUX"]
["DURET CHRISTOPHE","105704O","CLUB CHAMBERIEN DE BILLARD"]
["DUVERGER CHRISTIAN","152674A","LE TAPIS VERT ROANNAIS"]
["DUVILLARD VINCENT","162776F","CHARLEMAGNE SNOOKER CLUB"]
["DUVOISIN BAPTISTE","112524W","BILLARD CLUB 109"]
["ELAMRI JAAFAR","160859X","BILLARD CLUB 8 POOL EVIAN"]
["ELION MAURICE","129881L","ACADEMIE ANNECIENNE DE BILLARD"]
["ESPINOSA SEBASTIEN","155523X","BILLARD CLUB PONTOIS"]
["ETAIX ROBERT","122469J","ACADEMIE BILLARD OUEST LYONNAIS"]
["FACHE JEAN PAUL","129027P","BILLARD CLUB ISSOIRE"]
["FADILI YOUSSEF","159685W","BILLARD CLUB LYONNAIS 8 POOL"]
["FALLOT EYMERIC","160682E","VALENCE BILLARD CLUB"]
["FANZONE JEAN CLAUDE","146110Q","BILLARD CLUB GRENOBLOIS"]
["FAOUEN PATRICK","159612R","ACADEMIE BILLARD OUEST LYONNAIS"]
["FAURE COMTE HENRI","016166U","AMICALE BILLARD CLUB DE DAVEZIEUX"]
["FAURE ELIE","157172P","B.S.CLERMONTOIS"]
["FAURE GILLES","161148L","ACADEMIE ANNECIENNE DE BILLARD"]
["FAVENTIN JACQUES","146947A","BILLARD CLUB DE VILLEFRANCHE"]
["FAVIER MICHEL","016064W","LA CARAMBOLE LISSILOISE"]
["FAYOLLE GUY","162697V","A.B. DE BOURGOIN-JALLIEU"]
["FELIX RENE","159809F","ACADEMIE DE BILLARD DE CHASSIEU"]
["FERNANDES BENJAMIN","163075F","ACADEMIE DE BILLARD DE CHASSIEU"]
["FERNANDES PASCAL","126053F","A.B. DE BOURGOIN-JALLIEU"]
["FERNANDEZ ALPHONSE","129892W","BILLARD CLUB GRENOBLOIS"]
["FERNANDEZ HERRERA GUY","160181K","CLUB OMNISPORTS DE SAINT FONS"]
["FERNANDEZ JOSE","011128A","B.S.CLERMONTOIS"]
["FERON PATRICK","104537R","CERCLE DES CHEFS D ATELIER"]
["FERRATON MICHEL","117218K","ACAD. DE BILLARD DE SAINT-ETIENNE"]
["FERRE JEAN PAUL","016108O","BILLARD CLUB SAINT ROMANAIS"]
["FERREOL EMILE","129896A","BILLARD CLUB DE SAINT-GALMIER"]
["FERRIOL DOMINIQUE","100873T","BILLARD CLUB DE VILLEFRANCHE"]
["FESQUET EMILIE","156703E","BILLARD CLUB PONTOIS"]
["FETTIG SEVERINE","152575S","SAINT CHAMOND BILLARD CLUB"]
["FEUILLASTRE ALAIN","119746Q","CLUB DE BILLARD MONTBRISONNAIS"]
["FLEURY MICHEL","016070C","CLUB OMNISPORTS DE SAINT FONS"]
["FLORET DOMINIQUE","160972V","LA CARAMBOLE LISSILOISE"]
["FLORIAN DENIS","015524C","CLUB DE BILLARD MONTBRISONNAIS"]
["FLUTTAZ JEAN LOUIS","142709V","ACADEMIE ANNECIENNE DE BILLARD"]
["FONGARNAND DIDIER","013137H","B.S.CLERMONTOIS"]
["FORCE STEPHANE","129018G","B.S.CLERMONTOIS"]
["FORISSIER LOUIS","137718W","BILLARD CLUB DE SAINT-GALMIER"]
["FORTE INOUK","154341M","ACAD. DE BILLARD DE SAINT-ETIENNE"]
["FORTE LOIC","156793C","ACAD. DE BILLARD DE SAINT-ETIENNE"]
["FORTE YORI","154340L","ACAD. DE BILLARD DE SAINT-ETIENNE"]
["FOULTIER JACKY","160912E","AMIC.SPOR.MONTMARAULTOISE BILLARD"]
["FOURNIER CLAUDIUS","121518U","BILLARD CLUB MOULINS"]
["FOURNIER JEAN","153988D","ACADEMIE ANNECIENNE DE BILLARD"]
["FOURRE NICOLAS","104920K","CLERMONT AUVERGNE BILLARD CLUB"]
["FRAGNE MARCEL","137719X","BILLARD CLUB DE SAINT-GALMIER"]
["FRAIX STEVE","145120O","CLUB CHAMBERIEN DE BILLARD"]
["FRANCE FERNAND","145114I","BILLARD CLUB DE SAINT-GALMIER"]
["FRANCOIS DIDIER","156122Y","CLUB CHAMBERIEN DE BILLARD"]
["FRAPPA DIDIER","145514S","AMICALE BILLARD CLUB DE DAVEZIEUX"]
["FRECHET JULIEN","159648F","BILLARD CLUB GRENOBLOIS"]
["FRIZON JONATHAN","163600B","ACADEMIE DE BILLARD DE LA VALSERINE"]
["FROMENT ALAIN","131653P","AMIC.SPOR.MONTMARAULTOISE BILLARD"]
["FUENTES CHRISTINE","145221L","ACADEMIE DE BILLARD DE LA VALSERINE"]
["FUENTES RICARDO","136034C","ACADEMIE DE BILLARD DE LA VALSERINE"]
["FURTAK ROLAND","160882X","GROUPE SPORTIF LUGDUNUM"]
["GALLAND GREGORY","013178W","ACADEMIE BILLARD OUEST LYONNAIS"]
["GALLO MICHEL","015760E","BILLARD CLUB GRENOBLOIS"]
["GALLON JEAN CLAUDE","140821F","Licenciés indépendants 63"]
["GALLOT RUDY","149257L","CLUB DE BILLARD MONTBRISONNAIS"]
["GALTIER JEAN LUC","157702Q","ACADEMIE DE BILLARD DE LA VALSERINE"]
["GAMET DOMINIQUE","155163F","ACADEMIE ANNECIENNE DE BILLARD"]
["GAPAILLARD ALAIN","163297X","ACADEMIE DE BILLARD DE LA VALSERINE"]
["GARCIA JUAN","147000H","GROUPE SPORTIF LUGDUNUM"]
["GARNIER NICOLAS","145371F","BILLARD CLUB DE BOURG EN BRESSE"]
["GARNIER PATRICE","139477N","CERCLE DES CHEFS D ATELIER"]
["GAUCHER JEAN FRANCOIS","100870Q","CLUB OMNISPORTS DE SAINT FONS"]
["GAUZE GILBERT","149126T","ACADEMIE ANNECIENNE DE BILLARD"]
["GEINDRE BENJAMIN","155794R","BIG BEN BLACKBALL"]
["GELIBERT ALEXIS","159122J","ACADEMIE DE BILLARD DE LA VALSERINE"]
["GELIBERT MARGAUX","159123K","ACADEMIE DE BILLARD DE LA VALSERINE"]
["GELOFFIER MAURICE","147332T","LE TAPIS VERT ROANNAIS"]
["GENAUDET FLORIAN","155838P","BILLARD CLUB 8 POOL EVIAN"]
["GENEVRIER GERARD","132972I","BILLARD CLUB SAINT ROMANAIS"]
["GERLAT MAGALY","145518W","LES SQUALES"]
["GHOMINEJAD KEYVAN","156213X","CHARLEMAGNE SNOOKER CLUB"]
["GIACOMARRA ENZO","153804D","CHARLEMAGNE SNOOKER CLUB"]
["GIEN DOMINIQUE","157758B","ACADEMIE BILLARD OUEST LYONNAIS"]
["GILARDIN JACQUES","147591A","BILLARD CLUB MOULINS"]
["GILARDIN SEBASTIEN","149637Z","BILLARD CLUB MOULINS"]
["GILLET FREDERIC","157321B","ACAD. DE BILLARD DE SAINT-ETIENNE"]
["GILLON JEAN CLAUDE","134037H","BILLARD CLUB MOULINS"]
["GIRARD FREDERIC","149917D","BILLARD CLUB 8 POOL EVIAN"]
["GIRARDON ROLAND","163345Z","LA CARAMBOLE LISSILOISE"]
["GIRAUD JACQUES","124121X","CERCLE DES CHEFS D ATELIER"]
["GIRON STEPHANIE","134035F","B.S.CLERMONTOIS"]
["GOLDBACH ERIC","147619F","ACADEMIE DE BILLARD D AUBENAS"]
["GOMBERT MARTIN","163117B","BILLARD CLUB ROMANAIS PEAGEOIS"]
["GONZALEZ BORIS","143533N","ACADEMIE BILLARD OUEST LYONNAIS"]
["GORLIER ROLAND","153015W","CERCLE DES CHEFS D ATELIER"]
["GOSSUIN JUSTINE","155699N","BILLARD CLUB DE CLARAFOND ARCINE"]
["GOSTIAUX JEAN","153660X","CERCLE DES CHEFS D ATELIER"]
["GOSTIAUX LOUIS","145344E","CERCLE DES CHEFS D ATELIER"]
["GOSTIAUX LUCIEN","160444W","CERCLE DES CHEFS D ATELIER"]
["GOSTIAUX MEZIANE","151767P","CERCLE DES CHEFS D ATELIER"]
["GOUBET LIONEL","153303J","ACADEMIE BILLARD OUEST LYONNAIS"]
["GOURDIN MICHEL","107633T","CLUB OMNISPORTS DE SAINT FONS"]
["GOUTALOY SYLVAIN","016318Q","CERCLE DES CHEFS D ATELIER"]
["GOUTTE LYDIE","155903K","BILLARD CLUB PONTOIS"]
["GOYENETCHE RAMUNTCHO","160060D","ACADEMIE DE BILLARD DE CHASSIEU"]
["GOYENETCHE STEPHANE","159850A","ACADEMIE DE BILLARD DE CHASSIEU"]
["GRACI BUSI RAYMOND","132521Z","ACADEMIE DE BILLARD DE CHASSIEU"]
["GREGOIRE PHILIPPE","138328I","BILLARD CLUB ROMANAIS PEAGEOIS"]
["GRESLE JEAN MICHEL","136412Q","BILLARD CLUB MONTLUCONNAIS"]
["GRI ALEXANDRE","155129T","SAINT CHAMOND BILLARD CLUB"]
["GRIFFON GILLES","159157X","AMIC.SPOR.MONTMARAULTOISE BILLARD"]
["GRIMM PATRICK","146269T","ACADEMIE DE BILLARD DE LA VALSERINE"]
["GRIOT GILBERT","145370E","CLUB DE BILLARD MONTBRISONNAIS"]
["GROS ERIC","145231V","ASSOCIATION DU LAKE PUB 74"]
["GROS MARC","137714S","ACADEMIE BILLARD OUEST LYONNAIS"]
["GROS MARCEL","150176K","ACADEMIE DE BILLARD DE CHASSIEU"]
["GROSJEAN JEAN","136093J","BILLARD CLUB AIXOIS"]
["GROSJEAN THIERRY","143892I","CLUB CHAMBERIEN DE BILLARD"]
["GRUET BERNARD","156507R","BILLARD CLUB ISSOIRE"]
["GUENET LAURENT","016410E","ACADEMIE BILLARD OUEST LYONNAIS"]
["GUERRIERI VITTORIO","156824L","ASS. SPORTIVE MUNICIPALE ST ETIENNE"]
["GUIHEUX DENIS","010669J","BILLARD CLUB GRENOBLOIS"]
["GUILBAUD JEAN CLAUDE","105785R","BLACKBALL BILLARD CLUB BESAYES 26"]
["GUILBAUD ROMAIN","105784Q","BLACKBALL BILLARD CLUB BESAYES 26"]
["GUILLAUMOND ALAIN","145124S","SAINT CHAMOND BILLARD CLUB"]
["GUILLEMIN CLAUDE","153545X","CLUB CHAMBERIEN DE BILLARD"]
["GUILLOT CLAUDE","132533L","BILLARD CLUB DE LA PLAINE DU FOREZ"]
["GUILLOT PIERRE","140689D","CLUB DE BILLARD MONTBRISONNAIS"]
["GUILLOT SAMUEL","162475D","THE BLACK 8 POOL"]
["GUILLOUD JEAN JACQUES","016128I","ACADEMIE DE BILLARD DE CHASSIEU"]
["GUIRI BAHAEDDINE","163507A","BILLARD CLUB DE SAINT-GALMIER"]
["HAAS DOMINIQUE","156663L","BILLARD CLUB DE SAINT-GALMIER"]
["HAINAUT DAVID","155834K","ACADEMIE DE BILLARD DE LA VALSERINE"]
["HALLIER FLORIAN","155628L","ASSOCIATION DU LAKE PUB 74"]
["HANNOU RACHID","145227R","BILLARD CLUB DE GAILLARD"]
["HANTZ MICHEL","147113F","BILLARD CLUB AIXOIS"]
["HARE ROBERT","158395T","BILLARD CLUB MONTLUCONNAIS"]
["HAYEM PATRICK","119307T","BILLARD CLUB MOULINS"]
["HEBERT ALAIN","015926O","BILLARD CLUB ROMANAIS PEAGEOIS"]
["HEDOUIN HENRI","163670C","BILLARD CLUB AIXOIS"]
["HELIN ALAIN","015815H","BILLARD CLUB DE VILLEFRANCHE"]
["HENRIQUES VICTOR","162919L","BILLARD CLUB DE VILLEFRANCHE"]
["HERREMAN FRANCOIS","137571F","LES SQUALES"]
["HERRY MIREILLE","152190Z","NIGHT BILLARD CLUB"]
["HERVY CHRISTIAN","163677K","ACADEMIE ANNECIENNE DE BILLARD"]
["HILAIRE JIMMY","137050E","ACADEMIE BILLARD OUEST LYONNAIS"]
["HISIGER CHARLOTTE","158397W","NIGHT BILLARD CLUB"]
["HISIGER KELLY","156933E","NIGHT BILLARD CLUB"]
["HOGG JEAN CLAUDE","142694G","CLUB DE BILLARD MONTBRISONNAIS"]
["HONG LAMHONG ALEXANDRE","112520S","CLUB OMNISPORTS DE SAINT FONS"]
["HONG LAMHONG PIERRE","100883D","SAINT CHAMOND BILLARD CLUB"]
["HORARD BRIEUC","163190F","LES SQUALES"]
["HOSROFIAN EDMOND","153143K","CLUB OMNISPORTS DE SAINT FONS"]
["HOYER GILLES","016152G","CLUB OMNISPORTS DE SAINT FONS"]
["HUE PHILIPPE","159168J","BILLARD CLUB AIXOIS"]
["ICARD ANDRE","015717N","ACADEMIE DE BILLARD DE CHASSIEU"]
["IGLESIA PIERRE","160576P","BLACKBALL BILLARD CLUB BESAYES 26"]
["IMBERT JEAN PAUL","137708M","LA CARAMBOLE LISSILOISE"]
["ISMALAJ YLBER","159866S","BILLARD CLUB 109"]
["IZOULET SIMON","131907J","THE BLACK 8 POOL"]
["JACOB BERNARD","146254E","CLUB CHAMBERIEN DE BILLARD"]
["JACOBERGER FABIEN","119290C","BILLARD CLUB VICHY"]
["JACOBY HENRIK","102689P","ASSOCIATION DU LAKE PUB 74"]
["JACOULOT CHRISTIAN","163728Q","ACADEMIE DE BILLARD DE CHASSIEU"]
["JACQUEMART MICKAEL","149406Y","BIG BEN BLACKBALL"]
["JACQUIN JEROME","162800G","CLUB DE BILLARD MONTBRISONNAIS"]
["JACQUIN LOUIS","162801H","CLUB DE BILLARD MONTBRISONNAIS"]
["JANOIR ERIC","101069H","BILLARD CLUB 109"]
["JAPIOT HUBERT","156124A","ACADEMIE DE BILLARD DE CHASSIEU"]
["JARDIN GERARD","015878S","BILLARD CLUB AIXOIS"]
["JARRET ANDRE","139455R","ACADEMIE DE BILLARD DE CHASSIEU"]
["JEANTET JEAN CLAUDE","159482A","ACADEMIE DE BILLARD DE LA VALSERINE"]
["JOFFRE MARC","136095L","AMICALE BILLARD CLUB DE DAVEZIEUX"]
["JOUBERT ERIC","160742V","BILLARD CLUB MONTLUCONNAIS"]
["JOUVE SAMUEL","101070I","BILLARD CLUB 109"]
["JULLIAT GUILLAUME","141631J","AMICALE BILLARD CLUB DE DAVEZIEUX"]
["JULLIAT VINCENT","016161P","AMICALE BILLARD CLUB DE DAVEZIEUX"]
["JULLION ANDRE","147356V","AMICALE BILLARD CLUB DE DAVEZIEUX"]
["KAABECHE RIAD","163595W","NIGHT BILLARD CLUB"]
["KEBE MAMADOU","162803K","CLUB CHAMBERIEN DE BILLARD"]
["KERLEAUX JEAN CLAUDE","142700M","BILLARD CLUB DE VILLEFRANCHE"]
["KLEIN JEAN LUC","142184Q","CLUB DE BILLARD MONTBRISONNAIS"]
["KLEIN STEPHANE","148984P","NIGHT BILLARD CLUB"]
["KOBYLANSKI ROMAIN","143742O","BILLARD CLUB GRENOBLOIS"]
["KOCAURLU YAVUZ","127300E","ACADEMIE DE BILLARD DE CHASSIEU"]
["KOFFI JUSTHE","101020K","ACADEMIE ANNECIENNE DE BILLARD"]
["KONIECZNY FABRICE","135452S","CERCLE DES CHEFS D ATELIER"]
["KOWACKI JEAN PIERRE","146949C","BILLARD CLUB DE VILLEFRANCHE"]
["KUHN JAMES","162698W","A.B. DE BOURGOIN-JALLIEU"]
["KURADJIAN ALAIN","145123R","SAINT CHAMOND BILLARD CLUB"]
["KURTZ RENE","145614O","BILLARD CLUB AIXOIS"]
["KUSAR HERVE","152914L","BILLARD CLUB DE CLARAFOND ARCINE"]
["KUSAR TONY","155700P","BILLARD CLUB DE CLARAFOND ARCINE"]
["LACAUX TAFFOUREAU STEPHANE","163164C","CERCLE DES CHEFS D ATELIER"]
["LACHAUX BERNARD","156918N","LE TAPIS VERT ROANNAIS"]
["LACOMBE JEAN MARIE","011067R","BILLARD CLUB ST ELOY"]
["LACORNE DIDIER","156828Q","ASS. SPORTIVE MUNICIPALE ST ETIENNE"]
["LACROIX DANIEL","015732C","ACADEMIE BILLARD OUEST LYONNAIS"]
["LACROIX DYLAN","152192B","NIGHT BILLARD CLUB"]
["LAFORET EDOUARD","126033L","ASSOCIATION DU LAKE PUB 74"]
["LAITHIER GERARD","158191X","CLUB CHAMBERIEN DE BILLARD"]
["LAIYADI NABIL","112387P","BLACKBALL BILLARD CLUB BESAYES 26"]
["LAMAT OLIVIER","129029R","THE BLACK 8 POOL"]
["LAMAT PAUL","155788K","THE BLACK 8 POOL"]
["LAMRANI MEHDI","159769M","BILLARD CLUB PONTOIS"]
["LANDAIS JEAN CLAUDE","157556G","BILLARD CLUB MOULINS"]
["LANDOT LAURENCE","155161D","ACADEMIE ANNECIENNE DE BILLARD"]
["LAPORTE VALENTIN","163735Y","BIG BEN BLACKBALL"]
["LARDEREAU ROBERT","145369D","CLUB DE BILLARD MONTBRISONNAIS"]
["LARESE PATRICK","147485K","ACADEMIE DE BILLARD DE CHASSIEU"]
["LARIVE JANY","138403F","BILLARD CLUB BOURBON"]
["LASSERON CYRIL","135589Z","CLERMONT AUVERGNE BILLARD CLUB"]
["LATORRE ANDRE","101047L","LES SQUALES"]
["LAURENT DANIEL","163316S","CERCLE DES CHEFS D ATELIER"]
["LAURENT JEAN LUC","015957T","ACADEMIE DE BILLARD DE CHASSIEU"]
["LAURETTA JOSEPH","015761F","BILLARD CLUB GRENOBLOIS"]
["LAURIER GILLES","141637P","ACADEMIE BILLARD OUEST LYONNAIS"]
["LAVAUD JACQUES","128479N","LE TAPIS VERT ROANNAIS"]
["LAVAUD JEAN MICHEL","015733D","ACADEMIE BILLARD OUEST LYONNAIS"]
["LAVAURS BERNARD","159908N","ACADEMIE DE BILLARD DE LA VALSERINE"]
["LAZEREG RADIL","119728Y","LES SQUALES"]
["LE BRIS STEPHAN","136272G","BILLARD STELLA THONON"]
["LE CALLET JEAN LOUIS","158893K","SAINT CHAMOND BILLARD CLUB"]
["LE GOFF THIERRY","160236V","NIGHT BILLARD CLUB"]
["LEBLANC FRANCK","155130V","SAINT CHAMOND BILLARD CLUB"]
["LEBRAY ANNICK","137838M","CLUB CHAMBERIEN DE BILLARD"]
["LECLERCQ FREDERIC","016086S","BILLARD CLUB DE GAILLARD"]
["LECLERCQ MICHEL","150752L","ACADEMIE ANNECIENNE DE BILLARD"]
["LECONNETABLE CLAUDE","137588W","CLUB DE BILLARD MONTBRISONNAIS"]
["LECROIX FRANCIS","107510A","B.S.CLERMONTOIS"]
["LEFEBVRE SERGE","010984M","BILLARD CLUB BOURBON"]
["LEGUILLON PATRICK","105408E","BILLARD CLUB VICHY"]
["LELOUP ALAIN","137589X","CLUB DE BILLARD MONTBRISONNAIS"]
["LEMAIRE ALBERT","013561P","BILLARD CLUB GRENOBLOIS"]
["LEPAGE PATRICK","145661J","CLERMONT AUVERGNE BILLARD CLUB"]
["LEPETIT FRANCOIS","145122Q","SAINT CHAMOND BILLARD CLUB"]
["LESCARMONTIER JACQUES","107390K","ACADEMIE BILLARD OUEST LYONNAIS"]
["LESKOVSEK LAURENT","101027R","LE BLACKBALL MARSANNAIS"]
["LETOURNEUR SEBASTIEN","135922U","BILLARD CLUB DE BOURG EN BRESSE"]
["LHERMINIER THIERRY","126050C","BILLARD CLUB ALBERTVILLE"]
["LHOMME SYLVAIN","160905X","ACADEMIE DE BILLARD D AUBENAS"]
["LHUILLIER DANIEL","150870P","BILLARD CLUB PONTOIS"]
["LIBON VICTOR","112506E","AMICALE BILLARD CLUB DE DAVEZIEUX"]
["LIOMIN BENOIT","162914F","BILLARD CLUB DE GAILLARD"]
["LIVEBARDON SONIA","112600U","ACAD. DE BILLARD DE SAINT-ETIENNE"]
["LOBOS MALDONANO OMAR","100932A","BILLARD CLUB PONTOIS"]
["LOCCI OLIVIER","150253T","BILLARD CLUB 109"]
["LOMBREZ FREDERIC","151332R","CHARLEMAGNE SNOOKER CLUB"]
["LONGEREY CHRISTELLE","134285V","ACADEMIE ANNECIENNE DE BILLARD"]
["LORON ANDRE","016031P","LE TAPIS VERT ROANNAIS"]
["LORON LOUIS","016050I","ACAD. DE BILLARD DE SAINT-ETIENNE"]
["LORTHIOIS JOHN","124461Z","BILLARD CLUB ISSOIRE"]
["LUJAN PIERRE","154202L","BILLARD CLUB ROMANAIS PEAGEOIS"]
["LUPO VITO","163159X","CLUB CHAMBERIEN DE BILLARD"]
["MABON CELINE","159910Q","CLUB OMNISPORTS DE SAINT FONS"]
["MADEIRA FERNANDO","146266Q","ACADEMIE DE BILLARD DE LA VALSERINE"]
["MAESTRI ROBERT","137611T","ACADEMIE ANNECIENNE DE BILLARD"]
["MAGNIN JEAN PIERRE","016205H","BILLARD CLUB PONTOIS"]
["MAHE GUILLAUME","130312A","BILLARD CLUB 8 POOL EVIAN"]
["MAILLARD RENE","147149V","BILLARD CLUB DE VILLEFRANCHE"]
["MAILLARD SERGE","128074Y","BILLARD CLUB ST ELOY"]
["MAISONNEUVE LAURENT","124575J","BILLARD CLUB DE VILLEFRANCHE"]
["MAISSE ROBERT","146950D","BILLARD CLUB DE VILLEFRANCHE"]
["MAISSE ROBERT","147398Q","AMICALE BILLARD CLUB DE DAVEZIEUX"]
["MALGOUYARD JEAN PIERRE","147110C","BILLARD CLUB AIXOIS"]
["MANDALLAZ GERARD","015793L","ACADEMIE ANNECIENNE DE BILLARD"]
["MANDY NATHALIE","135919R","BILLARD CLUB DE BOURG EN BRESSE"]
["MANET DOMINIQUE","147525D","ASS. SPORTIVE MUNICIPALE ST ETIENNE"]
["MANIN GUY","163268Q","ACAD. DE BILLARD DE SAINT-ETIENNE"]
["MARCELLIER JOSETTE","160884Z","GROUPE SPORTIF LUGDUNUM"]
["MARCHICA IGOR","107687V","BILLARD CLUB 109"]
["MARECHAL JACQUES","137586U","CLUB DE BILLARD MONTBRISONNAIS"]
["MARIN GUY","144450U","BILLARD CLUB DE GAILLARD"]
["MARION GERARD","159842R","ACAD. DE BILLARD DE SAINT-ETIENNE"]
["MARKADAS TITUS","109013V","CLUB CHAMBERIEN DE BILLARD"]
["MARLET PATRICK","146970A","ACADEMIE DE BILLARD DE LA VALSERINE"]
["MARLIER CHARLES","142710W","ACADEMIE DE BILLARD DE CHASSIEU"]
["MARLIER JEAN","155848A","ACADEMIE DE BILLARD DE CHASSIEU"]
["MARMET JEAN MARIE","155164G","ACADEMIE ANNECIENNE DE BILLARD"]
["MARMIESSE JEAN","016315N","CERCLE DES CHEFS D ATELIER"]
["MARON ALAIN","159766J","ACADEMIE DE BILLARD DE CHASSIEU"]
["MARTELLONI GUY","111359B","ACADEMIE BILLARD OUEST LYONNAIS"]
["MARTIN ALAIN","155616Y","BILLARD CLUB BOURBON"]
["MARTIN JEAN PAUL","163512F","CERCLE DES CHEFS D ATELIER"]
["MARTIN OLIVIER","010985N","BILLARD CLUB ST ELOY"]
["MARTINEZ SERGE","153695K","ACADEMIE DE BILLARD DE CHASSIEU"]
["MARTINEZ YOANN","157879H","EIGHT'S POOL GAME"]
["MARTRAIX GERARD","160562Z","ACADEMIE ANNECIENNE DE BILLARD"]
["MASCLET ERIC","107411F","BILLARD CLUB 109"]
["MASSELOT CEDRIC","162524G","BILLARD CLUB ISSOIRE"]
["MASSON ERIC","120680O","BILLARD CLUB PONTOIS"]
["MASSON JOEL","016157L","BILLARD CLUB SAINT ROMANAIS"]
["MATHIOT PHILIPPE","100914I","ACADEMIE ANNECIENNE DE BILLARD"]
["MATRAS JEAN MARIE","101044I","BILLARD CLUB ROMANAIS PEAGEOIS"]
["MAUBLANC HERVE","143198Q","GROUPE SPORTIF LUGDUNUM"]
["MAUCUIT CLAUDE","156644Q","ACADEMIE DE BILLARD DE CHASSIEU"]
["MAUDUIT DAVID","163116A","BILLARD CLUB ROMANAIS PEAGEOIS"]
["MEDINA TOMAS","147001J","GROUPE SPORTIF LUGDUNUM"]
["MEJEAN JACQUES","130074W","ACAD. DE BILLARD DE SAINT-ETIENNE"]
["MENS THOMAS","121499B","CLERMONT AUVERGNE BILLARD CLUB"]
["MERLE JEAN FRANCOIS","147074N","GROUPE SPORTIF LUGDUNUM"]
["MERLE MICHEL","016484A","BILLARD CLUB DE VILLEFRANCHE"]
["MERMET JACQUES","100893N","CLUB CHAMBERIEN DE BILLARD"]
["MERMOZ THIERRY","103610A","CLERMONT AUVERGNE BILLARD CLUB"]
["MERMOZ TONY","104740M","CLERMONT AUVERGNE BILLARD CLUB"]
["MESNIER JEAN CLAUDE","133199B","ACADEMIE DE BILLARD DE LA VALSERINE"]
["MEUNIER MARC","015816I","BILLARD CLUB DE VILLEFRANCHE"]
["MEUNIER PHILIPPE","129017F","BILLARD CLUB VICHY"]
["MEVEL HERVE","015735F","CERCLE DES CHEFS D ATELIER"]
["MICHAUD LUC","160174C","BILLARD CLUB DE BOURG EN BRESSE"]
["MICHEL DENIS","153538P","CLUB CHAMBERIEN DE BILLARD"]
["MIDROUILLET PATRICK","010960O","BILLARD CLUB MONTLUCONNAIS"]
["MIKDAD ALI MOHAMMED","016352Y","CERCLE DES CHEFS D ATELIER"]
["MILLET MAURICE","154733N","CERCLE DES CHEFS D ATELIER"]
["MINACORI JULIEN","016433B","CERCLE DES CHEFS D ATELIER"]
["MINARDI ALAIN","157326G","GROUPE SPORTIF LUGDUNUM"]
["MIRONNEAU ERIC","153351L","BILLARD CLUB ST ELOY"]
["MIRTO EVELYNE","156415R","NIGHT BILLARD CLUB"]
["MITEAU MICHEL","119308U","BILLARD CLUB MOULINS"]
["MOINE ROBERT","011049Z","B.S.CLERMONTOIS"]
["MOLLE ALBAN","101029T","LES SQUALES"]
["MONIER BERNARD","124587V","LE TAPIS VERT ROANNAIS"]
["MONNERET MARC","138180Q","BILLARD CLUB DE VILLEFRANCHE"]
["MONNEYRAC KEVIN","123794I","BILLARD CLUB DE GAILLARD"]
["MONTEL MAURICE","016109P","BILLARD CLUB SAINT ROMANAIS"]
["MONTMAYEUR FRANCOIS","143894K","CHARLEMAGNE SNOOKER CLUB"]
["MONTPELLIER BRUNO","149875H","BILLARD CLUB 8 POOL EVIAN"]
["MOREAUX PATRICE","159951K","ACADEMIE ANNECIENNE DE BILLARD"]
["MOREIRA ALBERTO","159263M","CLERMONT AUVERGNE BILLARD CLUB"]
["MOREIRA LEONARDO","162200E","CLERMONT AUVERGNE BILLARD CLUB"]
["MOREL FLORENT","150953E","BILLARD CLUB DE CLARAFOND ARCINE"]
["MOREL SYLVAIN","152633F","NIGHT BILLARD CLUB"]
["MORET GERARD","156145Y","BILLARD CLUB DE VILLEFRANCHE"]
["MORIN ANTHONY","126041T","BILLARD CLUB 109"]
["MORLIN GUY","135928A","CLUB DE BILLARD MONTBRISONNAIS"]
["MOSSE PAUL","119786E","ACADEMIE BILLARD OUEST LYONNAIS"]
["MOUGIN NICOLAS","137576K","BILLARD CLUB 109"]
["MOUGIN PIERRE","163262J","ACADEMIE DE BILLARD DE CHASSIEU"]
["MOULARD ANDRE","129872C","BILLARD CLUB DE LA PLAINE DU FOREZ"]
["MOUNIER ARMAND","016168W","CLUB DE BILLARD MONTBRISONNAIS"]
["MOUTMIR HAMZA","144945V","CLERMONT AUVERGNE BILLARD CLUB"]
["MOUTON ALAIN","157225X","CERCLE DES CHEFS D ATELIER"]
["MULA ANTOINE","153142J","CLUB OMNISPORTS DE SAINT FONS"]
["MULLER SYLVAIN","122566C","CHARLEMAGNE SNOOKER CLUB"]
["MUNOZ ROMAIN","139035N","CLUB CHAMBERIEN DE BILLARD"]
["MURANTE SYLVIO","104678C","BILLARD CLUB 8 POOL EVIAN"]
["MUSSET OLIVIER","103682U","BILLARD CLUB PONTOIS"]
["MUZEAU PATRICK","015851R","BILLARD CLUB ROMANAIS PEAGEOIS"]
["NAKANO LAURENT","119332S","BILLARD CLUB LYONNAIS 8 POOL"]
["NARJOUX MICHEL","151982Y","ACADEMIE BILLARD OUEST LYONNAIS"]
["NAVEL ANGELIQUE","162464R","BILLARD CLUB PONTOIS"]
["NEBOIT OLIVIER","101038C","LE BLACKBALL MARSANNAIS"]
["NGUYEN MICHEL","138325F","NIGHT BILLARD CLUB"]
["NIBAULT CLAUDE","146544I","BILLARD CLUB DE GAILLARD"]
["NICOLAS PIERRE","107707P","BILLARD CLUB GRENOBLOIS"]
["NOEL ROLAND","149690G","ACADEMIE DE BILLARD DE LA VALSERINE"]
["NOUTS CLAUDE","130071T","B.S.CLERMONTOIS"]
["ODOUARD DANIEL","117673X","BILLARD CLUB ROMANAIS PEAGEOIS"]
["OGIER STEPHANE","147707B","CHARLEMAGNE SNOOKER CLUB"]
["OLLIVIER FRANCK","143526G","LE TAPIS VERT ROANNAIS"]
["ORENES LERMA JACKY","155904L","BILLARD CLUB PONTOIS"]
["ORSAL SERGE","154378C","ACADEMIE ANNECIENNE DE BILLARD"]
["OTHMANI SAIF EDDINE","138986Q","BILLARD CLUB LYONNAIS 8 POOL"]
["OUZEAU VINCENT","124310E","CLUB CHAMBERIEN DE BILLARD"]
["OX KOSTA","119127V","ACADEMIE DE BILLARD D AUBENAS"]
["OYONARTE GERARD","162867E","BILLARD CLUB ROMANAIS PEAGEOIS"]
["PACE MICHEL","011051B","B.S.CLERMONTOIS"]
["PAGES BERTRAND","153140G","CHARLEMAGNE SNOOKER CLUB"]
["PAGNAN ALBERT","112499X","ASS. SPORTIVE MUNICIPALE ST ETIENNE"]
["PALADEL NEIL","155510H","BILLARD STELLA THONON"]
["PALETTE FABRICE","116718E","BILLARD CLUB 109"]
["PALOMBO ENZO","015956S","ACADEMIE DE BILLARD DE CHASSIEU"]
["PANTEL BERNARD","101010A","A.B. DE BOURGOIN-JALLIEU"]
["PAPET PATRICK","163046Z","ACADEMIE DE BILLARD DE CHASSIEU"]
["PAPILLON FREDERIC","107365L","VALENCE BILLARD CLUB"]
["PAPIN LAETITIA","119744O","LE BLACKBALL MARSANNAIS"]
["PAQUIEN JEAN MICHEL","015762G","CLUB CHAMBERIEN DE BILLARD"]
["PARDO RAMON","158398X","NIGHT BILLARD CLUB"]
["PARMENTIER TEDDY","152146B","BLACKBALL BILLARD CLUB BESAYES 26"]
["PASTOR BRUNO","102280W","BILLARD CLUB DE GAILLARD"]
["PATTY ALAIN","116303F","ACADEMIE ANNECIENNE DE BILLARD"]
["PAUFIQUE JEAN PAUL","155907P","GROUPE SPORTIF LUGDUNUM"]
["PAUVERT JEAN LOUIS","150007B","BILLARD CLUB ROMANAIS PEAGEOIS"]
["PEDAT CHRISTELLE","127241X","BILLARD CLUB 8 POOL EVIAN"]
["PEDROTTI LIONEL","162930Y","BILLARD CLUB ROMANAIS PEAGEOIS"]
["PENDZIALEK CHRISTIAN","113890K","BILLARD STELLA THONON"]
["PENNEC JEAN CLAUDE","153046E","CERCLE DES CHEFS D ATELIER"]
["PERBET ELIOT","160163Q","BILLARD CLUB LYONNAIS 8 POOL"]
["PERES CLAUDE","015936Y","Licenciés indépendants 69"]
["PEREZ RAYMOND","124581P","CHARLEMAGNE SNOOKER CLUB"]
["PERICAUD ROLAND","157347E","VALENCE BILLARD CLUB"]
["PERILLAT WEIBERG PATRICIA","148472H","CERCLE DES CHEFS D ATELIER"]
["PERILLAT YVES","139580M","CERCLE DES CHEFS D ATELIER"]
["PERRET LOUISE","162802J","CLUB DE BILLARD MONTBRISONNAIS"]
["PERRET OLIVIER","145636K","CLUB DE BILLARD MONTBRISONNAIS"]
["PERRET RICHARD","145631F","CLUB DE BILLARD MONTBRISONNAIS"]
["PERRIER GERARD","152573Q","SAINT CHAMOND BILLARD CLUB"]
["PERROUX DENIS","016459B","LA CARAMBOLE LISSILOISE"]
["PERUS ERIC ALAIN","163132S","LES SQUALES"]
["PESSIA FULVIO","145116K","ACADEMIE DE BILLARD DE CHASSIEU"]
["PETIT CHRISTOPHE","158165T","BILLARD STELLA THONON"]
["PETIT RENE","016075H","ACAD. DE BILLARD DE SAINT-ETIENNE"]
["PEYRARD GUILLAUME","160249J","ACADEMIE DE BILLARD DE CHASSIEU"]
["PEYREAUD DENIS","163264L","BILLARD STELLA THONON"]
["PEYRET MARCEL","145225P","ACADEMIE ANNECIENNE DE BILLARD"]
["PFIRSCH MARTINE","160979C","ACADEMIE BILLARD OUEST LYONNAIS"]
["PHILIBERT GEORGES","138176M","BILLARD CLUB DE SAINT-GALMIER"]
["PHILIPPON FRANCOIS","146311J","CERCLE DES CHEFS D ATELIER"]
["PHONGSY PHOXAY","153152V","BILLARD CLUB LYONNAIS 8 POOL"]
["PICANDET RENE","010991T","BILLARD CLUB ST ELOY"]
["PICKETT THOMAS","127269Z","ASSOCIATION DU LAKE PUB 74"]
["PILLOT VINCENT","145348I","BILLARD CLUB PONTOIS"]
["PINATEL FRANCOIS","163102K","CHARLEMAGNE SNOOKER CLUB"]
["PINET FRANCOIS","112468S","BILLARD CLUB ROMANAIS PEAGEOIS"]
["PLANCHET MARCEL","016019D","ASS. SPORTIVE MUNICIPALE ST ETIENNE"]
["PLAT DIDIER","163536G","BILLARD CLUB ROMANAIS PEAGEOIS"]
["PLAT PIERRICK","159584L","CLUB DE BILLARD MONTBRISONNAIS"]
["PLUVINAGE JEAN CLAUDE","015895J","BILLARD STELLA THONON"]
["POCHON JACQUES","145374I","BILLARD CLUB ROMANAIS PEAGEOIS"]
["POCINHO MARIO","106254S","BILLARD CLUB 109"]
["PODESZWA GHISLAIN","141348M","ACADEMIE BILLARD OUEST LYONNAIS"]
["POGGI GERARD","140818C","BILLARD CLUB ROMANAIS PEAGEOIS"]
["POIROT THOMAS","153780C","BILLARD CLUB ROMANAIS PEAGEOIS"]
["POIX JEAN LUDOVIC","100936E","BILLARD CLUB PONTOIS"]
["POMMIER LUDOVIC","154624V","ACADEMIE DE BILLARD DE CHASSIEU"]
["PONCET FRANCIS","015119N","BILLARD CLUB PONTOIS"]
["PONCET ROBERT","162964K","SAINT CHAMOND BILLARD CLUB"]
["PONTONNIER ANNIE","161322A","ACADEMIE ANNECIENNE DE BILLARD"]
["PONTONNIER REMY","143194M","ACADEMIE ANNECIENNE DE BILLARD"]
["PONTRUCHER PIERRE RICHARD","011061L","B.S.CLERMONTOIS"]
["PORTES BERNARD","146437F","CLUB DE BILLARD MONTBRISONNAIS"]
["PORTUGUES RICHARD","132949L","ACADEMIE DE BILLARD DE CHASSIEU"]
["POTIQUET SEBASTIEN","131278E","BILLARD CLUB DE BOURG EN BRESSE"]
["POULALIER PAUL","117801V","LE TAPIS VERT ROANNAIS"]
["POULY ANTOINE","146252C","CLUB CHAMBERIEN DE BILLARD"]
["POUPON MICHEL","112505D","ACADEMIE ANNECIENNE DE BILLARD"]
["POUZET ERIC","146189R","ACAD. DE BILLARD DE SAINT-ETIENNE"]
["POZZANI CEDRIC","130058G","BILLARD CLUB AIXOIS"]
["PRAL LAURENT","101033X","BLACKBALL BILLARD CLUB BESAYES 26"]
["PRETAT MICHEL","121521X","AMIC.SPOR.MONTMARAULTOISE BILLARD"]
["PREVIATI GUY","145115J","ACADEMIE DE BILLARD DE CHASSIEU"]
["PREVOST PATRICK","163244P","AMIC.SPOR.MONTMARAULTOISE BILLARD"]
["PREYNAT MAURICE","016498O","ACAD. DE BILLARD DE SAINT-ETIENNE"]
["PREZ OLIVIER","161423K","ASSOCIATION DU LAKE PUB 74"]
["PRUVOST JEAN LOUIS","015944G","CLUB OMNISPORTS DE SAINT FONS"]
["QUENOT PATRICK","154625W","ACADEMIE DE BILLARD DE CHASSIEU"]
["RACHON CHRISTIAN","153571A","VALENCE BILLARD CLUB"]
["RAMBEAU PHILIPPE","163269R","ACAD. DE BILLARD DE SAINT-ETIENNE"]
["RAMOND VANESSA","159822V","BIG BEN BLACKBALL"]
["RANCHON BERNARD","140565J","ASS. SPORTIVE MUNICIPALE ST ETIENNE"]
["RANCHON JEAN FRANCOIS","140564I","ASS. SPORTIVE MUNICIPALE ST ETIENNE"]
["RASCLE PIERRE","130075X","ACAD. DE BILLARD DE SAINT-ETIENNE"]
["RAY VINCENT","150948Z","BILLARD CLUB DE CLARAFOND ARCINE"]
["RAYMOND DENIS","130103Z","BILLARD CLUB DE GAILLARD"]
["RAYMOND SERGE","129888S","ACADEMIE DE BILLARD DE HAUTE LOIRE"]
["REBBOH LOUIS","149786L","ACAD. DE BILLARD DE SAINT-ETIENNE"]
["REDON VALERIE","152167Z","NIGHT BILLARD CLUB"]
["REFASSI ABDELGHANI","153783F","BILLARD CLUB ROMANAIS PEAGEOIS"]
["REIS COELHO FERNANDO","107514E","B.S.CLERMONTOIS"]
["REMISE PIERRE","100917L","ACADEMIE ANNECIENNE DE BILLARD"]
["RENAUT DIDIER","132958U","CLUB OMNISPORTS DE SAINT FONS"]
["RENNESSON RICHARD","129062Y","BILLARD CLUB ROMANAIS PEAGEOIS"]
["REVERCHON BERNARD","158193Z","CLUB CHAMBERIEN DE BILLARD"]
["REYMOND PIERRE","145618S","CLUB CHAMBERIEN DE BILLARD"]
["RIBES MAURICE","016475R","AMICALE BILLARD CLUB DE DAVEZIEUX"]
["RICHET MORGAN","159121H","BIG BEN BLACKBALL"]
["RICHIER ROGER","155134Z","SAINT CHAMOND BILLARD CLUB"]
["RIGAL YOHAN","162959E","BILLARD CLUB ISSOIRE"]
["RIGAUD KEVIN","144942S","BILLARD CLUB ST ELOY"]
["RIMLINGER MARC","107702K","BILLARD CLUB 109"]
["RIONDEL RENE","015879T","BILLARD CLUB GRENOBLOIS"]
["RIVOLIER EMILE","156431J","LE TAPIS VERT ROANNAIS"]
["ROBERT DENIS","124571F","ACADEMIE DE BILLARD DE HAUTE LOIRE"]
["ROBERT HENRY","163038Q","B.S.CLERMONTOIS"]
["ROBERTON PIERRE","016202E","GROUPE SPORTIF LUGDUNUM"]
["ROBEZ FLORENT","140694I","NIGHT BILLARD CLUB"]
["ROCHE GUY","107357D","AMICALE BILLARD CLUB DE DAVEZIEUX"]
["RODDIER PATRICK","121509L","B.S.CLERMONTOIS"]
["RODRIGUEZ STEPHANIE","122802E","BILLARD CLUB 109"]
["ROESCH PHILIPPE","011005H","BILLARD CLUB MONTLUCONNAIS"]
["ROFFAT PASCAL","163163B","CERCLE DES CHEFS D ATELIER"]
["ROLHION DANIEL","119753X","ACADEMIE DE BILLARD DE HAUTE LOIRE"]
["ROPARS PATRICK","127378E","A.B. DE BOURGOIN-JALLIEU"]
["ROQUES ALAIN","132526E","ACADEMIE BILLARD OUEST LYONNAIS"]
["ROSENBERGER MAIA","160186Q","CERCLE DES CHEFS D ATELIER"]
["ROUGET DANIEL","160698X","ACADEMIE DE BILLARD DE LA VALSERINE"]
["ROURE CEDRIC","151374M","CERCLE DES CHEFS D ATELIER"]
["ROUSSEL CHRISTOPHE","011085J","BILLARD CLUB MONTLUCONNAIS"]
["ROUSSEL CHRISTOPHE","142699L","BILLARD CLUB DE VILLEFRANCHE"]
["ROUSSELOT JEAN MARC","155685Y","ACADEMIE ANNECIENNE DE BILLARD"]
["ROUX ISABELLE","161723L","ACADEMIE ANNECIENNE DE BILLARD"]
["ROUX JULIEN","100942K","BILLARD CLUB 109"]
["ROZIER MYRIAM","156252P","NIGHT BILLARD CLUB"]
["RUFFET FREDERIC","157789K","B.S.CLERMONTOIS"]
["RUZ SEBASTIEN","114964S","Licenciés indépendants 69"]
["SABOT MICHAEL","016301Z","CLUB DE BILLARD MONTBRISONNAIS"]
["SABY FREDERIC","119751V","BILLARD CLUB DE GAILLARD"]
["SACHOT CYRIL","121104W","ASSOCIATION DU LAKE PUB 74"]
["SAGNES JOSE","159349F","BIG BEN BLACKBALL"]
["SAILLANT PHILIPPE","015832Y","CERCLE DES CHEFS D ATELIER"]
["SAMBEAT JEAN CLAUDE","122795X","CLUB CHAMBERIEN DE BILLARD"]
["SARIAN PIERRE","143028C","ACADEMIE DE BILLARD D AUBENAS"]
["SAULNIER MATHIEU","135591B","BIG BEN BLACKBALL"]
["SAUZON MARC","153597D","BILLARD CLUB ROMANAIS PEAGEOIS"]
["SAVOLDELLI RENE","015357R","BILLARD CLUB SAINT ROMANAIS"]
["SAVONET VALERIE","127551V","LES SQUALES"]
["SCANDELLA CEDRIC","153316Y","BILLARD CLUB LYONNAIS 8 POOL"]
["SCHAFFRAN CLAUDE","130083F","CERCLE DES CHEFS D ATELIER"]
["SCHAFFRAN SEBASTIEN","154058E","CERCLE DES CHEFS D ATELIER"]
["SCHMIT ALEXANDRE","139212I","CERCLE DES CHEFS D ATELIER"]
["SCHOCK ALAIN","163317T","CERCLE DES CHEFS D ATELIER"]
["SCHREIBER ROBERT","121543T","LE TAPIS VERT ROANNAIS"]
["SCILY GERARD","143525F","LE TAPIS VERT ROANNAIS"]
["SEAN YOU SENG","110146K","BILLARD CLUB LYONNAIS 8 POOL"]
["SENES A MARIO","145232W","ASSOCIATION DU LAKE PUB 74"]
["SIBELLIN GERARD","156280V","ACADEMIE DE BILLARD DE CHASSIEU"]
["SIERRA JUAN","155850C","ACADEMIE DE BILLARD DE CHASSIEU"]
["SILLANS PATRICK","149995N","CERCLE DES CHEFS D ATELIER"]
["SILVESTRE JEAN PAUL","163544Q","CLUB CHAMBERIEN DE BILLARD"]
["SIMON ROBERT","101011B","A.B. DE BOURGOIN-JALLIEU"]
["SINIGAGLIA JEAN PAUL","147486L","ACADEMIE DE BILLARD DE CHASSIEU"]
["SIVADE GERARD","011120S","AMIC.SPOR.MONTMARAULTOISE BILLARD"]
["SOCKEEL AURORE","157214K","BILLARD CLUB DE CLARAFOND ARCINE"]
["SOCKEEL MARIE PIERRE","159065X","BILLARD CLUB DE CLARAFOND ARCINE"]
["SOCKEEL YANNICK","159064W","BILLARD CLUB DE CLARAFOND ARCINE"]
["SOEHNLEN BRUNO","142707T","ACADEMIE ANNECIENNE DE BILLARD"]
["SOLA ALBERT","015966C","LE TAPIS VERT ROANNAIS"]
["SOMAVILLA CLAUDE","010980I","B.S.CLERMONTOIS"]
["SOMVEILLE DOMINIQUE","162609Z","CLUB CHAMBERIEN DE BILLARD"]
["SOPIC NICOLAS","128998M","NIGHT BILLARD CLUB"]
["SORU IGNACIO","153543V","CLUB CHAMBERIEN DE BILLARD"]
["SOULIER DANIEL","138317X","ACAD. DE BILLARD DE SAINT-ETIENNE"]
["SOURBE HENRI","016058Q","BILLARD STELLA THONON"]
["SPANGENBERG ALAIN","153073J","BILLARD CLUB GRENOBLOIS"]
["SUARD FRANCOISE","158168X","BILLARD STELLA THONON"]
["SUCHAUT ANTOINE","136039H","CLUB DE BILLARD MONTBRISONNAIS"]
["SUCHAUT THIERRY","138185V","SAINT CHAMOND BILLARD CLUB"]
["SUDARA BRUNO","156581X","CLUB CHAMBERIEN DE BILLARD"]
["SURY GABRIEL","153122M","CLUB DE BILLARD MONTBRISONNAIS"]
["TACHOIRE ADRIEN","126321N","ACADEMIE ANNECIENNE DE BILLARD"]
["TACHOIRE THIERRY","126326S","ACADEMIE ANNECIENNE DE BILLARD"]
["TAILLARDAT MICHEL","153322E","B.S.CLERMONTOIS"]
["TALLON JEAN CLAUDE","157200V","BILLARD CLUB MONTLUCONNAIS"]
["TARTARIN MICHEL","152852T","BILLARD CLUB DE GAILLARD"]
["TASCA ANDRE","101079R","BILLARD CLUB 109"]
["TASSET JEROME","156368Q","CLUB CHAMBERIEN DE BILLARD"]
["TATIER ERIC","015854U","VALENCE BILLARD CLUB"]
["TAVERNA DANIEL","117797R","BILLARD CLUB GRENOBLOIS"]
["TEBBANI AZIZ","128999N","NIGHT BILLARD CLUB"]
["TERNOY PASCAL","159649G","BILLARD CLUB GRENOBLOIS"]
["TERRADE MARC","100899T","BILLARD CLUB DE LA PLAINE DU FOREZ"]
["TESSIER AURELIEN","140833R","BILLARD CLUB 109"]
["TESTUD FABIAN","160782N","LES SQUALES"]
["TEYSSIER SERGE","132938A","SAINT CHAMOND BILLARD CLUB"]
["THANH TRAN","159858J","BILLARD CLUB ALBERTVILLE"]
["THIERION DIDIER","154976C","CERCLE DES CHEFS D ATELIER"]
["THINON JEROME","146111R","ACADEMIE DE BILLARD D AUBENAS"]
["THIOT PHILIPPE","157148N","BILLARD CLUB GRENOBLOIS"]
["THIVOLLE CECILE","162873L","BILLARD CLUB ROMANAIS PEAGEOIS"]
["THIVOLLE JEAN LOUIS","162874M","BILLARD CLUB ROMANAIS PEAGEOIS"]
["TISSOT ROGER","127380G","LE TAPIS VERT ROANNAIS"]
["TOURAINE PATRICE","162870H","BILLARD CLUB ROMANAIS PEAGEOIS"]
["TOURNU GERARD","153958W","ACADEMIE ANNECIENNE DE BILLARD"]
["TRABICHET CHRISTOPHE","152028Y","BILLARD CLUB 8 POOL EVIAN"]
["TRIPLET FREDERIC","162070N","CLUB CHAMBERIEN DE BILLARD"]
["TROQUET BERNARD","137228A","CLUB CHAMBERIEN DE BILLARD"]
["TROTEMANN PIERRE","158002R","VALENCE BILLARD CLUB"]
["TRUANT SEBASTIEN","152601W","CERCLE DES CHEFS D ATELIER"]
["TSAN SAP NHI","101056U","BILLARD CLUB LYONNAIS 8 POOL"]
["TURCAN FREDERIC","107037V","BILLARD CLUB ROMANAIS PEAGEOIS"]
["TURPIN MARC","124277X","BILLARD CLUB VICHY"]
["TUZZOLINO CLAUDE","016355B","CERCLE DES CHEFS D ATELIER"]
["URAY JIMMY","138326G","NIGHT BILLARD CLUB"]
["URICA GERARD","136036E","ACADEMIE ANNECIENNE DE BILLARD"]
["VACHER JEAN CLAUDE","160749C","BILLARD CLUB DE SAINT-GALMIER"]
["VACHERAND JEAN PIERRE","158166V","BILLARD STELLA THONON"]
["VACOSSIN NICOLAS","143251R","CLERMONT AUVERGNE BILLARD CLUB"]
["VACUS KEVIN","149397N","CLERMONT AUVERGNE BILLARD CLUB"]
["VADILLO CHRISTELLE","137570E","BLACKBALL BILLARD CLUB BESAYES 26"]
["VADILLO LAURENT","137569D","BLACKBALL BILLARD CLUB BESAYES 26"]
["VALENTIN JEAN MARC","145516U","ACAD. DE BILLARD DE SAINT-ETIENNE"]
["VALLAT DANIEL","016053L","ACAD. DE BILLARD DE SAINT-ETIENNE"]
["VALLET STEPHANE","151475X","BILLARD CLUB PONTOIS"]
["VALLIN GERARD","149954T","AMICALE BILLARD CLUB DE DAVEZIEUX"]
["VALLOT PATRICE","156333C","BILLARD CLUB DE BOURG EN BRESSE"]
["VALLOT ROMAIN","156334D","BILLARD CLUB DE BOURG EN BRESSE"]
["VAN DER HEYDEN JOHN","162871J","BILLARD CLUB ROMANAIS PEAGEOIS"]
["VAPILLON DANIEL","152287E","NIGHT BILLARD CLUB"]
["VARIGNIER JACQUES","149128W","ACADEMIE ANNECIENNE DE BILLARD"]
["VARLOT HENRI","015737H","CERCLE DES CHEFS D ATELIER"]
["VAUDAY PATRICK","022457T","BILLARD CLUB PONTOIS"]
["VAUTEY JOACHIM","161663W","CERCLE DES CHEFS D ATELIER"]
["VEILLON CORINNE","153999Q","SAINT CHAMOND BILLARD CLUB"]
["VENDITTELLI FABIO","100863J","ACADEMIE BILLARD OUEST LYONNAIS"]
["VENET TANGUY","163772N","CLUB CHAMBERIEN DE BILLARD"]
["VERDIER JACQUES","109048E","CERCLE DES CHEFS D ATELIER"]
["VERDIER NICOLAS","144938O","BILLARD CLUB ST ELOY"]
["VERDY MICHEL","129899D","B.S.CLERMONTOIS"]
["VERNEDAL LIONEL","100019X","BILLARD CLUB DE SAINT-GALMIER"]
["VERNET DANIEL","015919H","VALENCE BILLARD CLUB"]
["VERON PATRICK","151151V","BILLARD CLUB MOULINS"]
["VERPILLIER ROBERT","139036O","CLUB CHAMBERIEN DE BILLARD"]
["VERSCHOORIS BRUNO","016153H","BILLARD CLUB AIXOIS"]
["VERYSER CLAUDE","122481V","LA CARAMBOLE LISSILOISE"]
["VEYRON MYLENE","163773P","CLUB CHAMBERIEN DE BILLARD"]
["VEYRON THOMAS","163774Q","CLUB CHAMBERIEN DE BILLARD"]
["VIDAL DANIEL","133591D","ACADEMIE DE BILLARD DE CHASSIEU"]
["VIDON GERARD","015824Q","GROUPE SPORTIF LUGDUNUM"]
["VIGLIANO GERARD","141017T","BILLARD CLUB VICHY"]
["VIGUIER FRANCK","137422M","BILLARD CLUB VICHY"]
["VILA VERDE EZEQUIEL","157080P","CLERMONT AUVERGNE BILLARD CLUB"]
["VILETTE LAURENT","160111J","BILLARD CLUB MOULINS"]
["VILLECHENOUX JEAN PHILIPPE","117633J","CERCLE DES CHEFS D ATELIER"]
["VILLENEUVE PATRICK","141470E","BILLARD STELLA THONON"]
["VIMAL ALAIN","162918K","BILLARD CLUB DE VILLEFRANCHE"]
["VINAY MICHEL","112529B","BILLARD CLUB ROMANAIS PEAGEOIS"]
["VINCENT CHRISTIAN","134038I","BILLARD CLUB MOULINS"]
["VINCENT LAURENT","114033X","CHARLEMAGNE SNOOKER CLUB"]
["VINCENT PASCAL","145233X","ASSOCIATION DU LAKE PUB 74"]
["VINCENT RENE","016150E","LA CARAMBOLE LISSILOISE"]
["VINOT FRANCOIS","151045E","BILLARD CLUB GRENOBLOIS"]
["VIOSSAT DAVID","101045J","BILLARD CLUB ROMANAIS PEAGEOIS"]
["VIOT MICHEL","119773R","BILLARD CLUB ROMANAIS PEAGEOIS"]
["VIRGA JOEL","123367X","CLERMONT AUVERGNE BILLARD CLUB"]
["VIRICEL BERNARD","162965L","SAINT CHAMOND BILLARD CLUB"]
["VIRICEL BRUNO","150312H","BILLARD CLUB DE SAINT-GALMIER"]
["VIRTZ MARC","159885N","CHARLEMAGNE SNOOKER CLUB"]
["VOVELLE LOUIS","142217X","CERCLE DES CHEFS D ATELIER"]
["VRAUX JACQUES","133657R","BILLARD CLUB ROMANAIS PEAGEOIS"]
["VUARCHEX MICHEL","160256R","ACADEMIE ANNECIENNE DE BILLARD"]
["WEILL GILBERT","126051D","BILLARD CLUB ALBERTVILLE"]
["WILLIAMS ARIANE","155590V","BILLARD CLUB AIXOIS"]
["WOIGNIER ALBERT","148310G","BILLARD CLUB ROMANAIS PEAGEOIS"]
["ZAPOTOCKY JEAN","122472M","BILLARD CLUB DE SAINT-GALMIER"]
["ZITO GAETAN","128168O","GROUPE SPORTIF LUGDUNUM"]